public
Created

Python 3.3 failures

  • Download Gist
gistfile1.txt
1 2 3 4 5 6 7 8 9 10 11 12 13 14 15 16 17 18 19 20 21 22 23 24 25 26 27 28 29 30 31 32 33 34 35 36 37 38 39 40 41 42 43 44 45 46 47 48 49 50 51 52 53 54 55 56 57 58 59 60 61 62 63 64 65 66 67 68 69 70 71 72 73 74 75 76 77 78 79 80 81 82 83 84 85 86 87 88 89 90 91 92 93 94 95 96 97 98 99 100 101 102 103 104 105 106 107 108 109 110 111 112 113 114 115 116 117 118 119 120 121 122 123 124 125 126 127 128 129 130 131 132 133 134 135 136 137 138 139 140 141 142 143 144 145 146 147 148 149 150 151 152 153 154 155 156 157 158 159 160 161 162 163 164 165 166 167 168 169 170 171 172 173 174 175 176 177 178 179 180 181 182 183 184 185 186 187 188 189 190 191 192 193 194 195 196 197 198 199 200 201 202 203 204 205 206 207 208 209 210 211 212 213 214 215 216 217 218 219 220 221 222 223 224 225 226 227 228 229 230 231 232 233 234 235 236 237 238 239 240 241 242 243 244 245 246 247 248 249 250 251 252 253 254 255 256 257 258 259 260 261 262 263 264 265 266 267 268 269 270 271 272 273 274 275 276 277 278 279 280 281 282 283 284 285 286 287 288 289 290 291 292 293 294 295 296 297 298 299 300 301 302 303 304 305 306 307 308 309 310 311 312 313 314 315 316 317 318 319 320 321 322 323 324 325 326 327 328 329 330 331 332 333 334 335 336 337 338 339 340 341 342 343 344 345 346 347 348 349 350 351 352 353 354 355 356 357 358 359 360 361 362 363 364 365 366 367 368 369 370 371 372 373 374 375 376 377 378 379 380 381 382 383 384 385 386 387 388 389 390 391 392 393 394 395 396 397 398 399 400 401 402 403 404 405 406 407 408 409 410 411 412 413 414 415 416 417 418 419 420 421 422 423 424 425 426 427 428 429 430 431 432 433 434 435 436 437 438 439 440 441 442 443 444 445 446 447 448 449 450 451 452 453 454 455 456 457 458 459 460 461 462 463 464 465 466 467 468 469 470 471 472 473 474 475 476 477 478 479 480 481 482 483 484 485 486 487 488 489 490 491 492 493 494 495 496 497 498 499 500 501 502 503 504 505 506 507 508 509 510 511 512 513 514 515 516 517 518 519 520 521 522 523 524 525 526 527 528 529 530 531 532 533 534 535 536 537 538 539 540 541 542 543 544 545 546 547 548 549 550 551 552 553 554 555 556 557 558 559 560 561 562 563 564 565 566 567 568 569 570 571
$ python
Python 3.3.0b1 (default, Jul 27 2012, 10:55:25)
[GCC 4.6.3] on linux
Type "help", "copyright", "credits" or "license" for more information.
>>> import numpy
>>> numpy.test()
Running unit tests for numpy
NumPy version 1.8.0.dev-Unknown
NumPy is installed in /home/ondrej/py33/lib/python3.3/site-packages/numpy
Python version 3.3.0b1 (default, Jul 27 2012, 10:55:25) [GCC 4.6.3]
nose version 1.1.2
/home/ondrej/py33/lib/python3.3/site-packages/nose-1.1.2-py3.3.egg/nose/core.py:247: ResourceWarning: unclosed file <_io.TextIOWrapper name='/home/ondrej/py33/lib/python3.3/site-packages/nose-1.1.2-py3.3.egg/nose/usage.txt' mode='r' encoding='UTF-8'>
os.path.dirname(__file__), 'usage.txt'), 'r').read()
..............S.........S...............................................................................................................................................................................................................EE..................................................................................................................................................................................................................................................................................................................................................................................................................................................................................................................................................................................................................................................................................................................................................................................................................................................................................................................................................................................................................................................................................................................................................................................................................................................................................................K........................................E.E..............................................................................................................................................SSS................E..............................................................................................K....................................................................................................K......................K..............................................FFFFFFFFFFFFFFFFFF...........................EE.......E.............................................................................E......................................................................................................................F...............................E...................................................................................................................................................................................................................................................................................................................................................................................................................................................................................................................................................................................................................................E.........................................................................................................................................................................................................................................................................................................................................................................................................................................................................................................................................................................................................................K......................................E........
======================================================================
ERROR: Failure: ImportError (cannot import name Random)
----------------------------------------------------------------------
Traceback (most recent call last):
File "/home/ondrej/py33/lib/python3.3/site-packages/nose-1.1.2-py3.3.egg/nose/failure.py", line 37, in runTest
raise self.exc_class(self.exc_val).with_traceback(self.tb)
File "/home/ondrej/py33/lib/python3.3/site-packages/nose-1.1.2-py3.3.egg/nose/loader.py", line 390, in loadTestsFromName
addr.filename, addr.module)
File "/home/ondrej/py33/lib/python3.3/site-packages/nose-1.1.2-py3.3.egg/nose/importer.py", line 39, in importFromPath
return self.importFromDir(dir_path, fqname)
File "/home/ondrej/py33/lib/python3.3/site-packages/nose-1.1.2-py3.3.egg/nose/importer.py", line 86, in importFromDir
mod = load_module(part_fqname, fh, filename, desc)
File "/home/ondrej/repos/python-3.3/xx/lib/python3.3/imp.py", line 170, in load_module
return load_source(name, filename, file)
File "/home/ondrej/repos/python-3.3/xx/lib/python3.3/imp.py", line 119, in load_source
return _LoadSourceCompatibility(name, pathname, file).load_module(name)
File "<frozen importlib._bootstrap>", line 432, in _check_name_wrapper
File "<frozen importlib._bootstrap>", line 778, in load_module
File "<frozen importlib._bootstrap>", line 759, in load_module
File "<frozen importlib._bootstrap>", line 408, in module_for_loader_wrapper
File "<frozen importlib._bootstrap>", line 647, in _load_module
File "/home/ondrej/py33/lib/python3.3/site-packages/numpy/core/tests/test_memmap.py", line 1, in <module>
from tempfile import NamedTemporaryFile, mktemp
File "<frozen importlib._bootstrap>", line 1294, in _find_and_load
File "<frozen importlib._bootstrap>", line 1261, in _find_and_load_unlocked
File "<frozen importlib._bootstrap>", line 432, in _check_name_wrapper
File "<frozen importlib._bootstrap>", line 778, in load_module
File "<frozen importlib._bootstrap>", line 759, in load_module
File "<frozen importlib._bootstrap>", line 408, in module_for_loader_wrapper
File "<frozen importlib._bootstrap>", line 647, in _load_module
File "/home/ondrej/py33/lib/python3.3/tempfile.py", line 34, in <module>
from random import Random as _Random
ImportError: <unprintable ImportError object>
 
======================================================================
ERROR: Failure: ImportError (cannot import name Random)
----------------------------------------------------------------------
Traceback (most recent call last):
File "/home/ondrej/py33/lib/python3.3/site-packages/nose-1.1.2-py3.3.egg/nose/failure.py", line 37, in runTest
raise self.exc_class(self.exc_val).with_traceback(self.tb)
File "/home/ondrej/py33/lib/python3.3/site-packages/nose-1.1.2-py3.3.egg/nose/loader.py", line 390, in loadTestsFromName
addr.filename, addr.module)
File "/home/ondrej/py33/lib/python3.3/site-packages/nose-1.1.2-py3.3.egg/nose/importer.py", line 39, in importFromPath
return self.importFromDir(dir_path, fqname)
File "/home/ondrej/py33/lib/python3.3/site-packages/nose-1.1.2-py3.3.egg/nose/importer.py", line 86, in importFromDir
mod = load_module(part_fqname, fh, filename, desc)
File "/home/ondrej/repos/python-3.3/xx/lib/python3.3/imp.py", line 170, in load_module
return load_source(name, filename, file)
File "/home/ondrej/repos/python-3.3/xx/lib/python3.3/imp.py", line 119, in load_source
return _LoadSourceCompatibility(name, pathname, file).load_module(name)
File "<frozen importlib._bootstrap>", line 432, in _check_name_wrapper
File "<frozen importlib._bootstrap>", line 778, in load_module
File "<frozen importlib._bootstrap>", line 759, in load_module
File "<frozen importlib._bootstrap>", line 408, in module_for_loader_wrapper
File "<frozen importlib._bootstrap>", line 647, in _load_module
File "/home/ondrej/py33/lib/python3.3/site-packages/numpy/core/tests/test_multiarray.py", line 1, in <module>
import tempfile
File "<frozen importlib._bootstrap>", line 1294, in _find_and_load
File "<frozen importlib._bootstrap>", line 1261, in _find_and_load_unlocked
File "<frozen importlib._bootstrap>", line 432, in _check_name_wrapper
File "<frozen importlib._bootstrap>", line 778, in load_module
File "<frozen importlib._bootstrap>", line 759, in load_module
File "<frozen importlib._bootstrap>", line 408, in module_for_loader_wrapper
File "<frozen importlib._bootstrap>", line 647, in _load_module
File "/home/ondrej/py33/lib/python3.3/tempfile.py", line 34, in <module>
from random import Random as _Random
ImportError: <unprintable ImportError object>
 
======================================================================
ERROR: test_numeric.TestIsclose.test_ip_isclose_allclose([1e-08, 1, 1000020.0000000099], [0, nan, 1000000.0])
----------------------------------------------------------------------
Traceback (most recent call last):
File "/home/ondrej/py33/lib/python3.3/site-packages/nose-1.1.2-py3.3.egg/nose/case.py", line 198, in runTest
self.test(*self.arg)
File "/home/ondrej/py33/lib/python3.3/site-packages/numpy/core/tests/test_numeric.py", line 1245, in tst_isclose_allclose
assert_array_equal(isclose(x, y).all(), allclose(x, y), msg % (x, y))
File "/home/ondrej/py33/lib/python3.3/site-packages/numpy/core/numeric.py", line 1987, in allclose
return all(less_equal(abs(x-y), atol + rtol * abs(y)))
RuntimeWarning: invalid value encountered in absolute
 
======================================================================
ERROR: test_numeric.TestIsclose.test_ip_isclose_allclose(nan, [nan, nan, nan])
----------------------------------------------------------------------
Traceback (most recent call last):
File "/home/ondrej/py33/lib/python3.3/site-packages/nose-1.1.2-py3.3.egg/nose/case.py", line 198, in runTest
self.test(*self.arg)
File "/home/ondrej/py33/lib/python3.3/site-packages/numpy/core/tests/test_numeric.py", line 1245, in tst_isclose_allclose
assert_array_equal(isclose(x, y).all(), allclose(x, y), msg % (x, y))
File "/home/ondrej/py33/lib/python3.3/site-packages/numpy/core/numeric.py", line 1987, in allclose
return all(less_equal(abs(x-y), atol + rtol * abs(y)))
RuntimeWarning: invalid value encountered in absolute
 
======================================================================
ERROR: Failure: ImportError (cannot import name Random)
----------------------------------------------------------------------
Traceback (most recent call last):
File "/home/ondrej/py33/lib/python3.3/site-packages/nose-1.1.2-py3.3.egg/nose/failure.py", line 37, in runTest
raise self.exc_class(self.exc_val).with_traceback(self.tb)
File "/home/ondrej/py33/lib/python3.3/site-packages/nose-1.1.2-py3.3.egg/nose/loader.py", line 390, in loadTestsFromName
addr.filename, addr.module)
File "/home/ondrej/py33/lib/python3.3/site-packages/nose-1.1.2-py3.3.egg/nose/importer.py", line 39, in importFromPath
return self.importFromDir(dir_path, fqname)
File "/home/ondrej/py33/lib/python3.3/site-packages/nose-1.1.2-py3.3.egg/nose/importer.py", line 86, in importFromDir
mod = load_module(part_fqname, fh, filename, desc)
File "/home/ondrej/repos/python-3.3/xx/lib/python3.3/imp.py", line 170, in load_module
return load_source(name, filename, file)
File "/home/ondrej/repos/python-3.3/xx/lib/python3.3/imp.py", line 119, in load_source
return _LoadSourceCompatibility(name, pathname, file).load_module(name)
File "<frozen importlib._bootstrap>", line 432, in _check_name_wrapper
File "<frozen importlib._bootstrap>", line 778, in load_module
File "<frozen importlib._bootstrap>", line 759, in load_module
File "<frozen importlib._bootstrap>", line 408, in module_for_loader_wrapper
File "<frozen importlib._bootstrap>", line 647, in _load_module
File "/home/ondrej/py33/lib/python3.3/site-packages/numpy/core/tests/test_regression.py", line 7, in <module>
import tempfile
File "<frozen importlib._bootstrap>", line 1294, in _find_and_load
File "<frozen importlib._bootstrap>", line 1261, in _find_and_load_unlocked
File "<frozen importlib._bootstrap>", line 432, in _check_name_wrapper
File "<frozen importlib._bootstrap>", line 778, in load_module
File "<frozen importlib._bootstrap>", line 759, in load_module
File "<frozen importlib._bootstrap>", line 408, in module_for_loader_wrapper
File "<frozen importlib._bootstrap>", line 647, in _load_module
File "/home/ondrej/py33/lib/python3.3/tempfile.py", line 34, in <module>
from random import Random as _Random
ImportError: <unprintable ImportError object>
 
======================================================================
ERROR: Failure: ImportError (No module named 'distutils.errors')
----------------------------------------------------------------------
Traceback (most recent call last):
File "/home/ondrej/py33/lib/python3.3/site-packages/nose-1.1.2-py3.3.egg/nose/failure.py", line 37, in runTest
raise self.exc_class(self.exc_val).with_traceback(self.tb)
File "/home/ondrej/py33/lib/python3.3/site-packages/nose-1.1.2-py3.3.egg/nose/loader.py", line 390, in loadTestsFromName
addr.filename, addr.module)
File "/home/ondrej/py33/lib/python3.3/site-packages/nose-1.1.2-py3.3.egg/nose/importer.py", line 39, in importFromPath
return self.importFromDir(dir_path, fqname)
File "/home/ondrej/py33/lib/python3.3/site-packages/nose-1.1.2-py3.3.egg/nose/importer.py", line 86, in importFromDir
mod = load_module(part_fqname, fh, filename, desc)
File "/home/ondrej/repos/python-3.3/xx/lib/python3.3/imp.py", line 174, in load_module
return load_package(name, filename)
File "/home/ondrej/repos/python-3.3/xx/lib/python3.3/imp.py", line 150, in load_package
return _bootstrap.SourceFileLoader(name, path).load_module(name)
File "<frozen importlib._bootstrap>", line 432, in _check_name_wrapper
File "<frozen importlib._bootstrap>", line 778, in load_module
File "<frozen importlib._bootstrap>", line 759, in load_module
File "<frozen importlib._bootstrap>", line 408, in module_for_loader_wrapper
File "<frozen importlib._bootstrap>", line 647, in _load_module
File "/home/ondrej/py33/lib/python3.3/site-packages/numpy/distutils/__init__.py", line 22, in <module>
import numpy.distutils.ccompiler
File "<frozen importlib._bootstrap>", line 1294, in _find_and_load
File "<frozen importlib._bootstrap>", line 1261, in _find_and_load_unlocked
File "<frozen importlib._bootstrap>", line 432, in _check_name_wrapper
File "<frozen importlib._bootstrap>", line 778, in load_module
File "<frozen importlib._bootstrap>", line 759, in load_module
File "<frozen importlib._bootstrap>", line 408, in module_for_loader_wrapper
File "<frozen importlib._bootstrap>", line 647, in _load_module
File "/home/ondrej/py33/lib/python3.3/site-packages/numpy/distutils/ccompiler.py", line 7, in <module>
from distutils.ccompiler import *
File "<frozen importlib._bootstrap>", line 1294, in _find_and_load
File "<frozen importlib._bootstrap>", line 1245, in _find_and_load_unlocked
File "<frozen importlib._bootstrap>", line 1294, in _find_and_load
File "<frozen importlib._bootstrap>", line 1261, in _find_and_load_unlocked
File "<frozen importlib._bootstrap>", line 432, in _check_name_wrapper
File "<frozen importlib._bootstrap>", line 778, in load_module
File "<frozen importlib._bootstrap>", line 759, in load_module
File "<frozen importlib._bootstrap>", line 408, in module_for_loader_wrapper
File "<frozen importlib._bootstrap>", line 647, in _load_module
File "./distutils/__init__.py", line 23, in <module>
import numpy.distutils.unixccompiler
File "<frozen importlib._bootstrap>", line 1294, in _find_and_load
File "<frozen importlib._bootstrap>", line 1261, in _find_and_load_unlocked
File "<frozen importlib._bootstrap>", line 432, in _check_name_wrapper
File "<frozen importlib._bootstrap>", line 778, in load_module
File "<frozen importlib._bootstrap>", line 759, in load_module
File "<frozen importlib._bootstrap>", line 408, in module_for_loader_wrapper
File "<frozen importlib._bootstrap>", line 647, in _load_module
File "/home/ondrej/py33/lib/python3.3/site-packages/numpy/distutils/unixccompiler.py", line 7, in <module>
from distutils.errors import DistutilsExecError, CompileError
File "<frozen importlib._bootstrap>", line 1294, in _find_and_load
File "<frozen importlib._bootstrap>", line 1258, in _find_and_load_unlocked
ImportError: <unprintable ImportError object>
 
======================================================================
ERROR: Failure: ImportError (cannot import name diagnose)
----------------------------------------------------------------------
Traceback (most recent call last):
File "/home/ondrej/py33/lib/python3.3/site-packages/nose-1.1.2-py3.3.egg/nose/failure.py", line 37, in runTest
raise self.exc_class(self.exc_val).with_traceback(self.tb)
File "/home/ondrej/py33/lib/python3.3/site-packages/nose-1.1.2-py3.3.egg/nose/loader.py", line 390, in loadTestsFromName
addr.filename, addr.module)
File "/home/ondrej/py33/lib/python3.3/site-packages/nose-1.1.2-py3.3.egg/nose/importer.py", line 39, in importFromPath
return self.importFromDir(dir_path, fqname)
File "/home/ondrej/py33/lib/python3.3/site-packages/nose-1.1.2-py3.3.egg/nose/importer.py", line 86, in importFromDir
mod = load_module(part_fqname, fh, filename, desc)
File "/home/ondrej/repos/python-3.3/xx/lib/python3.3/imp.py", line 174, in load_module
return load_package(name, filename)
File "/home/ondrej/repos/python-3.3/xx/lib/python3.3/imp.py", line 150, in load_package
return _bootstrap.SourceFileLoader(name, path).load_module(name)
File "<frozen importlib._bootstrap>", line 432, in _check_name_wrapper
File "<frozen importlib._bootstrap>", line 778, in load_module
File "<frozen importlib._bootstrap>", line 759, in load_module
File "<frozen importlib._bootstrap>", line 408, in module_for_loader_wrapper
File "<frozen importlib._bootstrap>", line 647, in _load_module
File "/home/ondrej/py33/lib/python3.3/site-packages/numpy/f2py/__init__.py", line 11, in <module>
from . import diagnose
ImportError: <unprintable ImportError object>
 
======================================================================
ERROR: Failure: ImportError (cannot import name Random)
----------------------------------------------------------------------
Traceback (most recent call last):
File "/home/ondrej/py33/lib/python3.3/site-packages/nose-1.1.2-py3.3.egg/nose/failure.py", line 37, in runTest
raise self.exc_class(self.exc_val).with_traceback(self.tb)
File "/home/ondrej/py33/lib/python3.3/site-packages/nose-1.1.2-py3.3.egg/nose/loader.py", line 390, in loadTestsFromName
addr.filename, addr.module)
File "/home/ondrej/py33/lib/python3.3/site-packages/nose-1.1.2-py3.3.egg/nose/importer.py", line 39, in importFromPath
return self.importFromDir(dir_path, fqname)
File "/home/ondrej/py33/lib/python3.3/site-packages/nose-1.1.2-py3.3.egg/nose/importer.py", line 86, in importFromDir
mod = load_module(part_fqname, fh, filename, desc)
File "/home/ondrej/repos/python-3.3/xx/lib/python3.3/imp.py", line 170, in load_module
return load_source(name, filename, file)
File "/home/ondrej/repos/python-3.3/xx/lib/python3.3/imp.py", line 119, in load_source
return _LoadSourceCompatibility(name, pathname, file).load_module(name)
File "<frozen importlib._bootstrap>", line 432, in _check_name_wrapper
File "<frozen importlib._bootstrap>", line 778, in load_module
File "<frozen importlib._bootstrap>", line 759, in load_module
File "<frozen importlib._bootstrap>", line 408, in module_for_loader_wrapper
File "<frozen importlib._bootstrap>", line 647, in _load_module
File "/home/ondrej/py33/lib/python3.3/site-packages/numpy/lib/tests/test__datasource.py", line 2, in <module>
from tempfile import mkdtemp, mkstemp, NamedTemporaryFile
File "<frozen importlib._bootstrap>", line 1294, in _find_and_load
File "<frozen importlib._bootstrap>", line 1261, in _find_and_load_unlocked
File "<frozen importlib._bootstrap>", line 432, in _check_name_wrapper
File "<frozen importlib._bootstrap>", line 778, in load_module
File "<frozen importlib._bootstrap>", line 759, in load_module
File "<frozen importlib._bootstrap>", line 408, in module_for_loader_wrapper
File "<frozen importlib._bootstrap>", line 647, in _load_module
File "/home/ondrej/py33/lib/python3.3/tempfile.py", line 34, in <module>
from random import Random as _Random
ImportError: <unprintable ImportError object>
 
======================================================================
ERROR: Failure: ImportError (cannot import name Random)
----------------------------------------------------------------------
Traceback (most recent call last):
File "/home/ondrej/py33/lib/python3.3/site-packages/nose-1.1.2-py3.3.egg/nose/failure.py", line 37, in runTest
raise self.exc_class(self.exc_val).with_traceback(self.tb)
File "/home/ondrej/py33/lib/python3.3/site-packages/nose-1.1.2-py3.3.egg/nose/loader.py", line 390, in loadTestsFromName
addr.filename, addr.module)
File "/home/ondrej/py33/lib/python3.3/site-packages/nose-1.1.2-py3.3.egg/nose/importer.py", line 39, in importFromPath
return self.importFromDir(dir_path, fqname)
File "/home/ondrej/py33/lib/python3.3/site-packages/nose-1.1.2-py3.3.egg/nose/importer.py", line 86, in importFromDir
mod = load_module(part_fqname, fh, filename, desc)
File "/home/ondrej/repos/python-3.3/xx/lib/python3.3/imp.py", line 170, in load_module
return load_source(name, filename, file)
File "/home/ondrej/repos/python-3.3/xx/lib/python3.3/imp.py", line 119, in load_source
return _LoadSourceCompatibility(name, pathname, file).load_module(name)
File "<frozen importlib._bootstrap>", line 432, in _check_name_wrapper
File "<frozen importlib._bootstrap>", line 778, in load_module
File "<frozen importlib._bootstrap>", line 759, in load_module
File "<frozen importlib._bootstrap>", line 408, in module_for_loader_wrapper
File "<frozen importlib._bootstrap>", line 647, in _load_module
File "/home/ondrej/py33/lib/python3.3/site-packages/numpy/lib/tests/test_format.py", line 284, in <module>
import tempfile
File "<frozen importlib._bootstrap>", line 1294, in _find_and_load
File "<frozen importlib._bootstrap>", line 1261, in _find_and_load_unlocked
File "<frozen importlib._bootstrap>", line 432, in _check_name_wrapper
File "<frozen importlib._bootstrap>", line 778, in load_module
File "<frozen importlib._bootstrap>", line 759, in load_module
File "<frozen importlib._bootstrap>", line 408, in module_for_loader_wrapper
File "<frozen importlib._bootstrap>", line 647, in _load_module
File "/home/ondrej/py33/lib/python3.3/tempfile.py", line 34, in <module>
from random import Random as _Random
ImportError: <unprintable ImportError object>
 
======================================================================
ERROR: Failure: ImportError (cannot import name Random)
----------------------------------------------------------------------
Traceback (most recent call last):
File "/home/ondrej/py33/lib/python3.3/site-packages/nose-1.1.2-py3.3.egg/nose/failure.py", line 37, in runTest
raise self.exc_class(self.exc_val).with_traceback(self.tb)
File "/home/ondrej/py33/lib/python3.3/site-packages/nose-1.1.2-py3.3.egg/nose/loader.py", line 390, in loadTestsFromName
addr.filename, addr.module)
File "/home/ondrej/py33/lib/python3.3/site-packages/nose-1.1.2-py3.3.egg/nose/importer.py", line 39, in importFromPath
return self.importFromDir(dir_path, fqname)
File "/home/ondrej/py33/lib/python3.3/site-packages/nose-1.1.2-py3.3.egg/nose/importer.py", line 86, in importFromDir
mod = load_module(part_fqname, fh, filename, desc)
File "/home/ondrej/repos/python-3.3/xx/lib/python3.3/imp.py", line 170, in load_module
return load_source(name, filename, file)
File "/home/ondrej/repos/python-3.3/xx/lib/python3.3/imp.py", line 119, in load_source
return _LoadSourceCompatibility(name, pathname, file).load_module(name)
File "<frozen importlib._bootstrap>", line 432, in _check_name_wrapper
File "<frozen importlib._bootstrap>", line 778, in load_module
File "<frozen importlib._bootstrap>", line 759, in load_module
File "<frozen importlib._bootstrap>", line 408, in module_for_loader_wrapper
File "<frozen importlib._bootstrap>", line 647, in _load_module
File "/home/ondrej/py33/lib/python3.3/site-packages/numpy/lib/tests/test_io.py", line 5, in <module>
from tempfile import mkstemp, NamedTemporaryFile
File "<frozen importlib._bootstrap>", line 1294, in _find_and_load
File "<frozen importlib._bootstrap>", line 1261, in _find_and_load_unlocked
File "<frozen importlib._bootstrap>", line 432, in _check_name_wrapper
File "<frozen importlib._bootstrap>", line 778, in load_module
File "<frozen importlib._bootstrap>", line 759, in load_module
File "<frozen importlib._bootstrap>", line 408, in module_for_loader_wrapper
File "<frozen importlib._bootstrap>", line 647, in _load_module
File "/home/ondrej/py33/lib/python3.3/tempfile.py", line 34, in <module>
from random import Random as _Random
ImportError: <unprintable ImportError object>
 
======================================================================
ERROR: Tests reading from a text file.
----------------------------------------------------------------------
Traceback (most recent call last):
File "/home/ondrej/py33/lib/python3.3/site-packages/numpy/ma/tests/test_mrecords.py", line 485, in test_fromtextfile
import tempfile
File "<frozen importlib._bootstrap>", line 1294, in _find_and_load
File "<frozen importlib._bootstrap>", line 1261, in _find_and_load_unlocked
File "<frozen importlib._bootstrap>", line 432, in _check_name_wrapper
File "<frozen importlib._bootstrap>", line 778, in load_module
File "<frozen importlib._bootstrap>", line 759, in load_module
File "<frozen importlib._bootstrap>", line 408, in module_for_loader_wrapper
File "<frozen importlib._bootstrap>", line 647, in _load_module
File "/home/ondrej/py33/lib/python3.3/tempfile.py", line 34, in <module>
from random import Random as _Random
ImportError: cannot import name Random
 
======================================================================
ERROR: Failure: ImportError (No module named 'distutils.errors')
----------------------------------------------------------------------
Traceback (most recent call last):
File "/home/ondrej/py33/lib/python3.3/site-packages/nose-1.1.2-py3.3.egg/nose/failure.py", line 37, in runTest
raise self.exc_class(self.exc_val).with_traceback(self.tb)
File "/home/ondrej/py33/lib/python3.3/site-packages/nose-1.1.2-py3.3.egg/nose/loader.py", line 390, in loadTestsFromName
addr.filename, addr.module)
File "/home/ondrej/py33/lib/python3.3/site-packages/nose-1.1.2-py3.3.egg/nose/importer.py", line 39, in importFromPath
return self.importFromDir(dir_path, fqname)
File "/home/ondrej/py33/lib/python3.3/site-packages/nose-1.1.2-py3.3.egg/nose/importer.py", line 86, in importFromDir
mod = load_module(part_fqname, fh, filename, desc)
File "/home/ondrej/repos/python-3.3/xx/lib/python3.3/imp.py", line 170, in load_module
return load_source(name, filename, file)
File "/home/ondrej/repos/python-3.3/xx/lib/python3.3/imp.py", line 119, in load_source
return _LoadSourceCompatibility(name, pathname, file).load_module(name)
File "<frozen importlib._bootstrap>", line 432, in _check_name_wrapper
File "<frozen importlib._bootstrap>", line 778, in load_module
File "<frozen importlib._bootstrap>", line 759, in load_module
File "<frozen importlib._bootstrap>", line 408, in module_for_loader_wrapper
File "<frozen importlib._bootstrap>", line 647, in _load_module
File "/home/ondrej/py33/lib/python3.3/site-packages/numpy/tests/test_ctypeslib.py", line 5, in <module>
from numpy.distutils.misc_util import get_shared_lib_extension
File "<frozen importlib._bootstrap>", line 1294, in _find_and_load
File "<frozen importlib._bootstrap>", line 1245, in _find_and_load_unlocked
File "<frozen importlib._bootstrap>", line 1294, in _find_and_load
File "<frozen importlib._bootstrap>", line 1261, in _find_and_load_unlocked
File "<frozen importlib._bootstrap>", line 432, in _check_name_wrapper
File "<frozen importlib._bootstrap>", line 778, in load_module
File "<frozen importlib._bootstrap>", line 759, in load_module
File "<frozen importlib._bootstrap>", line 408, in module_for_loader_wrapper
File "<frozen importlib._bootstrap>", line 647, in _load_module
File "/home/ondrej/py33/lib/python3.3/site-packages/numpy/distutils/__init__.py", line 22, in <module>
import numpy.distutils.ccompiler
File "<frozen importlib._bootstrap>", line 1294, in _find_and_load
File "<frozen importlib._bootstrap>", line 1261, in _find_and_load_unlocked
File "<frozen importlib._bootstrap>", line 432, in _check_name_wrapper
File "<frozen importlib._bootstrap>", line 778, in load_module
File "<frozen importlib._bootstrap>", line 759, in load_module
File "<frozen importlib._bootstrap>", line 408, in module_for_loader_wrapper
File "<frozen importlib._bootstrap>", line 647, in _load_module
File "/home/ondrej/py33/lib/python3.3/site-packages/numpy/distutils/ccompiler.py", line 7, in <module>
from distutils.ccompiler import *
File "<frozen importlib._bootstrap>", line 1294, in _find_and_load
File "<frozen importlib._bootstrap>", line 1245, in _find_and_load_unlocked
File "<frozen importlib._bootstrap>", line 1294, in _find_and_load
File "<frozen importlib._bootstrap>", line 1261, in _find_and_load_unlocked
File "<frozen importlib._bootstrap>", line 432, in _check_name_wrapper
File "<frozen importlib._bootstrap>", line 778, in load_module
File "<frozen importlib._bootstrap>", line 759, in load_module
File "<frozen importlib._bootstrap>", line 408, in module_for_loader_wrapper
File "<frozen importlib._bootstrap>", line 647, in _load_module
File "./distutils/__init__.py", line 23, in <module>
import numpy.distutils.unixccompiler
File "<frozen importlib._bootstrap>", line 1294, in _find_and_load
File "<frozen importlib._bootstrap>", line 1261, in _find_and_load_unlocked
File "<frozen importlib._bootstrap>", line 432, in _check_name_wrapper
File "<frozen importlib._bootstrap>", line 778, in load_module
File "<frozen importlib._bootstrap>", line 759, in load_module
File "<frozen importlib._bootstrap>", line 408, in module_for_loader_wrapper
File "<frozen importlib._bootstrap>", line 647, in _load_module
File "/home/ondrej/py33/lib/python3.3/site-packages/numpy/distutils/unixccompiler.py", line 7, in <module>
from distutils.errors import DistutilsExecError, CompileError
File "<frozen importlib._bootstrap>", line 1294, in _find_and_load
File "<frozen importlib._bootstrap>", line 1258, in _find_and_load_unlocked
ImportError: <unprintable ImportError object>
 
======================================================================
FAIL: Check byteorder of 0-dimensional objects
----------------------------------------------------------------------
Traceback (most recent call last):
File "/home/ondrej/py33/lib/python3.3/site-packages/numpy/core/tests/test_unicode.py", line 277, in test_values0D
self.assertTrue(ua[()] != ua2[()])
AssertionError: False is not true
 
======================================================================
FAIL: Check byteorder of multi-dimensional objects
----------------------------------------------------------------------
Traceback (most recent call last):
File "/home/ondrej/py33/lib/python3.3/site-packages/numpy/core/tests/test_unicode.py", line 297, in test_valuesMD
self.assertTrue(ua[0,0,0] != ua2[0,0,0])
AssertionError: False is not true
 
======================================================================
FAIL: Check byteorder of single-dimensional objects
----------------------------------------------------------------------
Traceback (most recent call last):
File "/home/ondrej/py33/lib/python3.3/site-packages/numpy/core/tests/test_unicode.py", line 286, in test_valuesSD
self.assertTrue(ua[0] != ua2[0])
AssertionError: False is not true
 
======================================================================
FAIL: Check byteorder of 0-dimensional objects
----------------------------------------------------------------------
Traceback (most recent call last):
File "/home/ondrej/py33/lib/python3.3/site-packages/numpy/core/tests/test_unicode.py", line 277, in test_values0D
self.assertTrue(ua[()] != ua2[()])
AssertionError: False is not true
 
======================================================================
FAIL: Check byteorder of multi-dimensional objects
----------------------------------------------------------------------
Traceback (most recent call last):
File "/home/ondrej/py33/lib/python3.3/site-packages/numpy/core/tests/test_unicode.py", line 297, in test_valuesMD
self.assertTrue(ua[0,0,0] != ua2[0,0,0])
AssertionError: False is not true
 
======================================================================
FAIL: Check byteorder of single-dimensional objects
----------------------------------------------------------------------
Traceback (most recent call last):
File "/home/ondrej/py33/lib/python3.3/site-packages/numpy/core/tests/test_unicode.py", line 286, in test_valuesSD
self.assertTrue(ua[0] != ua2[0])
AssertionError: False is not true
 
======================================================================
FAIL: Check byteorder of 0-dimensional objects
----------------------------------------------------------------------
Traceback (most recent call last):
File "/home/ondrej/py33/lib/python3.3/site-packages/numpy/core/tests/test_unicode.py", line 277, in test_values0D
self.assertTrue(ua[()] != ua2[()])
AssertionError: False is not true
 
======================================================================
FAIL: Check byteorder of multi-dimensional objects
----------------------------------------------------------------------
Traceback (most recent call last):
File "/home/ondrej/py33/lib/python3.3/site-packages/numpy/core/tests/test_unicode.py", line 297, in test_valuesMD
self.assertTrue(ua[0,0,0] != ua2[0,0,0])
AssertionError: False is not true
 
======================================================================
FAIL: Check byteorder of single-dimensional objects
----------------------------------------------------------------------
Traceback (most recent call last):
File "/home/ondrej/py33/lib/python3.3/site-packages/numpy/core/tests/test_unicode.py", line 286, in test_valuesSD
self.assertTrue(ua[0] != ua2[0])
AssertionError: False is not true
 
======================================================================
FAIL: Check byteorder of 0-dimensional objects
----------------------------------------------------------------------
Traceback (most recent call last):
File "/home/ondrej/py33/lib/python3.3/site-packages/numpy/core/tests/test_unicode.py", line 277, in test_values0D
self.assertTrue(ua[()] != ua2[()])
AssertionError: False is not true
 
======================================================================
FAIL: Check byteorder of multi-dimensional objects
----------------------------------------------------------------------
Traceback (most recent call last):
File "/home/ondrej/py33/lib/python3.3/site-packages/numpy/core/tests/test_unicode.py", line 297, in test_valuesMD
self.assertTrue(ua[0,0,0] != ua2[0,0,0])
AssertionError: False is not true
 
======================================================================
FAIL: Check byteorder of single-dimensional objects
----------------------------------------------------------------------
Traceback (most recent call last):
File "/home/ondrej/py33/lib/python3.3/site-packages/numpy/core/tests/test_unicode.py", line 286, in test_valuesSD
self.assertTrue(ua[0] != ua2[0])
AssertionError: False is not true
 
======================================================================
FAIL: Check byteorder of 0-dimensional objects
----------------------------------------------------------------------
Traceback (most recent call last):
File "/home/ondrej/py33/lib/python3.3/site-packages/numpy/core/tests/test_unicode.py", line 277, in test_values0D
self.assertTrue(ua[()] != ua2[()])
AssertionError: False is not true
 
======================================================================
FAIL: Check byteorder of multi-dimensional objects
----------------------------------------------------------------------
Traceback (most recent call last):
File "/home/ondrej/py33/lib/python3.3/site-packages/numpy/core/tests/test_unicode.py", line 297, in test_valuesMD
self.assertTrue(ua[0,0,0] != ua2[0,0,0])
AssertionError: False is not true
 
======================================================================
FAIL: Check byteorder of single-dimensional objects
----------------------------------------------------------------------
Traceback (most recent call last):
File "/home/ondrej/py33/lib/python3.3/site-packages/numpy/core/tests/test_unicode.py", line 286, in test_valuesSD
self.assertTrue(ua[0] != ua2[0])
AssertionError: False is not true
 
======================================================================
FAIL: Check byteorder of 0-dimensional objects
----------------------------------------------------------------------
Traceback (most recent call last):
File "/home/ondrej/py33/lib/python3.3/site-packages/numpy/core/tests/test_unicode.py", line 277, in test_values0D
self.assertTrue(ua[()] != ua2[()])
AssertionError: False is not true
 
======================================================================
FAIL: Check byteorder of multi-dimensional objects
----------------------------------------------------------------------
Traceback (most recent call last):
File "/home/ondrej/py33/lib/python3.3/site-packages/numpy/core/tests/test_unicode.py", line 297, in test_valuesMD
self.assertTrue(ua[0,0,0] != ua2[0,0,0])
AssertionError: False is not true
 
======================================================================
FAIL: Check byteorder of single-dimensional objects
----------------------------------------------------------------------
Traceback (most recent call last):
File "/home/ondrej/py33/lib/python3.3/site-packages/numpy/core/tests/test_unicode.py", line 286, in test_valuesSD
self.assertTrue(ua[0] != ua2[0])
AssertionError: False is not true
 
======================================================================
FAIL: test_keywords_no_func_code (test_function_base.TestVectorize)
----------------------------------------------------------------------
Traceback (most recent call last):
File "/home/ondrej/py33/lib/python3.3/site-packages/numpy/lib/tests/test_function_base.py", line 412, in test_keywords_no_func_code
f = vectorize(random.randrange)
AttributeError: 'module' object has no attribute 'randrange'
 
During handling of the above exception, another exception occurred:
 
Traceback (most recent call last):
File "/home/ondrej/py33/lib/python3.3/site-packages/numpy/lib/tests/test_function_base.py", line 414, in test_keywords_no_func_code
raise AssertionError()
AssertionError
 
----------------------------------------------------------------------
Ran 3500 tests in 17.764s
 
FAILED (KNOWNFAIL=5, SKIP=5, errors=12, failures=19)
<nose.result.TextTestResult run=3500 errors=12 failures=19>

Please sign in to comment on this gist.

Something went wrong with that request. Please try again.