Skip to content

Instantly share code, notes, and snippets.

@Abhishekk360 Abhishekk360/build output XS Secret
Created Feb 9, 2016

Embed
What would you like to do?
Cleaning Solution: bug36183 (Debug)
Cleaning: bug36183 (Debug)
Build started 2/9/2016 4:14:18 PM.
__________________________________________________
Project "C:\Users\admin\Desktop\bug36183\bug36183\bug36183.csproj" (Clean target(s)):
Target CoreClean:
Deleting file "C:\Users\admin\Desktop\bug36183\bug36183\bin\Debug\bug36183.dll".
Deleting file "C:\Users\admin\Desktop\bug36183\bug36183\bin\Debug\bug36183.pdb".
Deleting file "C:\Users\admin\Desktop\bug36183\bug36183\bin\Debug\ClassLibrary1.dll".
Deleting file "C:\Users\admin\Desktop\bug36183\bug36183\bin\Debug\ClassLibrary1.pdb".
Deleting file "C:\Users\admin\Desktop\bug36183\bug36183\obj\Debug\bug36183.csprojResolveAssemblyReference.cache".
Deleting file "C:\Users\admin\Desktop\bug36183\bug36183\obj\Debug\bug36183.dll".
Deleting file "C:\Users\admin\Desktop\bug36183\bug36183\obj\Debug\bug36183.pdb".
Target _CleanMonoAndroidIntermediateDir:
Deleting file "obj\Debug\R.cs.flag".
Deleting file "obj\Debug\resourcepaths.cache".
Deleting file "obj\Debug\sdks.cache".
Deleting file "obj\Debug\build.props".
Deleting file "obj\Debug\libraryimports.cache".
Deleting file "obj\Debug\libraryprojectimports.cache".
Build succeeded.
0 Warning(s)
0 Error(s)
Time Elapsed 00:00:00.12
Cleaning: ClassLibrary1 (Debug)
Build started 2/9/2016 4:14:18 PM.
__________________________________________________
Project "C:\Users\admin\Desktop\bug36183\ClassLibrary1\ClassLibrary1.csproj" (Clean target(s)):
Target CoreClean:
Deleting file "C:\Users\admin\Desktop\bug36183\ClassLibrary1\bin\Debug\ClassLibrary1.dll".
Deleting file "C:\Users\admin\Desktop\bug36183\ClassLibrary1\bin\Debug\ClassLibrary1.pdb".
Deleting file "C:\Users\admin\Desktop\bug36183\ClassLibrary1\bin\Debug\ClassLibrary1.dll.CodeAnalysisLog.xml".
Deleting file "C:\Users\admin\Desktop\bug36183\ClassLibrary1\bin\Debug\ClassLibrary1.dll.lastcodeanalysissucceeded".
Deleting file "C:\Users\admin\Desktop\bug36183\ClassLibrary1\obj\Debug\ClassLibrary1.dll".
Deleting file "C:\Users\admin\Desktop\bug36183\ClassLibrary1\obj\Debug\ClassLibrary1.pdb".
Deleting file "C:\Users\admin\Desktop\bug36183\ClassLibrary1\obj\Debug\ClassLibrary1.csprojResolveAssemblyReference.cache".
Build succeeded.
0 Warning(s)
0 Error(s)
Time Elapsed 00:00:00.01
Building Solution: bug36183 (Debug)
Building: ClassLibrary1 (Debug)
Build started 2/9/2016 4:14:18 PM.
__________________________________________________
Project "C:\Users\admin\Desktop\bug36183\ClassLibrary1\ClassLibrary1.csproj" (Build target(s)):
Target GenerateTargetFrameworkMonikerAttribute:
Skipping target "GenerateTargetFrameworkMonikerAttribute" because all output files are up-to-date with respect to the input files.
Target CoreCompile:
C:\Program Files (x86)\MSBuild\12.0\bin\Csc.exe /noconfig /nowarn:1701,1702,2008 /nostdlib+ /errorreport:prompt /warn:4 /define:CODE_ANALYSIS;DEBUG;TRACE /errorendlocation /preferreduilang:en-US /highentropyva+ /reference:"C:\Program Files (x86)\Reference Assemblies\Microsoft\Framework\.NETFramework\v4.5.2\Microsoft.CSharp.dll" /reference:"C:\Program Files (x86)\Reference Assemblies\Microsoft\Framework\.NETFramework\v4.5.2\mscorlib.dll" /reference:"C:\Program Files (x86)\Reference Assemblies\Microsoft\Framework\.NETFramework\v4.5.2\System.Core.dll" /reference:"C:\Program Files (x86)\Reference Assemblies\Microsoft\Framework\.NETFramework\v4.5.2\System.Data.DataSetExtensions.dll" /reference:"C:\Program Files (x86)\Reference Assemblies\Microsoft\Framework\.NETFramework\v4.5.2\System.Data.dll" /reference:"C:\Program Files (x86)\Reference Assemblies\Microsoft\Framework\.NETFramework\v4.5.2\System.dll" /reference:"C:\Program Files (x86)\Reference Assemblies\Microsoft\Framework\.NETFramework\v4.5.2\System.Net.Http.dll" /reference:"C:\Program Files (x86)\Reference Assemblies\Microsoft\Framework\.NETFramework\v4.5.2\System.Xml.dll" /reference:"C:\Program Files (x86)\Reference Assemblies\Microsoft\Framework\.NETFramework\v4.5.2\System.Xml.Linq.dll" /debug+ /debug:full /filealign:512 /optimize- /out:obj\Debug\ClassLibrary1.dll /subsystemversion:6.00 /target:library /utf8output Class1.cs Properties\AssemblyInfo.cs "C:\Users\admin\AppData\Local\Temp\.NETFramework,Version=v4.5.2.AssemblyAttributes.cs" obj\Debug\\TemporaryGeneratedFile_E7A71F73-0F8D-4B9B-B56E-8E70B10BC5D3.cs obj\Debug\\TemporaryGeneratedFile_036C0B5B-1481-4323-8D20-8F5ADCB23D92.cs obj\Debug\\TemporaryGeneratedFile_5937a670-0e60-4077-877b-f7221da3dda1.cs
Target CopyFilesToOutputDirectory:
Copying file from "obj\Debug\ClassLibrary1.dll" to "bin\Debug\ClassLibrary1.dll".
ClassLibrary1 -> C:\Users\admin\Desktop\bug36183\ClassLibrary1\bin\Debug\ClassLibrary1.dll
Copying file from "obj\Debug\ClassLibrary1.pdb" to "bin\Debug\ClassLibrary1.pdb".
Target RunCodeAnalysis:
Running Code Analysis...
C:\Program Files (x86)\Microsoft Visual Studio 12.0\Team Tools\Static Analysis Tools\FxCop\FxCopCmd.exe /outputCulture:1033 /out:"bin\Debug\ClassLibrary1.dll.CodeAnalysisLog.xml" /file:"bin\Debug\ClassLibrary1.dll" /reference:"C:\Program Files (x86)\Reference Assemblies\Microsoft\Framework\.NETFramework\v4.5.2\Microsoft.CSharp.dll" /reference:"C:\Program Files (x86)\Reference Assemblies\Microsoft\Framework\.NETFramework\v4.5.2\mscorlib.dll" /reference:"C:\Program Files (x86)\Reference Assemblies\Microsoft\Framework\.NETFramework\v4.5.2\System.Core.dll" /reference:"C:\Program Files (x86)\Reference Assemblies\Microsoft\Framework\.NETFramework\v4.5.2\System.Data.DataSetExtensions.dll" /reference:"C:\Program Files (x86)\Reference Assemblies\Microsoft\Framework\.NETFramework\v4.5.2\System.Data.dll" /reference:"C:\Program Files (x86)\Reference Assemblies\Microsoft\Framework\.NETFramework\v4.5.2\System.dll" /reference:"C:\Program Files (x86)\Reference Assemblies\Microsoft\Framework\.NETFramework\v4.5.2\System.Net.Http.dll" /reference:"C:\Program Files (x86)\Reference Assemblies\Microsoft\Framework\.NETFramework\v4.5.2\System.Xml.dll" /reference:"C:\Program Files (x86)\Reference Assemblies\Microsoft\Framework\.NETFramework\v4.5.2\System.Xml.Linq.dll" /directory:"C:\Program Files (x86)\Reference Assemblies\Microsoft\Framework\.NETFramework\v4.5.2" /ruleSet:"=MinimumRecommendedRules.ruleset" /rulesetdirectory:"C:\Program Files (x86)\Microsoft Visual Studio 12.0\Team Tools\Static Analysis Tools\\Rule Sets" /rule:"-C:\Program Files (x86)\Microsoft Visual Studio 12.0\Team Tools\Static Analysis Tools\FxCop\\Rules" /searchgac /ignoreinvalidtargets /forceoutput /successfile /ignoregeneratedcode /saveMessagesToReport:Active /timeout:120
Code Analysis Complete -- 0 error(s), 0 warning(s)
Build succeeded.
0 Warning(s)
0 Error(s)
Time Elapsed 00:00:04.28
Building: bug36183 (Debug)
Build started 2/9/2016 4:14:22 PM.
__________________________________________________
Project "C:\Users\admin\Desktop\bug36183\bug36183\bug36183.csproj" (Build target(s)):
Target ResolveProjectReferences:
The target "_ConvertPdbFiles" listed in a BeforeTargets attribute at "C:\Program Files (x86)\MSBuild\12.0\Microsoft.Common.targets\ImportAfter\Xamarin.Common.targets (34,37)" does not exist in the project, and will be ignored.
The target "_CollectPdbFiles" listed in an AfterTargets attribute at "C:\Program Files (x86)\MSBuild\12.0\Microsoft.Common.targets\ImportAfter\Xamarin.Common.targets (34,70)" does not exist in the project, and will be ignored.
The target "_CollectMdbFiles" listed in a BeforeTargets attribute at "C:\Program Files (x86)\MSBuild\12.0\Microsoft.Common.targets\ImportAfter\Xamarin.Common.targets (40,38)" does not exist in the project, and will be ignored.
The target "_CopyMdbFiles" listed in an AfterTargets attribute at "C:\Program Files (x86)\MSBuild\12.0\Microsoft.Common.targets\ImportAfter\Xamarin.Common.targets (40,71)" does not exist in the project, and will be ignored.
__________________________________________________
Project "C:\Users\admin\Desktop\bug36183\bug36183\bug36183.csproj" is building "C:\Users\admin\Desktop\bug36183\ClassLibrary1\ClassLibrary1.csproj" (GetTargetPath target(s)):
__________________________________________________
Project "C:\Users\admin\Desktop\bug36183\bug36183\bug36183.csproj" is building "C:\Users\admin\Desktop\bug36183\ClassLibrary1\ClassLibrary1.csproj" (GetNativeManifest target(s)):
Target _GenerateAndroidAssetsDir:
Skipping target "_GenerateAndroidAssetsDir" because it has no outputs.
Target _ComputeAndroidResourcePaths:
Creating directory "obj\Debug\res\".
Target _ResolveMonoAndroidSdks:
MonoAndroid Tools: C:\Program Files (x86)\MSBuild\Xamarin\Android\
MonoAndroid Binaries: C:\Program Files (x86)\MSBuild\Xamarin\Android\
Android Platform API level: 23
TargetFrameworkVersion: v6.0
Android NDK: E:\AndroidNDK\android-ndk-r10d\
Android SDK: E:\android-sdk\
Android SDK Build Tools: E:\android-sdk\build-tools\23.0.2\
Java SDK: C:\Program Files (x86)\Java\jdk1.7.0_71\
Target _ValidateAndroidPackageProperties:
PackageName: bug36183.bug36183
Target _CreateAdditionalResourceCache:
Skipping target "_CreateAdditionalResourceCache" because it has no outputs.
Target _GenerateAndroidResourceDir:
Creating directory "C:\Users\admin\Desktop\bug36183\bug36183\obj\Debug\res\layout".
Copying file from "Resources\layout\Main.axml" to "C:\Users\admin\Desktop\bug36183\bug36183\obj\Debug\res\layout\main.xml".
Creating directory "C:\Users\admin\Desktop\bug36183\bug36183\obj\Debug\res\values".
Copying file from "Resources\values\Strings.xml" to "C:\Users\admin\Desktop\bug36183\bug36183\obj\Debug\res\values\strings.xml".
Creating directory "C:\Users\admin\Desktop\bug36183\bug36183\obj\Debug\res\drawable".
Copying file from "Resources\drawable\Icon.png" to "C:\Users\admin\Desktop\bug36183\bug36183\obj\Debug\res\drawable\icon.png".
Touching "C:\Users\admin\Desktop\bug36183\bug36183\obj\Debug\res\layout\main.xml".
Touching "C:\Users\admin\Desktop\bug36183\bug36183\obj\Debug\res\values\strings.xml".
Touching "C:\Users\admin\Desktop\bug36183\bug36183\obj\Debug\res\drawable\icon.png".
Target _UpdateAndroidResgen:
Processing: obj\Debug\res\layout\main.xml
Processing: obj\Debug\res\values\strings.xml
E:\android-sdk\build-tools\23.0.2\aapt.exe package -f -m -M C:\Users\admin\AppData\Local\Temp\usof2eyv.ir0\AndroidManifest.xml -J C:\Users\admin\AppData\Local\Temp\usof2eyv.ir0 --custom-package bug36183.bug36183 -F C:\Users\admin\AppData\Local\Temp\usof2eyv.ir0\resources.apk.bk -S obj\Debug\res -I E:\android-sdk\platforms\android-23\android.jar --auto-add-overlay
- Remapping resource: Drawable.icon -> drawable\Icon
- Not remapping resource: Id.MyButton
- Remapping resource: Layout.main -> layout\Main
- Not remapping resource: String.ApplicationName
- Not remapping resource: String.Hello
Target GenerateTargetFrameworkMonikerAttribute:
Skipping target "GenerateTargetFrameworkMonikerAttribute" because all output files are up-to-date with respect to the input files.
Target CoreCompile:
C:\Program Files (x86)\MSBuild\12.0\bin\Csc.exe /noconfig /nowarn:1701,1702,2008 /nostdlib+ /errorreport:prompt /warn:4 /define:CODE_ANALYSIS;DEBUG;TRACE;__XAMARIN_ANDROID_v1_0__;__MOBILE__;__ANDROID__;__ANDROID_1__;__ANDROID_2__;__ANDROID_3__;__ANDROID_4__;__ANDROID_5__;__ANDROID_6__;__ANDROID_7__;__ANDROID_8__;__ANDROID_9__;__ANDROID_10__;__ANDROID_11__;__ANDROID_12__;__ANDROID_13__;__ANDROID_14__;__ANDROID_15__;__ANDROID_16__;__ANDROID_17__;__ANDROID_18__;__ANDROID_19__;__ANDROID_20__;__ANDROID_21__;__ANDROID_22__;__ANDROID_23__ /errorendlocation /preferreduilang:en-US /reference:C:\Users\admin\Desktop\bug36183\ClassLibrary1\bin\Debug\ClassLibrary1.dll /reference:"C:\Program Files (x86)\Reference Assemblies\Microsoft\Framework\MonoAndroid\v6.0\Mono.Android.dll" /reference:"C:\Program Files (x86)\Reference Assemblies\Microsoft\Framework\MonoAndroid\v1.0\mscorlib.dll" /reference:"C:\Program Files (x86)\Reference Assemblies\Microsoft\Framework\MonoAndroid\v1.0\System.Core.dll" /reference:"C:\Program Files (x86)\Reference Assemblies\Microsoft\Framework\MonoAndroid\v1.0\System.dll" /reference:"C:\Program Files (x86)\Reference Assemblies\Microsoft\Framework\MonoAndroid\v1.0\System.Xml.dll" /reference:"C:\Program Files (x86)\Reference Assemblies\Microsoft\Framework\MonoAndroid\v1.0\System.Xml.Linq.dll" /debug+ /debug:full /filealign:512 /optimize- /out:obj\Debug\bug36183.dll /target:library /utf8output MainActivity.cs Resources\Resource.Designer.cs Properties\AssemblyInfo.cs "C:\Users\admin\AppData\Local\Temp\MonoAndroid,Version=v6.0.AssemblyAttributes.cs" obj\Debug\\TemporaryGeneratedFile_E7A71F73-0F8D-4B9B-B56E-8E70B10BC5D3.cs obj\Debug\\TemporaryGeneratedFile_036C0B5B-1481-4323-8D20-8F5ADCB23D92.cs obj\Debug\\TemporaryGeneratedFile_5937a670-0e60-4077-877b-f7221da3dda1.cs
Target _CopyFilesMarkedCopyLocal:
Copying file from "C:\Users\admin\Desktop\bug36183\ClassLibrary1\bin\Debug\ClassLibrary1.dll" to "bin\Debug\ClassLibrary1.dll".
Copying file from "C:\Users\admin\Desktop\bug36183\ClassLibrary1\bin\Debug\ClassLibrary1.pdb" to "bin\Debug\ClassLibrary1.pdb".
Target GetCopyToOutputDirectoryItems:
__________________________________________________
Project "C:\Users\admin\Desktop\bug36183\bug36183\bug36183.csproj" is building "C:\Users\admin\Desktop\bug36183\ClassLibrary1\ClassLibrary1.csproj" (GetCopyToOutputDirectoryItems target(s)):
Target CopyFilesToOutputDirectory:
Copying file from "obj\Debug\bug36183.dll" to "bin\Debug\bug36183.dll".
bug36183 -> C:\Users\admin\Desktop\bug36183\bug36183\bin\Debug\bug36183.dll
Copying file from "obj\Debug\bug36183.pdb" to "bin\Debug\bug36183.pdb".
Target CheckAbiAndMinSDK:
C:\Program Files (x86)\MSBuild\Xamarin\Android\Xamarin.Android.Analysis.targets(43,2): error MSB3733: Input file "obj\Debug\android\AndroidManifest.xml" cannot be opened. Could not find file 'C:\Users\admin\Desktop\bug36183\bug36183\obj\Debug\android\AndroidManifest.xml'.
Done building target "CheckAbiAndMinSDK" in project "bug36183.csproj" -- FAILED.
Done building project "bug36183.csproj" -- FAILED.
Build FAILED.
C:\Program Files (x86)\MSBuild\Xamarin\Android\Xamarin.Android.Analysis.targets(43,2): error MSB3733: Input file "obj\Debug\android\AndroidManifest.xml" cannot be opened. Could not find file 'C:\Users\admin\Desktop\bug36183\bug36183\obj\Debug\android\AndroidManifest.xml'.
0 Warning(s)
1 Error(s)
Time Elapsed 00:00:01.45
---------------------- Done ----------------------
Build: 1 error, 0 warnings
Sign up for free to join this conversation on GitHub. Already have an account? Sign in to comment
You can’t perform that action at this time.