Skip to content

Instantly share code, notes, and snippets.

Embed
What would you like to do?
Test failures, debian 6.02, node 0.7.4.-RC0
python tools/test.py --mode=release simple message
=== release test-child-process-internal ===
Path: simple/test-child-process-internal
assert.js:104
throw new assert.AssertionError({
^
AssertionError: "undefined" deepEqual {"cmd":"NODE_bar"}
at EventEmitter.<anonymous> (/home/avian/dev/nodebox/node-v0.7.4/test/simple/test-child-process-internal.js:56:12)
at EventEmitter.emit (events.js:88:20)
Command: out/Release/node /home/avian/dev/nodebox/node-v0.7.4/test/simple/test-child-process-internal.js
=== release test-script-new ===
Path: simple/test-script-new
DEBUG: run a string
DEBUG: script created
DEBUG: thrown error
DEBUG: undefined reference
DEBUG: error.message: foo is not defined
DEBUG: pass values in and out
DEBUG: call a function by reference
DEBUG: modify an object by reference
DEBUG: invalid this
node: ../src/node_object_wrap.h:52: static T* node::ObjectWrap::Unwrap(v8::Handle<v8::Object>) [with T = node::WrappedScript]: Assertion `handle->InternalFieldCount() > 0' failed.
Command: out/Release/node /home/avian/dev/nodebox/node-v0.7.4/test/simple/test-script-new.js
=== release test-debugger-repl ===
Path: simple/test-debugger-repl
Error: Timeout. Expected: /Can't request backtrace now/
Command: out/Release/node /home/avian/dev/nodebox/node-v0.7.4/test/simple/test-debugger-repl.js
=== release test-http-upgrade-server ===
Path: simple/test-http-upgrade-server
node.js:201
throw e; // process.nextTick error, or 'error' event on first tick
^
Error: listen EADDRINUSE
at errnoException (net.js:676:11)
at Array.0 (net.js:777:26)
at EventEmitter._tickCallback (node.js:192:41)
Command: out/Release/node /home/avian/dev/nodebox/node-v0.7.4/test/simple/test-http-upgrade-server.js
=== release test-http-url.parse-basic ===
Path: simple/test-http-url.parse-basic
node.js:201
throw e; // process.nextTick error, or 'error' event on first tick
^
Error: listen EADDRINUSE
at errnoException (net.js:676:11)
at Array.0 (net.js:777:26)
at EventEmitter._tickCallback (node.js:192:41)
Command: out/Release/node /home/avian/dev/nodebox/node-v0.7.4/test/simple/test-http-url.parse-basic.js
=== release test-http-head-request ===
Path: simple/test-http-head-request
node.js:201
throw e; // process.nextTick error, or 'error' event on first tick
^
Error: listen EADDRINUSE
at errnoException (net.js:676:11)
at Array.0 (net.js:777:26)
at EventEmitter._tickCallback (node.js:192:41)
Command: out/Release/node /home/avian/dev/nodebox/node-v0.7.4/test/simple/test-http-head-request.js
=== release test-http-server ===
Path: simple/test-http-server
node.js:201
throw e; // process.nextTick error, or 'error' event on first tick
^
Error: listen EADDRINUSE
at errnoException (net.js:676:11)
at Array.0 (net.js:777:26)
at EventEmitter._tickCallback (node.js:192:41)
Command: out/Release/node /home/avian/dev/nodebox/node-v0.7.4/test/simple/test-http-server.js
=== release test-tls-client-reject ===
Path: simple/test-tls-client-reject
node.js:201
throw e; // process.nextTick error, or 'error' event on first tick
^
Error: listen EADDRINUSE
at errnoException (net.js:676:11)
at Array.0 (net.js:777:26)
at EventEmitter._tickCallback (node.js:192:41)
Command: out/Release/node /home/avian/dev/nodebox/node-v0.7.4/test/simple/test-tls-client-reject.js
=== release test-debugger-repl-utf8 ===
Path: simple/test-debugger-repl-utf8
Error: Timeout. Expected: /Can't request backtrace now/
Command: out/Release/node /home/avian/dev/nodebox/node-v0.7.4/test/simple/test-debugger-repl-utf8.js
=== release test-https-eof-for-eom ===
Path: simple/test-https-eof-for-eom
node.js:201
throw e; // process.nextTick error, or 'error' event on first tick
^
Error: listen EADDRINUSE
at errnoException (net.js:676:11)
at Array.0 (net.js:777:26)
at EventEmitter._tickCallback (node.js:192:41)
Command: out/Release/node /home/avian/dev/nodebox/node-v0.7.4/test/simple/test-https-eof-for-eom.js
=== release test-http-head-response-has-no-body ===
Path: simple/test-http-head-response-has-no-body
node.js:201
throw e; // process.nextTick error, or 'error' event on first tick
^
Error: listen EADDRINUSE
at errnoException (net.js:676:11)
at Array.0 (net.js:777:26)
at EventEmitter._tickCallback (node.js:192:41)
Command: out/Release/node /home/avian/dev/nodebox/node-v0.7.4/test/simple/test-http-head-response-has-no-body.js
=== release test-http-client-race ===
Path: simple/test-http-client-race
node.js:201
throw e; // process.nextTick error, or 'error' event on first tick
^
Error: listen EADDRINUSE
at errnoException (net.js:676:11)
at Array.0 (net.js:777:26)
at EventEmitter._tickCallback (node.js:192:41)
Command: out/Release/node /home/avian/dev/nodebox/node-v0.7.4/test/simple/test-http-client-race.js
=== release test-http-url.parse-post ===
Path: simple/test-http-url.parse-post
node.js:201
throw e; // process.nextTick error, or 'error' event on first tick
^
Error: listen EADDRINUSE
at errnoException (net.js:676:11)
at Array.0 (net.js:777:26)
at EventEmitter._tickCallback (node.js:192:41)
Command: out/Release/node /home/avian/dev/nodebox/node-v0.7.4/test/simple/test-http-url.parse-post.js
=== release test-http-parser-free ===
Path: simple/test-http-parser-free
node.js:201
throw e; // process.nextTick error, or 'error' event on first tick
^
Error: listen EADDRINUSE
at errnoException (net.js:676:11)
at Array.0 (net.js:777:26)
at EventEmitter._tickCallback (node.js:192:41)
Command: out/Release/node /home/avian/dev/nodebox/node-v0.7.4/test/simple/test-http-parser-free.js
=== release test-net-bytes-stats ===
Path: simple/test-net-bytes-stats
node.js:201
throw e; // process.nextTick error, or 'error' event on first tick
^
Error: listen EADDRINUSE
at errnoException (net.js:676:11)
at Array.0 (net.js:777:26)
at EventEmitter._tickCallback (node.js:192:41)
Command: out/Release/node /home/avian/dev/nodebox/node-v0.7.4/test/simple/test-net-bytes-stats.js
=== release test-http-malformed-request ===
Path: simple/test-http-malformed-request
node.js:201
throw e; // process.nextTick error, or 'error' event on first tick
^
Error: listen EADDRINUSE
at errnoException (net.js:676:11)
at Array.0 (net.js:777:26)
at EventEmitter._tickCallback (node.js:192:41)
Command: out/Release/node /home/avian/dev/nodebox/node-v0.7.4/test/simple/test-http-malformed-request.js
=== release test-http-chunked ===
Path: simple/test-http-chunked
node.js:201
throw e; // process.nextTick error, or 'error' event on first tick
^
Error: listen EADDRINUSE
at errnoException (net.js:676:11)
at Array.0 (net.js:777:26)
at EventEmitter._tickCallback (node.js:192:41)
Command: out/Release/node /home/avian/dev/nodebox/node-v0.7.4/test/simple/test-http-chunked.js
=== release test-regress-GH-784 ===
Path: simple/test-regress-GH-784
Error making ping req: Error: Parse Error
Error making ping req: Error: Parse Error
making req
making req
afterPing. responses.length = 1
afterPing. responses.length = 2
node.js:201
throw e; // process.nextTick error, or 'error' event on first tick
^
AssertionError: false == true
at afterPing (/home/avian/dev/nodebox/node-v0.7.4/test/simple/test-regress-GH-784.js:74:14)
at ClientRequest.<anonymous> (/home/avian/dev/nodebox/node-v0.7.4/test/simple/test-regress-GH-784.js:135:5)
at ClientRequest.emit (events.js:67:17)
at Socket.<anonymous> (http.js:1193:11)
at Socket.emit (events.js:67:17)
at Array.1 (net.js:349:25)
at EventEmitter._tickCallback (node.js:192:41)
Command: out/Release/node /home/avian/dev/nodebox/node-v0.7.4/test/simple/test-regress-GH-784.js
=== release test-http-client-abort ===
Path: simple/test-http-client-abort
node.js:201
throw e; // process.nextTick error, or 'error' event on first tick
^
Error: listen EADDRINUSE
at errnoException (net.js:676:11)
at Array.0 (net.js:777:26)
at EventEmitter._tickCallback (node.js:192:41)
Command: out/Release/node /home/avian/dev/nodebox/node-v0.7.4/test/simple/test-http-client-abort.js
=== release test-http-abort-before-end ===
Path: simple/test-http-abort-before-end
node.js:201
throw e; // process.nextTick error, or 'error' event on first tick
^
Error: listen EADDRINUSE
at errnoException (net.js:676:11)
at Array.0 (net.js:777:26)
at EventEmitter._tickCallback (node.js:192:41)
Command: out/Release/node /home/avian/dev/nodebox/node-v0.7.4/test/simple/test-http-abort-before-end.js
=== release test-http-request-end ===
Path: simple/test-http-request-end
node.js:201
throw e; // process.nextTick error, or 'error' event on first tick
^
Error: listen EADDRINUSE
at errnoException (net.js:676:11)
at Array.0 (net.js:777:26)
at EventEmitter._tickCallback (node.js:192:41)
Command: out/Release/node /home/avian/dev/nodebox/node-v0.7.4/test/simple/test-http-request-end.js
=== release test-net-reconnect ===
Path: simple/test-net-reconnect
node.js:201
throw e; // process.nextTick error, or 'error' event on first tick
^
Error: listen EADDRINUSE
at errnoException (net.js:676:11)
at Array.0 (net.js:777:26)
at EventEmitter._tickCallback (node.js:192:41)
Command: out/Release/node /home/avian/dev/nodebox/node-v0.7.4/test/simple/test-net-reconnect.js
[01:33|% 100|+ 335|- 22]: Done
make: *** [test] Error 1
[avian@avianflu ~/dev/nodebox/node-v0.7.4]$ ps -ef | grep node
avian 22069 1 1 15:06 pts/0 00:00:00 /home/avian/dev/nodebox/node-v0.7.4/out/Release/node --debug-brk=12346 /home/avian/dev/nodebox/node-v0.7.4/test/fixtures/breakpoints_utf8.js
Sign up for free to join this conversation on GitHub. Already have an account? Sign in to comment
You can’t perform that action at this time.