Skip to content

Instantly share code, notes, and snippets.

Embed
What would you like to do?
INFO]
[INFO] --- process-exec-maven-plugin:0.9.2:start (start-swarm-lra-coordinator) @ lra-test ---
[INFO] Starting process: lra-coordinator-swarm
[INFO] ------------------------------------------------------------------------
[INFO] Reactor Summary:
[INFO]
[INFO] Narayana: all ...................................... SUCCESS [ 0.933 s]
[INFO] Narayana: common ................................... SUCCESS [ 0.381 s]
[INFO] Narayana: Test Utilities ........................... SUCCESS [ 0.601 s]
[INFO] Narayana: ext ...................................... SUCCESS [ 0.012 s]
[INFO] Narayana: Arjunacore ............................... SUCCESS [ 0.012 s]
[INFO] Narayana: ArjunaCore arjuna ........................ SUCCESS [ 0.186 s]
[INFO] Narayana: ArjunaCore txoj .......................... SUCCESS [ 0.054 s]
[INFO] Narayana: ArjunaCore arjunacore .................... SUCCESS [ 0.453 s]
[INFO] Narayana: ArjunaCore arjuna services ............... SUCCESS [ 0.017 s]
[INFO] Narayana: ArjunaJTA ................................ SUCCESS [ 0.012 s]
[INFO] Narayana: ArjunaJTA jta ............................ SUCCESS [ 0.127 s]
[INFO] Narayana: ArjunaJTA cdi ............................ SUCCESS [ 0.080 s]
[INFO] Narayana: ArjunaJTA jdbc ........................... SUCCESS [ 0.075 s]
[INFO] Narayana: Transaction SPI .......................... SUCCESS [ 0.036 s]
[INFO] Narayana: ArjunaJTA JMS ............................ SUCCESS [ 0.125 s]
[INFO] Narayana: ArjunaJTA narayana-jta ................... SUCCESS [ 0.283 s]
[INFO] Narayana: ArjunaJTS ................................ SUCCESS [ 0.017 s]
[INFO] Narayana: ArjunaJTS idl ............................ SUCCESS [ 0.017 s]
[INFO] Narayana: ArjunaJTS idl jacorb ..................... SUCCESS [ 0.291 s]
[INFO] Narayana: ArjunaJTS idl idlj ....................... SUCCESS [ 2.565 s]
[INFO] Narayana: ArjunaJTS orbportability ................. SUCCESS [ 0.090 s]
[INFO] Narayana: ArjunaJTS jts ............................ SUCCESS [ 0.177 s]
[INFO] Narayana: ArjunaJTS jtax ........................... SUCCESS [ 0.061 s]
[INFO] Narayana: ArjunaJTS integration .................... SUCCESS [ 0.055 s]
[INFO] Narayana: ArjuntaJTS narayana-jts-jacorb ........... SUCCESS [ 0.371 s]
[INFO] Narayana: ArjunaJTS narayana-jts-idlj .............. SUCCESS [ 0.423 s]
[INFO] Narayana: XTS ...................................... SUCCESS [ 0.008 s]
[INFO] Narayana: XTS byteman_support ...................... SUCCESS [ 0.063 s]
[INFO] Narayana: XTS WSAS ................................. SUCCESS [ 0.039 s]
[INFO] Narayana: XTS WSAS xts-test-servlet ................ SUCCESS [ 0.014 s]
[INFO] Narayana: XTS WS-C ................................. SUCCESS [ 0.692 s]
[INFO] Narayana: XTS WSCF ................................. SUCCESS [ 0.090 s]
[INFO] Narayana: XTS WS-T ................................. SUCCESS [ 0.456 s]
[INFO] Narayana: XTS WSTX ................................. SUCCESS [ 0.151 s]
[INFO] Narayana: XTS recovery ............................. SUCCESS [ 0.032 s]
[INFO] Narayana: XTS bridge ............................... SUCCESS [ 0.064 s]
[INFO] Narayana: XTS sar .................................. SUCCESS [ 0.026 s]
[INFO] Narayana: XTS jbossxts ............................. SUCCESS [ 0.362 s]
[INFO] Narayana: XTS localjunit ........................... SUCCESS [ 0.172 s]
[INFO] Narayana: XTS localjunit unit ...................... SUCCESS [ 0.015 s]
[INFO] Narayana: XTS Disabled Context Propagation tests ... SUCCESS [ 0.015 s]
[INFO] Narayana: XTS WSTX11-interop ....................... SUCCESS [ 0.104 s]
[INFO] Narayana: XTS WSTFSC07-interop ..................... SUCCESS [ 0.115 s]
[INFO] Narayana: XTS localjunit xtstest ................... SUCCESS [ 0.222 s]
[INFO] Narayana: XTS localjunit crash-recovery-tests ...... SUCCESS [ 0.052 s]
[INFO] Narayana: RESTful transactions ..................... SUCCESS [ 0.007 s]
[INFO] Narayana: restat ................................... SUCCESS [ 0.006 s]
[INFO] Narayana: restat util .............................. SUCCESS [ 0.098 s]
[INFO] Narayana: restat tx ................................ SUCCESS [ 0.173 s]
[INFO] Narayana: restat webservice ........................ SUCCESS [ 0.069 s]
[INFO] Narayana: restat integration ....................... SUCCESS [ 0.066 s]
[INFO] Narayana: Bridge between REST-AT and JTA ........... SUCCESS [ 0.246 s]
[INFO] LRA Parent ......................................... SUCCESS [ 0.119 s]
[INFO] LRA Annotations .................................... SUCCESS [ 0.561 s]
[INFO] LRA Client ......................................... SUCCESS [ 0.194 s]
[INFO] LRA Proxy Parent ................................... SUCCESS [ 0.054 s]
[INFO] LRA Proxy API ...................................... SUCCESS [ 0.508 s]
[INFO] LRA Proxy Test ..................................... SUCCESS [ 7.027 s]
[INFO] LRA Participant Filters ............................ SUCCESS [ 0.221 s]
[INFO] LRA Coordinator .................................... SUCCESS [ 8.229 s]
[INFO] LRA Test ........................................... FAILURE [ 37.916 s]
[INFO] SRA PoC ............................................ SKIPPED
[INFO] Narayana: txbridge ................................. SKIPPED
[INFO] Narayana: STM ...................................... SKIPPED
[INFO] Narayana: txframework .............................. SKIPPED
[INFO] Narayana: compensations ............................ SKIPPED
[INFO] Narayana: OSGi Transaction Service ................. SKIPPED
[INFO] Narayana: OSGi Transaction Service Bundles - JTA ... SKIPPED
[INFO] Narayana: Tomcat integration ....................... SKIPPED
[INFO] Narayana: Tomcat JTA integration ................... SKIPPED
[INFO] Narayana: narayana-full ............................ SKIPPED
[INFO] Narayana: JaCoCo Documentation ..................... SKIPPED
[INFO] Narayana: STM vertex ............................... SKIPPED
[INFO] Project - mod-stm .................................. SKIPPED
[INFO] stm-vertex-shared .................................. SKIPPED
[INFO] ------------------------------------------------------------------------
[INFO] BUILD FAILURE
[INFO] ------------------------------------------------------------------------
[INFO] Total time: 01:06 min
[INFO] Finished at: 2018-02-13T17:45:02+01:00
[INFO] Final Memory: 121M/2278M
[INFO] ------------------------------------------------------------------------
[ERROR] Failed to execute goal org.honton.chas:process-exec-maven-plugin:0.9.2:start (start-swarm-lra-coordinator) on project lra-test: Execution start-swarm-lra-coordinator of goal org.honton.chas:process-exec-maven-plugin:0.9.2:start failed: Process was not healthy even after 30 seconds -> [Help 1]
[ERROR]
Sign up for free to join this conversation on GitHub. Already have an account? Sign in to comment
You can’t perform that action at this time.