Skip to content

Instantly share code, notes, and snippets.

@Pistos Pistos/build.log Secret
Created Sep 10, 2018

Embed
What would you like to do?
Can't emerge dev-util/cargo
* Package: dev-util/cargo-0.29.0
* Repository: gentoo
* Maintainer: rust@gentoo.org
* USE: abi_x86_64 amd64 elibc_glibc kernel_linux userland_GNU
* FEATURES: preserve-libs sandbox userpriv usersandbox
>>> Unpacking source...
>>> Unpacking cargo-0.29.0.tar.gz to /var/tmp/portage/dev-util/cargo-0.29.0/work
* Loading aho-corasick-0.6.6.crate into Cargo registry ...
[ ok ]
* Loading ansi_term-0.11.0.crate into Cargo registry ...
[ ok ]
* Loading atty-0.2.11.crate into Cargo registry ...
[ ok ]
* Loading backtrace-0.3.9.crate into Cargo registry ...
[ ok ]
* Loading backtrace-sys-0.1.23.crate into Cargo registry ...
[ ok ]
* Loading bitflags-1.0.3.crate into Cargo registry ...
[ ok ]
* Loading bufstream-0.1.3.crate into Cargo registry ...
[ ok ]
* Loading cargo-0.29.0.crate into Cargo registry ...
[ ok ]
* Loading cc-1.0.18.crate into Cargo registry ...
[ ok ]
* Loading cfg-if-0.1.4.crate into Cargo registry ...
[ ok ]
* Loading clap-2.32.0.crate into Cargo registry ...
[ ok ]
* Loading cloudabi-0.0.3.crate into Cargo registry ...
[ ok ]
* Loading cmake-0.1.31.crate into Cargo registry ...
[ ok ]
* Loading commoncrypto-0.2.0.crate into Cargo registry ...
[ ok ]
* Loading commoncrypto-sys-0.2.0.crate into Cargo registry ...
[ ok ]
* Loading core-foundation-0.6.1.crate into Cargo registry ...
[ ok ]
* Loading core-foundation-sys-0.6.1.crate into Cargo registry ...
[ ok ]
* Loading crates-io-0.17.0.crate into Cargo registry ...
[ ok ]
* Loading crossbeam-0.3.2.crate into Cargo registry ...
[ ok ]
* Loading crypto-hash-0.3.1.crate into Cargo registry ...
[ ok ]
* Loading curl-0.4.14.crate into Cargo registry ...
[ ok ]
* Loading curl-sys-0.4.8.crate into Cargo registry ...
[ ok ]
* Loading dtoa-0.4.3.crate into Cargo registry ...
[ ok ]
* Loading env_logger-0.5.11.crate into Cargo registry ...
[ ok ]
* Loading failure-0.1.2.crate into Cargo registry ...
[ ok ]
* Loading failure_derive-0.1.2.crate into Cargo registry ...
[ ok ]
* Loading filetime-0.2.1.crate into Cargo registry ...
[ ok ]
* Loading flate2-1.0.2.crate into Cargo registry ...
[ ok ]
* Loading fnv-1.0.6.crate into Cargo registry ...
[ ok ]
* Loading foreign-types-0.3.2.crate into Cargo registry ...
[ ok ]
* Loading foreign-types-shared-0.1.1.crate into Cargo registry ...
[ ok ]
* Loading fs2-0.4.3.crate into Cargo registry ...
[ ok ]
* Loading fuchsia-zircon-0.3.3.crate into Cargo registry ...
[ ok ]
* Loading fuchsia-zircon-sys-0.3.3.crate into Cargo registry ...
[ ok ]
* Loading git2-0.7.5.crate into Cargo registry ...
[ ok ]
* Loading git2-curl-0.8.1.crate into Cargo registry ...
[ ok ]
* Loading glob-0.2.11.crate into Cargo registry ...
[ ok ]
* Loading globset-0.4.1.crate into Cargo registry ...
[ ok ]
* Loading hex-0.3.2.crate into Cargo registry ...
[ ok ]
* Loading home-0.3.3.crate into Cargo registry ...
[ ok ]
* Loading humantime-1.1.1.crate into Cargo registry ...
[ ok ]
* Loading idna-0.1.5.crate into Cargo registry ...
[ ok ]
* Loading ignore-0.4.3.crate into Cargo registry ...
[ ok ]
* Loading itoa-0.4.2.crate into Cargo registry ...
[ ok ]
* Loading jobserver-0.1.11.crate into Cargo registry ...
[ ok ]
* Loading kernel32-sys-0.2.2.crate into Cargo registry ...
[ ok ]
* Loading lazy_static-1.0.2.crate into Cargo registry ...
[ ok ]
* Loading lazycell-0.6.0.crate into Cargo registry ...
[ ok ]
* Loading libc-0.2.42.crate into Cargo registry ...
[ ok ]
* Loading libgit2-sys-0.7.7.crate into Cargo registry ...
[ ok ]
* Loading libssh2-sys-0.2.8.crate into Cargo registry ...
[ ok ]
* Loading libz-sys-1.0.18.crate into Cargo registry ...
[ ok ]
* Loading log-0.4.3.crate into Cargo registry ...
[ ok ]
* Loading matches-0.1.7.crate into Cargo registry ...
[ ok ]
* Loading memchr-2.0.1.crate into Cargo registry ...
[ ok ]
* Loading miniz-sys-0.1.10.crate into Cargo registry ...
[ ok ]
* Loading miow-0.3.1.crate into Cargo registry ...
[ ok ]
* Loading num-traits-0.2.5.crate into Cargo registry ...
[ ok ]
* Loading num_cpus-1.8.0.crate into Cargo registry ...
[ ok ]
* Loading openssl-0.10.10.crate into Cargo registry ...
[ ok ]
* Loading openssl-probe-0.1.2.crate into Cargo registry ...
[ ok ]
* Loading openssl-sys-0.9.33.crate into Cargo registry ...
[ ok ]
* Loading percent-encoding-1.0.1.crate into Cargo registry ...
[ ok ]
* Loading pkg-config-0.3.12.crate into Cargo registry ...
[ ok ]
* Loading proc-macro2-0.4.9.crate into Cargo registry ...
[ ok ]
* Loading quick-error-1.2.2.crate into Cargo registry ...
[ ok ]
* Loading quote-0.6.4.crate into Cargo registry ...
[ ok ]
* Loading rand-0.4.2.crate into Cargo registry ...
[ ok ]
* Loading rand-0.5.4.crate into Cargo registry ...
[ ok ]
* Loading rand_core-0.2.1.crate into Cargo registry ...
[ ok ]
* Loading redox_syscall-0.1.40.crate into Cargo registry ...
[ ok ]
* Loading redox_termios-0.1.1.crate into Cargo registry ...
[ ok ]
* Loading regex-1.0.2.crate into Cargo registry ...
[ ok ]
* Loading regex-syntax-0.6.2.crate into Cargo registry ...
[ ok ]
* Loading remove_dir_all-0.5.1.crate into Cargo registry ...
[ ok ]
* Loading rustc-demangle-0.1.9.crate into Cargo registry ...
[ ok ]
* Loading same-file-1.0.2.crate into Cargo registry ...
[ ok ]
* Loading schannel-0.1.13.crate into Cargo registry ...
[ ok ]
* Loading scopeguard-0.3.3.crate into Cargo registry ...
[ ok ]
* Loading semver-0.9.0.crate into Cargo registry ...
[ ok ]
* Loading semver-parser-0.7.0.crate into Cargo registry ...
[ ok ]
* Loading serde-1.0.70.crate into Cargo registry ...
[ ok ]
* Loading serde_derive-1.0.70.crate into Cargo registry ...
[ ok ]
* Loading serde_ignored-0.0.4.crate into Cargo registry ...
[ ok ]
* Loading serde_json-1.0.24.crate into Cargo registry ...
[ ok ]
* Loading shell-escape-0.1.4.crate into Cargo registry ...
[ ok ]
* Loading socket2-0.3.7.crate into Cargo registry ...
[ ok ]
* Loading strsim-0.7.0.crate into Cargo registry ...
[ ok ]
* Loading syn-0.14.6.crate into Cargo registry ...
[ ok ]
* Loading synstructure-0.9.0.crate into Cargo registry ...
[ ok ]
* Loading tar-0.4.16.crate into Cargo registry ...
[ ok ]
* Loading tempfile-3.0.3.crate into Cargo registry ...
[ ok ]
* Loading termcolor-0.3.6.crate into Cargo registry ...
[ ok ]
* Loading termcolor-1.0.1.crate into Cargo registry ...
[ ok ]
* Loading termion-1.5.1.crate into Cargo registry ...
[ ok ]
* Loading textwrap-0.10.0.crate into Cargo registry ...
[ ok ]
* Loading thread_local-0.3.5.crate into Cargo registry ...
[ ok ]
* Loading toml-0.4.6.crate into Cargo registry ...
[ ok ]
* Loading ucd-util-0.1.1.crate into Cargo registry ...
[ ok ]
* Loading unicode-bidi-0.3.4.crate into Cargo registry ...
[ ok ]
* Loading unicode-normalization-0.1.7.crate into Cargo registry ...
[ ok ]
* Loading unicode-width-0.1.5.crate into Cargo registry ...
[ ok ]
* Loading unicode-xid-0.1.0.crate into Cargo registry ...
[ ok ]
* Loading unreachable-1.0.0.crate into Cargo registry ...
[ ok ]
* Loading url-1.7.1.crate into Cargo registry ...
[ ok ]
* Loading utf8-ranges-1.0.0.crate into Cargo registry ...
[ ok ]
* Loading vcpkg-0.2.4.crate into Cargo registry ...
[ ok ]
* Loading vec_map-0.8.1.crate into Cargo registry ...
[ ok ]
* Loading void-1.0.2.crate into Cargo registry ...
[ ok ]
* Loading walkdir-2.1.4.crate into Cargo registry ...
[ ok ]
* Loading winapi-0.2.8.crate into Cargo registry ...
[ ok ]
* Loading winapi-0.3.5.crate into Cargo registry ...
[ ok ]
* Loading winapi-build-0.1.1.crate into Cargo registry ...
[ ok ]
* Loading winapi-i686-pc-windows-gnu-0.4.0.crate into Cargo registry ...
[ ok ]
* Loading winapi-x86_64-pc-windows-gnu-0.4.0.crate into Cargo registry ...
[ ok ]
* Loading wincolor-0.1.6.crate into Cargo registry ...
[ ok ]
* Loading wincolor-1.0.0.crate into Cargo registry ...
[ ok ]
>>> Unpacking cargo-0.28.0-x86_64-unknown-linux-gnu.tar.xz to /var/tmp/portage/dev-util/cargo-0.29.0/work
>>> Source unpacked in /var/tmp/portage/dev-util/cargo-0.29.0/work
>>> Preparing source in /var/tmp/portage/dev-util/cargo-0.29.0/work/cargo-0.29.0 ...
>>> Source prepared.
>>> Configuring source in /var/tmp/portage/dev-util/cargo-0.29.0/work/cargo-0.29.0 ...
Configuring cargo...
>>> Source configured.
>>> Compiling source in /var/tmp/portage/dev-util/cargo-0.29.0/work/cargo-0.29.0 ...
 Compiling unicode-xid v0.1.0
 Compiling pkg-config v0.3.12
 Compiling cc v1.0.18
 Compiling matches v0.1.7
 Compiling libc v0.2.42
 Compiling void v1.0.2
 Compiling regex v1.0.2
 Compiling ucd-util v0.1.1
 Compiling serde v1.0.70
 Compiling unicode-normalization v0.1.7
 Compiling lazy_static v1.0.2
 Compiling failure_derive v0.1.2
 Compiling rustc-demangle v0.1.9
 Compiling utf8-ranges v1.0.0
 Compiling percent-encoding v1.0.1
 Compiling foreign-types-shared v0.1.1
 Compiling cfg-if v0.1.4
 Compiling openssl v0.10.10
 Compiling bitflags v1.0.3
 Compiling itoa v0.4.2
 Compiling same-file v1.0.2
 Compiling dtoa v0.4.3
 Compiling unicode-width v0.1.5
 Compiling fnv v1.0.6
 Compiling openssl-probe v0.1.2
 Compiling num-traits v0.2.5
 Compiling quick-error v1.2.2
 Compiling rand_core v0.2.1
 Compiling remove_dir_all v0.5.1
 Compiling vec_map v0.8.1
 Compiling hex v0.3.2
 Compiling ansi_term v0.11.0
 Compiling termcolor v1.0.1
 Compiling crossbeam v0.3.2
 Compiling semver-parser v0.7.0
 Compiling strsim v0.7.0
 Compiling termcolor v0.3.6
 Compiling home v0.3.3
 Compiling shell-escape v0.1.4
 Compiling glob v0.2.11
 Compiling lazycell v0.6.0
 Compiling unreachable v1.0.0
 Compiling unicode-bidi v0.3.4
 Compiling proc-macro2 v0.4.9
 Compiling regex-syntax v0.6.2
 Compiling memchr v2.0.1
 Compiling atty v0.2.11
 Compiling num_cpus v1.8.0
 Compiling fs2 v0.4.3
 Compiling foreign-types v0.3.2
 Compiling socket2 v0.3.7
 Compiling log v0.4.3
 Compiling filetime v0.2.1
 Compiling walkdir v2.1.4
 Compiling textwrap v0.10.0
 Compiling humantime v1.1.1
 Compiling rand v0.5.4
 Compiling cmake v0.1.31
 Compiling openssl-sys v0.9.33
 Compiling libz-sys v1.0.18
 Compiling backtrace-sys v0.1.23
 Compiling curl-sys v0.4.8
 Compiling miniz-sys v0.1.10
 Compiling thread_local v0.3.5
 Compiling aho-corasick v0.6.6
 Compiling tar v0.4.16
 Compiling jobserver v0.1.11
 Compiling quote v0.6.4
 Compiling clap v2.32.0
 Compiling libssh2-sys v0.2.8
 Compiling libgit2-sys v0.7.7
 Compiling tempfile v3.0.3
 Compiling idna v0.1.5
 Compiling syn v0.14.6
 Compiling backtrace v0.3.9
 Compiling serde_json v1.0.24
 Compiling serde_ignored v0.0.4
 Compiling semver v0.9.0
 Compiling toml v0.4.6
 Compiling globset v0.4.1
 Compiling env_logger v0.5.11
 Compiling synstructure v0.9.0
 Compiling serde_derive v1.0.70
 Compiling flate2 v1.0.2
 Compiling curl v0.4.14
 Compiling url v1.7.1
 Compiling crypto-hash v0.3.1
 Compiling ignore v0.4.3
 Compiling failure v0.1.2
 Compiling git2 v0.7.5
 Compiling git2-curl v0.8.1
 Compiling crates-io v0.17.0
 Compiling cargo v0.29.0 (file:///var/tmp/portage/dev-util/cargo-0.29.0/work/cargo-0.29.0)
error[E0658]: `impl Trait` in return position is experimental (see issue #34511)
--> src/cargo/core/resolver/types.rs:209:37
|
209 | pub fn flatten<'s>(&'s self) -> impl Iterator<Item=(&PackageId, Dependency)> + 's {
| ^^^^^^^^^^^^^^^^^^^^^^^^^^^^^^^^^^^^^^^^^^^^^^^^^
warning: use of deprecated item 'failure::Error::causes': please use the 'iter_chain()' method instead
--> src/cargo/lib.rs:172:30
|
172 | for err in cargo_err.causes().skip(1) {
| ^^^^^^
|
= note: #[warn(deprecated)] on by default
warning: use of deprecated item 'failure::Error::causes': please use the 'iter_chain()' method instead
--> src/cargo/lib.rs:178:30
|
178 | for err in cargo_err.causes().skip(1) {
| ^^^^^^
error[E0658]: non-reference pattern used to match a reference (see issue #42640)
--> src/cargo/core/compiler/build_plan.rs:87:17
|
87 | Some(s) => s,
| ^^^^^^^ help: consider using a reference: `&Some(s)`
error[E0658]: non-reference pattern used to match a reference (see issue #42640)
--> src/cargo/core/compiler/build_plan.rs:88:17
|
88 | None => continue,
| ^^^^ help: consider using a reference: `&None`
warning: use of deprecated item 'failure::Error::causes': please use the 'iter_chain()' method instead
--> src/cargo/core/compiler/fingerprint.rs:682:21
|
682 | for cause in ce.causes().skip(1) {
| ^^^^^^
error[E0658]: use of unstable library feature 'box_leak': needs an FCP to stabilize (see issue #46179)
--> src/cargo/core/interning.rs:13:5
|
13 | Box::leak(s.into_boxed_str())
| ^^^^^^^^^
error[E0658]: non-reference pattern used to match a reference (see issue #42640)
--> src/cargo/core/resolver/context.rs:406:13
|
406 | FeatureValue::Feature(feat) => self.require_feature(feat.as_str()),
| ^^^^^^^^^^^^^^^^^^^^^^^^^^^ help: consider using a reference: `&FeatureValue::Feature(feat)`
error[E0658]: non-reference pattern used to match a reference (see issue #42640)
--> src/cargo/core/resolver/context.rs:407:13
|
407 | FeatureValue::Crate(dep) => Ok(self.require_dependency(dep.as_str())),
| ^^^^^^^^^^^^^^^^^^^^^^^^ help: consider using a reference: `&FeatureValue::Crate(dep)`
error[E0658]: non-reference pattern used to match a reference (see issue #42640)
--> src/cargo/core/resolver/context.rs:408:13
|
408 | FeatureValue::CrateFeature(dep, dep_feat) => {
| ^^^^^^^^^^^^^^^^^^^^^^^^^^^^^^^^^^^^^^^^^ help: consider using a reference: `&FeatureValue::CrateFeature(dep, dep_feat)`
error[E0658]: non-reference pattern used to match a reference (see issue #42640)
--> src/cargo/ops/cargo_test.rs:158:13
|
158 | let Doctest {
| _____________^
159 | | package,
160 | | target,
161 | | deps,
162 | | } = doctest_info;
| |_________^
help: consider using a reference
|
158 | let &Doctest {
159 | package,
160 | target,
161 | deps,
162 | } = doctest_info;
|
error[E0658]: non-reference pattern used to match a reference (see issue #42640)
--> src/cargo/util/config.rs:805:13
|
805 | ConfigKeyPart::Part(s) => s.replace("-", "_").to_uppercase(),
| ^^^^^^^^^^^^^^^^^^^^^^ help: consider using a reference: `&ConfigKeyPart::Part(s)`
error[E0658]: non-reference pattern used to match a reference (see issue #42640)
--> src/cargo/util/config.rs:806:13
|
806 | ConfigKeyPart::CasePart(s) => s.clone(),
| ^^^^^^^^^^^^^^^^^^^^^^^^^^ help: consider using a reference: `&ConfigKeyPart::CasePart(s)`
error[E0658]: non-reference pattern used to match a reference (see issue #42640)
--> src/cargo/util/config.rs:812:13
|
812 | ConfigKeyPart::Part(s) => s.clone(),
| ^^^^^^^^^^^^^^^^^^^^^^ help: consider using a reference: `&ConfigKeyPart::Part(s)`
error[E0658]: non-reference pattern used to match a reference (see issue #42640)
--> src/cargo/util/config.rs:813:13
|
813 | ConfigKeyPart::CasePart(s) => s.clone(),
| ^^^^^^^^^^^^^^^^^^^^^^^^^^ help: consider using a reference: `&ConfigKeyPart::CasePart(s)`
warning: use of deprecated item 'failure::Error::causes': please use the 'iter_chain()' method instead
--> src/cargo/util/config.rs:924:14
|
924 | .causes()
| ^^^^^^
warning: use of deprecated item 'failure::Error::cause': please use 'as_fail()' method instead
--> src/cargo/util/errors.rs:59:20
|
59 | self.inner.cause().cause()
| ^^^^^
warning: use of deprecated item 'failure::Error::causes': please use the 'iter_chain()' method instead
--> src/cargo/util/network.rs:10:18
|
10 | for e in err.causes() {
| ^^^^^^
error: aborting due to 12 previous errors
error: Could not compile `cargo`.
To learn more, run the command again with --verbose.
>>> Source compiled.
>>> Test phase [not enabled]: dev-util/cargo-0.29.0
>>> Install cargo-0.29.0 into /var/tmp/portage/dev-util/cargo-0.29.0/image/ category dev-util
!!! dobin: target/release/cargo does not exist
* ERROR: dev-util/cargo-0.29.0::gentoo failed (install phase):
* dobin failed
*
* If you need support, post the output of `emerge --info '=dev-util/cargo-0.29.0::gentoo'`,
* the complete build log and the output of `emerge -pqv '=dev-util/cargo-0.29.0::gentoo'`.
* The complete build log is located at '/var/log/portage/dev-util:cargo-0.29.0:20180910-170526.log'.
* For convenience, a symlink to the build log is located at '/var/tmp/portage/dev-util/cargo-0.29.0/temp/build.log'.
* The ebuild environment file is located at '/var/tmp/portage/dev-util/cargo-0.29.0/temp/environment'.
* Working directory: '/var/tmp/portage/dev-util/cargo-0.29.0/work/cargo-0.29.0'
* S: '/var/tmp/portage/dev-util/cargo-0.29.0/work/cargo-0.29.0'
 * QA Notice: file does not exist:
 * 
 *  dobin: target/release/cargo does not exist
Portage 2.3.40 (python 3.6.5-final-0, default/linux/amd64/17.0/desktop/plasma, gcc-7.3.0, glibc-2.26-r7, 4.14.52-gentoo x86_64)
=================================================================
System Settings
=================================================================
System uname: Linux-4.14.52-gentoo-x86_64-Intel-R-_Core-TM-_i7_CPU_870_@_2.93GHz-with-gentoo-2.4.1
KiB Mem: 12255820 total, 1231420 free
KiB Swap: 2097148 total, 1738984 free
Timestamp of repository gentoo: Mon, 10 Sep 2018 13:15:01 +0000
Head commit of repository gentoo: 66df0c7bc77bf5e7c55769ee34a109329e0f1ad9
sh bash 4.4_p12
ld GNU ld (Gentoo 2.30 p2) 2.30.0
app-shells/bash: 4.4_p12::gentoo
dev-java/java-config: 2.2.0-r4::gentoo
dev-lang/perl: 5.24.3-r1::gentoo
dev-lang/python: 2.7.14-r1::gentoo, 3.4.8::gentoo, 3.5.5::gentoo, 3.6.5::gentoo
dev-util/cmake: 3.9.6::gentoo
dev-util/pkgconfig: 0.29.2::gentoo
sys-apps/baselayout: 2.4.1-r2::gentoo
sys-apps/openrc: 0.34.11::gentoo
sys-apps/sandbox: 2.13::gentoo
sys-devel/autoconf: 2.13::gentoo, 2.69-r4::gentoo
sys-devel/automake: 1.11.6-r3::gentoo, 1.15.1-r2::gentoo
sys-devel/binutils: 2.30-r2::gentoo
sys-devel/gcc: 6.4.0-r1::gentoo, 7.3.0-r3::gentoo
sys-devel/gcc-config: 1.8-r1::gentoo
sys-devel/libtool: 2.4.6-r3::gentoo
sys-devel/make: 4.2.1-r4::gentoo
sys-kernel/linux-headers: 4.13::gentoo (virtual/os-headers)
sys-libs/glibc: 2.26-r7::gentoo
Repositories:
gentoo
location: /usr/portage
sync-type: rsync
sync-uri: rsync://rsync.namerica.gentoo.org/gentoo-portage
priority: -1000
sync-rsync-verify-max-age: 24
sync-rsync-verify-jobs: 1
sync-rsync-verify-metamanifest: yes
sync-rsync-extra-opts:
x-portage
location: /usr/local/portage
masters: gentoo
priority: 0
mysql
location: /var/lib/layman/mysql
masters: gentoo
priority: 50
ACCEPT_KEYWORDS="amd64"
ACCEPT_LICENSE="* -@EULA PUEL dlj-1.1 AdobeFlash-10 AdobeFlash-10.1 AdobeFlash-10.3 AdobeFlash-11.x skype-eula baudline"
CBUILD="x86_64-pc-linux-gnu"
CFLAGS="-march=native -O2 -pipe"
CHOST="x86_64-pc-linux-gnu"
CONFIG_PROTECT="/etc /usr/lib64/libreoffice/program/sofficerc /usr/share/config /usr/share/gnupg/qualified.txt"
CONFIG_PROTECT_MASK="/etc/ca-certificates.conf /etc/dconf /etc/env.d /etc/fonts/fonts.conf /etc/gconf /etc/gentoo-release /etc/php/apache2-php5.6/ext-active/ /etc/php/cgi-php5.6/ext-active/ /etc/php/cli-php5.6/ext-active/ /etc/revdep-rebuild /etc/sandbox.d /etc/terminfo"
CXXFLAGS="-march=native -O2 -pipe"
DISTDIR="/usr/portage/distfiles"
EMERGE_DEFAULT_OPTS="--quiet-build"
ENV_UNSET="DBUS_SESSION_BUS_ADDRESS DISPLAY PERL5LIB PERL5OPT PERLPREFIX PERL_CORE PERL_MB_OPT PERL_MM_OPT XAUTHORITY XDG_CACHE_HOME XDG_CONFIG_HOME XDG_DATA_HOME XDG_RUNTIME_DIR"
FCFLAGS="-O2 -pipe"
FEATURES="assume-digests binpkg-logs config-protect-if-modified distlocks ebuild-locks fixlafiles merge-sync multilib-strict news parallel-fetch preserve-libs protect-owned sandbox sfperms strict unknown-features-warn unmerge-logs unmerge-orphans userfetch userpriv usersandbox usersync xattr"
FFLAGS="-O2 -pipe"
GENTOO_MIRRORS="http://mirrors.rit.edu/gentoo/ http://mirror.leaseweb.com/gentoo/ http://mirror.lug.udel.edu/pub/gentoo/"
LANG="en_GB.UTF-8"
LDFLAGS="-Wl,-O1 -Wl,--as-needed"
LINGUAS="en_GB"
MAKEOPTS="-s -j1 -l 2"
PKGDIR="/usr/portage/packages"
PORTAGE_CONFIGROOT="/"
PORTAGE_RSYNC_OPTS="--recursive --links --safe-links --perms --times --omit-dir-times --compress --force --whole-file --delete --stats --human-readable --timeout=180 --exclude=/distfiles --exclude=/local --exclude=/packages --exclude=/.git"
PORTAGE_TMPDIR="/var/tmp"
USE="X a52 aac acl acpi activities alsa amd64 berkdb branding bzip2 cairo cdda cdr cleartype cli consolekit corefonts crypt cups cxx dbus declarative dri dts dvd dvdr emboss encode exif fam flac fortran gdbm gif glamor gpm iconv icu jack jpeg kde kipi kwallet lcms ldap libnotify libtirpc mad mng modules mp3 mp4 mpeg multilib ncurses nls nptl ogg opengl openmp pam pango pcre pdf phonon plasma png policykit ppds qml qt5 readline sdl seccomp ssl startup-notification svg tcpd tiff truetype type1 udev udisks unicode upower usb vorbis widgets wxwidgets x264 xattr xcb xcomposite xml xv xvid zlib" ABI_X86="64" ALSA_CARDS="ali5451 als4000 atiixp atiixp-modem bt87x ca0106 cmipci emu10k1x ens1370 ens1371 es1938 es1968 fm801 hda-intel intel8x0 intel8x0m maestro3 trident usb-audio via82xx via82xx-modem ymfpci" APACHE2_MODULES="actions alias asis auth_anon auth_basic auth_dbm auth_digest authn_core authn_file authz_core authz_groupfile authz_host authz_owner authz_user autoindex cache cern_meta cgi cgid charset_lite dav dav_fs deflate dir disk_cache echo env expires ext_filter file_cache filter headers imap include info log_config logio mem_cache mime mime_magic negotiation proxy proxy_balancer proxy_connect proxy_ftp proxy_http rewrite setenvif slotmem_shm so socache_shmcb speling status unique_id unixd userdir usertrack vhost_alias" CALLIGRA_FEATURES="krita karbon" COLLECTD_PLUGINS="df interface irq load memory rrdtool swap syslog" CPU_FLAGS_X86="mmx mmxext sse sse2" ELIBC="glibc" GPSD_PROTOCOLS="ashtech aivdm earthmate evermore fv18 garmin garmintxt gpsclock isync itrax mtk3301 nmea ntrip navcom oceanserver oldstyle oncore rtcm104v2 rtcm104v3 sirf skytraq superstar2 timing tsip tripmate tnt ublox ubx" INPUT_DEVICES="evdev" KERNEL="linux" L10N="en-GB" LCD_DEVICES="bayrad cfontz cfontz633 glk hd44780 lb216 lcdm001 mtxorb ncurses text" LIBREOFFICE_EXTENSIONS="presenter-console presenter-minimizer" OFFICE_IMPLEMENTATION="libreoffice" PHP_TARGETS="php5-6 php7-0" POSTGRES_TARGETS="postgres9_5 postgres10" PYTHON_SINGLE_TARGET="python3_6" PYTHON_TARGETS="python2_7 python3_6" RUBY_TARGETS="ruby23 ruby24" USERLAND="GNU" VIDEO_CARDS="radeon r600" XTABLES_ADDONS="quota2 psd pknock lscan length2 ipv4options ipset ipp2p iface geoip fuzzy condition tee tarpit sysrq steal rawnat logmark ipmark dhcpmac delude chaos account"
Unset: CC, CPPFLAGS, CTARGET, CXX, INSTALL_MASK, LC_ALL, PORTAGE_BINHOST, PORTAGE_BUNZIP2_COMMAND, PORTAGE_COMPRESS, PORTAGE_COMPRESS_FLAGS, PORTAGE_RSYNC_EXTRA_OPTS
  • https://bugs.gentoo.org/664484

    # eix -I cargo
    [U] dev-util/cargo
        Available versions:  0.26.0^m ~0.27.0^m (~)0.28.0^m 0.29.0^m {debug doc libressl}
        Installed versions:  0.28.0^m(20:22:01 09/09/18)(-debug -doc -libressl)
        Homepage:            http://crates.io
        Description:         The Rust's package manager
    
    # eix -I rust
    [I] app-eselect/eselect-rust
        Available versions:  0.3_pre20150428
        Installed versions:  0.3_pre20150428(09:22:31 09/09/18)
        Homepage:            https://github.com/jauhien/eselect-rust
        Description:         eselect module for rust
    
    [I] dev-lang/rust
        Available versions:  (stable) 1.25.0(stable/1.25) ~1.26.2(stable/1.26) ~1.27.1(stable/1.27) ~1.27.1-r2(stable/1.27) ~1.28.0(stable/1.28) 1.28.0-r1(stable/1.28)
          {cargo debug doc extended +jemalloc libressl rls rustfmt wasm ABI_MIPS="n32 n64 o32" ABI_PPC="32 64" ABI_S390="32 64" ABI_X86="32 64 x32" LLVM_TARGETS="AArch64 AMDGPU ARM BPF Hexagon Lanai MSP430 Mips NVPTX PowerPC Sparc SystemZ X86 XCore"}
        Installed versions:  1.28.0-r1(stable)(14:23:22 09/09/18)(jemalloc -cargo -debug -doc -libressl -rls -rustfmt -wasm ABI_MIPS="-n32 -n64 -o32" ABI_PPC="-32 -64" ABI_S390="-32 -64" ABI_X86="64 -32 -x32" LLVM_TARGETS="X86 -AArch64 -AMDGPU -ARM -BPF -Hexagon -Lanai -MSP430 -Mips -NVPTX -PowerPC -Sparc -SystemZ -XCore")
        Homepage:            https://www.rust-lang.org/
        Description:         Systems programming language from Mozilla
    
    [U] dev-lang/rust-bin
        Available versions:  (stable) 1.25.0 ~1.26.2 ~1.27.1-r1 ~1.28.0 1.28.0-r1
          {cargo doc libressl rustfmt}
        Installed versions:  1.25.0(stable)(09:23:51 09/09/18)(-doc)
        Homepage:            https://www.rust-lang.org/
        Description:         Systems programming language from Mozilla
    
    [I] virtual/rust
        Available versions:  1.25.0 ~1.26.2 ~1.27.1 1.28.0
        Installed versions:  1.28.0(14:24:56 09/09/18)
        Description:         Virtual for Rust language compiler
    
Sign up for free to join this conversation on GitHub. Already have an account? Sign in to comment
You can’t perform that action at this time.