Skip to content

Instantly share code, notes, and snippets.

@SMillerDev
Created Oct 2, 2020
Embed
What would you like to do?
PHP build failure config.log
This file has been truncated, but you can view the full file.
This file contains any messages produced by compilers while
running configure, to aid debugging if configure makes a mistake.
It was created by configure, which was
generated by GNU Autoconf 2.69. Invocation command line was
$ ./configure --prefix=/usr/local/Cellar/php@7.3/7.3.22 --localstatedir=/usr/local/var --sysconfdir=/usr/local/etc/php/7.3 --with-config-file-path=/usr/local/etc/php/7.3 --with-config-file-scan-dir=/usr/local/etc/php/7.3/conf.d --with-pear=/usr/local/Cellar/php@7.3/7.3.22/share/php@7.3/pear --enable-bcmath --enable-calendar --enable-dba --enable-dtrace --enable-exif --enable-ftp --enable-fpm --enable-intl --enable-mbregex --enable-mbstring --enable-mysqlnd --enable-opcache-file --enable-pcntl --enable-phpdbg --enable-phpdbg-readline --enable-phpdbg-webhelper --enable-shmop --enable-soap --enable-sockets --enable-sysvmsg --enable-sysvsem --enable-sysvshm --enable-wddx --enable-zip --with-apxs2=/usr/local/opt/httpd/bin/apxs --with-bz2=/Library/Developer/CommandLineTools/SDKs/MacOSX11.0.sdk/usr --with-curl=/usr/local/opt/curl-openssl --with-fpm-user=_www --with-fpm-group=_www --with-freetype-dir=/usr/local/opt/freetype --with-gd --with-gettext=/usr/local/opt/gettext --with-gmp=/usr/local/opt/gmp --with-iconv=/Library/Developer/CommandLineTools/SDKs/MacOSX11.0.sdk/usr --with-icu-dir=/usr/local/opt/icu4c --with-jpeg-dir=/usr/local/opt/jpeg --with-kerberos=/Library/Developer/CommandLineTools/SDKs/MacOSX11.0.sdk/usr --with-layout=GNU --with-ldap=/usr/local/opt/openldap --with-ldap-sasl=/Library/Developer/CommandLineTools/SDKs/MacOSX11.0.sdk/usr --with-libxml-dir=/Library/Developer/CommandLineTools/SDKs/MacOSX11.0.sdk/usr --with-libedit=/Library/Developer/CommandLineTools/SDKs/MacOSX11.0.sdk/usr --with-libzip --with-mhash=/Library/Developer/CommandLineTools/SDKs/MacOSX11.0.sdk/usr --with-mysql-sock=/tmp/mysql.sock --with-mysqli=mysqlnd --with-ndbm=/Library/Developer/CommandLineTools/SDKs/MacOSX11.0.sdk/usr --with-openssl=/usr/local/opt/openssl@1.1 --with-password-argon2=/usr/local/opt/argon2 --with-pdo-dblib=/usr/local/opt/freetds --with-pdo-mysql=mysqlnd --with-pdo-odbc=unixODBC,/usr/local/opt/unixodbc --with-pdo-pgsql=/usr/local/opt/libpq --with-pdo-sqlite=/usr/local/opt/sqlite --with-pgsql=/usr/local/opt/libpq --with-pic --with-png-dir=/usr/local/opt/libpng --with-pspell=/usr/local/opt/aspell --with-sodium=/usr/local/opt/libsodium --with-sqlite3=/usr/local/opt/sqlite --with-tidy=/usr/local/opt/tidy-html5 --with-unixODBC=/usr/local/opt/unixodbc --with-webp-dir=/usr/local/opt/webp --with-xmlrpc --with-xsl=/Library/Developer/CommandLineTools/SDKs/MacOSX11.0.sdk/usr --with-zlib=/Library/Developer/CommandLineTools/SDKs/MacOSX11.0.sdk/usr
## --------- ##
## Platform. ##
## --------- ##
hostname = Gooseberry.local
uname -m = x86_64
uname -r = 20.1.0
uname -s = Darwin
uname -v = Darwin Kernel Version 20.1.0: Thu Sep 24 20:22:06 PDT 2020; root:xnu-7195.40.89.100.3~1/RELEASE_X86_64
/usr/bin/uname -p = i386
/bin/uname -X = unknown
/bin/arch = unknown
/usr/bin/arch -k = unknown
/usr/convex/getsysinfo = unknown
/usr/bin/hostinfo = Mach kernel version:
Darwin Kernel Version 20.1.0: Thu Sep 24 20:22:06 PDT 2020; root:xnu-7195.40.89.100.3~1/RELEASE_X86_64
Kernel configured for up to 8 processors.
4 processors are physically available.
8 processors are logically available.
Processor type: x86_64h (Intel x86-64h Haswell)
Processors active: 0 1 2 3 4 5 6 7
Primary memory available: 16.00 gigabytes
Default processor set: 604 tasks, 2657 threads, 8 processors
Load average: 2.97, Mach factor: 5.02
/bin/machine = unknown
/usr/bin/oslevel = unknown
/bin/universe = unknown
PATH: /usr/local/Homebrew/Library/Homebrew/shims/mac/super
PATH: /usr/local/opt/httpd/bin
PATH: /usr/local/opt/pkg-config/bin
PATH: /usr/local/opt/xz/bin
PATH: /usr/local/opt/apr/bin
PATH: /usr/local/opt/openssl@1.1/bin
PATH: /usr/local/opt/apr-util/bin
PATH: /usr/local/opt/argon2/bin
PATH: /usr/local/opt/aspell/bin
PATH: /usr/local/opt/autoconf/bin
PATH: /usr/local/opt/brotli/bin
PATH: /usr/local/opt/c-ares/bin
PATH: /usr/local/opt/libidn/bin
PATH: /usr/local/opt/jemalloc/bin
PATH: /usr/local/opt/libevent/bin
PATH: /usr/local/opt/nghttp2/bin
PATH: /usr/local/opt/openldap/bin
PATH: /usr/local/opt/rtmpdump/bin
PATH: /usr/local/opt/zstd/bin
PATH: /usr/local/opt/curl-openssl/bin
PATH: /usr/local/opt/libtool/bin
PATH: /usr/local/opt/unixodbc/bin
PATH: /usr/local/opt/freetds/bin
PATH: /usr/local/opt/libpng/bin
PATH: /usr/local/opt/freetype/bin
PATH: /usr/local/opt/gettext/bin
PATH: /usr/local/opt/pcre/bin
PATH: /usr/local/opt/gdbm/bin
PATH: /usr/local/opt/sqlite/bin
PATH: /usr/local/opt/python@3.8/bin
PATH: /usr/local/opt/glib/bin
PATH: /usr/local/opt/icu4c/bin
PATH: /usr/local/opt/jpeg/bin
PATH: /usr/local/opt/krb5/bin
PATH: /usr/local/opt/libpq/bin
PATH: /usr/local/opt/libzip/bin
PATH: /usr/local/opt/tidy-html5/bin
PATH: /usr/local/opt/libtiff/bin
PATH: /usr/local/opt/webp/bin
PATH: /usr/bin
PATH: /bin
PATH: /usr/sbin
PATH: /sbin
## ----------- ##
## Core tests. ##
## ----------- ##
configure:3238: checking for grep that handles long lines and -e
configure:3296: result: /usr/bin/grep
configure:3301: checking for egrep
configure:3363: result: /usr/bin/grep -E
configure:3368: checking for a sed that does not truncate output
configure:3422: result: sed
configure:3532: checking build system type
configure:3546: result: x86_64-apple-darwin20.1.0
configure:3566: checking host system type
configure:3579: result: x86_64-apple-darwin20.1.0
configure:3599: checking target system type
configure:3612: result: x86_64-apple-darwin20.1.0
configure:3830: checking for C compiler version
configure:3839: clang --version >&5
Apple clang version 12.0.0 (clang-1200.0.32.6)
Target: x86_64-apple-darwin20.1.0
Thread model: posix
InstalledDir: /Library/Developer/CommandLineTools/usr/bin
configure:3850: $? = 0
configure:3839: clang -v >&5
Apple clang version 12.0.0 (clang-1200.0.32.6)
Target: x86_64-apple-darwin20.1.0
Thread model: posix
InstalledDir: /Library/Developer/CommandLineTools/usr/bin
configure:3850: $? = 0
configure:3839: clang -V >&5
clang: error: unsupported option '-V -isysroot/Library/Developer/CommandLineTools/SDKs/MacOSX11.0.sdk'
configure:3850: $? = 1
configure:3839: clang -qversion >&5
clang: error: unknown argument '-qversion'; did you mean '--version'?
configure:3850: $? = 1
configure:3870: checking whether the C compiler works
configure:3892: clang conftest.c >&5
configure:3896: $? = 0
configure:3944: result: yes
configure:3947: checking for C compiler default output file name
configure:3949: result: a.out
configure:3955: checking for suffix of executables
configure:3962: clang -o conftest conftest.c >&5
configure:3966: $? = 0
configure:3988: result:
configure:4010: checking whether we are cross compiling
configure:4018: clang -o conftest conftest.c >&5
configure:4022: $? = 0
configure:4029: ./conftest
configure:4033: $? = 0
configure:4048: result: no
configure:4053: checking for suffix of object files
configure:4075: clang -c conftest.c >&5
configure:4079: $? = 0
configure:4100: result: o
configure:4104: checking whether we are using the GNU C compiler
configure:4123: clang -c conftest.c >&5
configure:4123: $? = 0
configure:4132: result: yes
configure:4141: checking whether clang accepts -g
configure:4161: clang -c -g conftest.c >&5
configure:4161: $? = 0
configure:4202: result: yes
configure:4219: checking for clang option to accept ISO C89
configure:4282: clang -c -g -O2 conftest.c >&5
configure:4282: $? = 0
configure:4295: result: none needed
configure:4321: checking how to run the C preprocessor
configure:4352: clang -E conftest.c
configure:4352: $? = 0
configure:4366: clang -E conftest.c
conftest.c:9:10: fatal error: 'ac_nonexistent.h' file not found
#include <ac_nonexistent.h>
^~~~~~~~~~~~~~~~~~
1 error generated.
configure:4366: $? = 1
configure: failed program was:
| /* confdefs.h */
| #define PACKAGE_NAME ""
| #define PACKAGE_TARNAME ""
| #define PACKAGE_VERSION ""
| #define PACKAGE_STRING ""
| #define PACKAGE_BUGREPORT ""
| #define PACKAGE_URL ""
| /* end confdefs.h. */
| #include <ac_nonexistent.h>
configure:4391: result: clang -E
configure:4411: clang -E conftest.c
configure:4411: $? = 0
configure:4425: clang -E conftest.c
conftest.c:9:10: fatal error: 'ac_nonexistent.h' file not found
#include <ac_nonexistent.h>
^~~~~~~~~~~~~~~~~~
1 error generated.
configure:4425: $? = 1
configure: failed program was:
| /* confdefs.h */
| #define PACKAGE_NAME ""
| #define PACKAGE_TARNAME ""
| #define PACKAGE_VERSION ""
| #define PACKAGE_STRING ""
| #define PACKAGE_BUGREPORT ""
| #define PACKAGE_URL ""
| /* end confdefs.h. */
| #include <ac_nonexistent.h>
configure:4456: checking for icc
configure:4465: result: no
configure:4479: checking for suncc
configure:4488: result: no
configure:4503: checking whether clang and cc understand -c and -o together
configure:4534: clang -c conftest.c -o conftest2.o >&5
configure:4538: $? = 0
configure:4544: clang -c conftest.c -o conftest2.o >&5
configure:4548: $? = 0
configure:4559: cc -c conftest.c >&5
configure:4563: $? = 0
configure:4571: cc -c conftest.c -o conftest2.o >&5
configure:4575: $? = 0
configure:4581: cc -c conftest.c -o conftest2.o >&5
configure:4585: $? = 0
configure:4603: result: yes
configure:4618: checking how to run the C preprocessor
configure:4688: result: clang -E
configure:4708: clang -E conftest.c
configure:4708: $? = 0
configure:4722: clang -E conftest.c
conftest.c:9:10: fatal error: 'ac_nonexistent.h' file not found
#include <ac_nonexistent.h>
^~~~~~~~~~~~~~~~~~
1 error generated.
configure:4722: $? = 1
configure: failed program was:
| /* confdefs.h */
| #define PACKAGE_NAME ""
| #define PACKAGE_TARNAME ""
| #define PACKAGE_VERSION ""
| #define PACKAGE_STRING ""
| #define PACKAGE_BUGREPORT ""
| #define PACKAGE_URL ""
| /* end confdefs.h. */
| #include <ac_nonexistent.h>
configure:4750: checking for ANSI C header files
configure:4770: clang -c -g -O2 conftest.c >&5
configure:4770: $? = 0
configure:4843: clang -o conftest -g -O2 conftest.c >&5
configure:4843: $? = 0
configure:4843: ./conftest
configure:4843: $? = 0
configure:4854: result: yes
configure:4867: checking for sys/types.h
configure:4867: clang -c -g -O2 conftest.c >&5
configure:4867: $? = 0
configure:4867: result: yes
configure:4867: checking for sys/stat.h
configure:4867: clang -c -g -O2 conftest.c >&5
configure:4867: $? = 0
configure:4867: result: yes
configure:4867: checking for stdlib.h
configure:4867: clang -c -g -O2 conftest.c >&5
configure:4867: $? = 0
configure:4867: result: yes
configure:4867: checking for string.h
configure:4867: clang -c -g -O2 conftest.c >&5
configure:4867: $? = 0
configure:4867: result: yes
configure:4867: checking for memory.h
configure:4867: clang -c -g -O2 conftest.c >&5
configure:4867: $? = 0
configure:4867: result: yes
configure:4867: checking for strings.h
configure:4867: clang -c -g -O2 conftest.c >&5
configure:4867: $? = 0
configure:4867: result: yes
configure:4867: checking for inttypes.h
configure:4867: clang -c -g -O2 conftest.c >&5
configure:4867: $? = 0
configure:4867: result: yes
configure:4867: checking for stdint.h
configure:4867: clang -c -g -O2 conftest.c >&5
configure:4867: $? = 0
configure:4867: result: yes
configure:4867: checking for unistd.h
configure:4867: clang -c -g -O2 conftest.c >&5
configure:4867: $? = 0
configure:4867: result: yes
configure:4880: checking minix/config.h usability
configure:4880: clang -c -g -O2 conftest.c >&5
conftest.c:52:10: fatal error: 'minix/config.h' file not found
#include <minix/config.h>
^~~~~~~~~~~~~~~~
1 error generated.
configure:4880: $? = 1
configure: failed program was:
| /* confdefs.h */
| #define PACKAGE_NAME ""
| #define PACKAGE_TARNAME ""
| #define PACKAGE_VERSION ""
| #define PACKAGE_STRING ""
| #define PACKAGE_BUGREPORT ""
| #define PACKAGE_URL ""
| #define STDC_HEADERS 1
| #define HAVE_SYS_TYPES_H 1
| #define HAVE_SYS_STAT_H 1
| #define HAVE_STDLIB_H 1
| #define HAVE_STRING_H 1
| #define HAVE_MEMORY_H 1
| #define HAVE_STRINGS_H 1
| #define HAVE_INTTYPES_H 1
| #define HAVE_STDINT_H 1
| #define HAVE_UNISTD_H 1
| /* end confdefs.h. */
| #include <stdio.h>
| #ifdef HAVE_SYS_TYPES_H
| # include <sys/types.h>
| #endif
| #ifdef HAVE_SYS_STAT_H
| # include <sys/stat.h>
| #endif
| #ifdef STDC_HEADERS
| # include <stdlib.h>
| # include <stddef.h>
| #else
| # ifdef HAVE_STDLIB_H
| # include <stdlib.h>
| # endif
| #endif
| #ifdef HAVE_STRING_H
| # if !defined STDC_HEADERS && defined HAVE_MEMORY_H
| # include <memory.h>
| # endif
| # include <string.h>
| #endif
| #ifdef HAVE_STRINGS_H
| # include <strings.h>
| #endif
| #ifdef HAVE_INTTYPES_H
| # include <inttypes.h>
| #endif
| #ifdef HAVE_STDINT_H
| # include <stdint.h>
| #endif
| #ifdef HAVE_UNISTD_H
| # include <unistd.h>
| #endif
| #include <minix/config.h>
configure:4880: result: no
configure:4880: checking minix/config.h presence
configure:4880: clang -E conftest.c
conftest.c:19:10: fatal error: 'minix/config.h' file not found
#include <minix/config.h>
^~~~~~~~~~~~~~~~
1 error generated.
configure:4880: $? = 1
configure: failed program was:
| /* confdefs.h */
| #define PACKAGE_NAME ""
| #define PACKAGE_TARNAME ""
| #define PACKAGE_VERSION ""
| #define PACKAGE_STRING ""
| #define PACKAGE_BUGREPORT ""
| #define PACKAGE_URL ""
| #define STDC_HEADERS 1
| #define HAVE_SYS_TYPES_H 1
| #define HAVE_SYS_STAT_H 1
| #define HAVE_STDLIB_H 1
| #define HAVE_STRING_H 1
| #define HAVE_MEMORY_H 1
| #define HAVE_STRINGS_H 1
| #define HAVE_INTTYPES_H 1
| #define HAVE_STDINT_H 1
| #define HAVE_UNISTD_H 1
| /* end confdefs.h. */
| #include <minix/config.h>
configure:4880: result: no
configure:4880: checking for minix/config.h
configure:4880: result: no
configure:4901: checking whether it is safe to define __EXTENSIONS__
configure:4919: clang -c -g -O2 conftest.c >&5
configure:4919: $? = 0
configure:4926: result: yes
configure:4940: checking whether ln -s works
configure:4944: result: yes
configure:4955: checking for system library directory
configure:4970: result: lib
configure:4979: checking whether to enable runpaths
configure:4993: result: yes
configure:5000: checking if compiler supports -R
configure:5019: clang -o conftest -g -O2 conftest.c -R /usr/lib >&5
warning: unknown remark option '-R' [-Wunknown-warning-option]
1 warning generated.
ld: can't map file, errno=22 file '/Library/Developer/CommandLineTools/SDKs/MacOSX11.0.sdk/usr/lib' for architecture x86_64
clang: error: linker command failed with exit code 1 (use -v to see invocation)
configure:5019: $? = 1
configure: failed program was:
| /* confdefs.h */
| #define PACKAGE_NAME ""
| #define PACKAGE_TARNAME ""
| #define PACKAGE_VERSION ""
| #define PACKAGE_STRING ""
| #define PACKAGE_BUGREPORT ""
| #define PACKAGE_URL ""
| #define STDC_HEADERS 1
| #define HAVE_SYS_TYPES_H 1
| #define HAVE_SYS_STAT_H 1
| #define HAVE_STDLIB_H 1
| #define HAVE_STRING_H 1
| #define HAVE_MEMORY_H 1
| #define HAVE_STRINGS_H 1
| #define HAVE_INTTYPES_H 1
| #define HAVE_STDINT_H 1
| #define HAVE_UNISTD_H 1
| #define __EXTENSIONS__ 1
| #define _ALL_SOURCE 1
| #define _GNU_SOURCE 1
| #define _POSIX_PTHREAD_SEMANTICS 1
| #define _TANDEM_SOURCE 1
| /* end confdefs.h. */
|
| int
| main ()
| {
|
| ;
| return 0;
| }
configure:5029: result: no
configure:5034: checking if compiler supports -Wl,-rpath,
configure:5053: clang -o conftest -g -O2 conftest.c -Wl,-rpath,/usr/lib >&5
configure:5053: $? = 0
configure:5063: result: yes
configure:5081: checking for gawk
configure:5112: result: no
configure:5081: checking for nawk
configure:5112: result: no
configure:5081: checking for awk
configure:5098: found /usr/bin/awk
configure:5109: result: awk
configure:5132: checking if awk is broken
configure:5139: result: no
configure:5153: checking for bison
configure:5169: found /usr/bin/bison
configure:5180: result: bison -y
configure:5206: checking for bison version
configure:5230: result: invalid
configure:5236: WARNING: This bison version is not supported for regeneration of the Zend/PHP parsers (found: 2.3, min: 204, excluded: ).
configure:5249: checking for re2c
configure:5279: result: no
configure:5304: WARNING: You will need re2c 0.13.4 or later if you want to regenerate PHP parsers.
configure:5325: checking whether to enable computed goto gcc extension with re2c
configure:5339: result: no
configure:5407: checking whether C compiler accepts -fvisibility=hidden
configure:5426: clang -c -g -O2 -fvisibility=hidden conftest.c >&5
configure:5426: $? = 0
configure:5434: result: yes
configure:5457: checking whether clang supports -no-cpp-precomp
configure:5474: result: yes
configure:5505: checking whether to force non-PIC code in shared modules
configure:5519: result: no
configure:5535: checking whether /dev/urandom exists
configure:5541: result: yes
configure:5548: checking whether /dev/arandom exists
configure:5557: result: no
configure:5572: checking for global register variables support
configure:5620: clang -c -g -O2 -fvisibility=hidden -no-cpp-precomp conftest.c >&5
conftest.c:44:3: error: "global register variables are not supported"
# error "global register variables are not supported"
^
conftest.c:47:28: error: expected string literal in 'asm'
register void *FP __asm__(ZEND_VM_FP_GLOBAL_REG);
^
conftest.c:48:45: error: expected string literal in 'asm'
register const opcode_handler_t *IP __asm__(ZEND_VM_IP_GLOBAL_REG);
^
conftest.c:50:36: error: use of undeclared identifier 'IP'
const opcode_handler_t *orig_ip = IP;
^
conftest.c:51:18: error: use of undeclared identifier 'FP'
void *orig_fp = FP;
^
conftest.c:52:2: error: use of undeclared identifier 'IP'
IP = ip;
^
conftest.c:53:2: error: use of undeclared identifier 'FP'
FP = fp;
^
conftest.c:55:2: error: use of undeclared identifier 'FP'
FP = orig_fp;
^
conftest.c:56:2: error: use of undeclared identifier 'IP'
IP = orig_ip;
^
9 errors generated.
configure:5620: $? = 1
configure: failed program was:
| /* confdefs.h */
| #define PACKAGE_NAME ""
| #define PACKAGE_TARNAME ""
| #define PACKAGE_VERSION ""
| #define PACKAGE_STRING ""
| #define PACKAGE_BUGREPORT ""
| #define PACKAGE_URL ""
| #define STDC_HEADERS 1
| #define HAVE_SYS_TYPES_H 1
| #define HAVE_SYS_STAT_H 1
| #define HAVE_STDLIB_H 1
| #define HAVE_STRING_H 1
| #define HAVE_MEMORY_H 1
| #define HAVE_STRINGS_H 1
| #define HAVE_INTTYPES_H 1
| #define HAVE_STDINT_H 1
| #define HAVE_UNISTD_H 1
| #define __EXTENSIONS__ 1
| #define _ALL_SOURCE 1
| #define _GNU_SOURCE 1
| #define _POSIX_PTHREAD_SEMANTICS 1
| #define _TANDEM_SOURCE 1
| #define HAVE_DEV_URANDOM 1
| /* end confdefs.h. */
|
| #if defined(__GNUC__)
| # define ZEND_GCC_VERSION (__GNUC__ * 1000 + __GNUC_MINOR__)
| #else
| # define ZEND_GCC_VERSION 0
| #endif
| #if defined(__GNUC__) && ZEND_GCC_VERSION >= 4008 && defined(i386)
| # define ZEND_VM_FP_GLOBAL_REG "%esi"
| # define ZEND_VM_IP_GLOBAL_REG "%edi"
| #elif defined(__GNUC__) && ZEND_GCC_VERSION >= 4008 && defined(__x86_64__)
| # define ZEND_VM_FP_GLOBAL_REG "%r14"
| # define ZEND_VM_IP_GLOBAL_REG "%r15"
| #elif defined(__GNUC__) && ZEND_GCC_VERSION >= 4008 && defined(__powerpc64__)
| # define ZEND_VM_FP_GLOBAL_REG "r28"
| # define ZEND_VM_IP_GLOBAL_REG "r29"
| #elif defined(__IBMC__) && ZEND_GCC_VERSION >= 4002 && defined(__powerpc64__)
| # define ZEND_VM_FP_GLOBAL_REG "r28"
| # define ZEND_VM_IP_GLOBAL_REG "r29"
| #else
| # error "global register variables are not supported"
| #endif
| typedef int (*opcode_handler_t)(void);
| register void *FP __asm__(ZEND_VM_FP_GLOBAL_REG);
| register const opcode_handler_t *IP __asm__(ZEND_VM_IP_GLOBAL_REG);
| int emu(const opcode_handler_t *ip, void *fp) {
| const opcode_handler_t *orig_ip = IP;
| void *orig_fp = FP;
| IP = ip;
| FP = fp;
| while ((*ip)());
| FP = orig_fp;
| IP = orig_ip;
| }
|
| int
| main ()
| {
|
|
| ;
| return 0;
| }
configure:5638: result: no
configure:5641: checking whether atof() accepts NAN
configure:5672: clang -o conftest -g -O2 -fvisibility=hidden -no-cpp-precomp conftest.c >&5
configure:5672: $? = 0
configure:5672: ./conftest
configure:5672: $? = 1
configure: program exited with status 1
configure: failed program was:
| /* confdefs.h */
| #define PACKAGE_NAME ""
| #define PACKAGE_TARNAME ""
| #define PACKAGE_VERSION ""
| #define PACKAGE_STRING ""
| #define PACKAGE_BUGREPORT ""
| #define PACKAGE_URL ""
| #define STDC_HEADERS 1
| #define HAVE_SYS_TYPES_H 1
| #define HAVE_SYS_STAT_H 1
| #define HAVE_STDLIB_H 1
| #define HAVE_STRING_H 1
| #define HAVE_MEMORY_H 1
| #define HAVE_STRINGS_H 1
| #define HAVE_INTTYPES_H 1
| #define HAVE_STDINT_H 1
| #define HAVE_UNISTD_H 1
| #define __EXTENSIONS__ 1
| #define _ALL_SOURCE 1
| #define _GNU_SOURCE 1
| #define _POSIX_PTHREAD_SEMANTICS 1
| #define _TANDEM_SOURCE 1
| #define HAVE_DEV_URANDOM 1
| /* end confdefs.h. */
|
| #include <math.h>
| #include <stdlib.h>
|
| #ifdef HAVE_ISNAN
| #define zend_isnan(a) isnan(a)
| #elif defined(HAVE_FPCLASS)
| #define zend_isnan(a) ((fpclass(a) == FP_SNAN) || (fpclass(a) == FP_QNAN))
| #else
| #define zend_isnan(a) 0
| #endif
|
| int main(int argc, char** argv)
| {
| return zend_isnan(atof("NAN")) ? 0 : 1;
| }
|
configure:5686: result: no
configure:5694: checking whether atof() accepts INF
configure:5728: clang -o conftest -g -O2 -fvisibility=hidden -no-cpp-precomp conftest.c >&5
configure:5728: $? = 0
configure:5728: ./conftest
configure:5728: $? = 1
configure: program exited with status 1
configure: failed program was:
| /* confdefs.h */
| #define PACKAGE_NAME ""
| #define PACKAGE_TARNAME ""
| #define PACKAGE_VERSION ""
| #define PACKAGE_STRING ""
| #define PACKAGE_BUGREPORT ""
| #define PACKAGE_URL ""
| #define STDC_HEADERS 1
| #define HAVE_SYS_TYPES_H 1
| #define HAVE_SYS_STAT_H 1
| #define HAVE_STDLIB_H 1
| #define HAVE_STRING_H 1
| #define HAVE_MEMORY_H 1
| #define HAVE_STRINGS_H 1
| #define HAVE_INTTYPES_H 1
| #define HAVE_STDINT_H 1
| #define HAVE_UNISTD_H 1
| #define __EXTENSIONS__ 1
| #define _ALL_SOURCE 1
| #define _GNU_SOURCE 1
| #define _POSIX_PTHREAD_SEMANTICS 1
| #define _TANDEM_SOURCE 1
| #define HAVE_DEV_URANDOM 1
| /* end confdefs.h. */
|
| #include <math.h>
| #include <stdlib.h>
|
| #ifdef HAVE_ISINF
| #define zend_isinf(a) isinf(a)
| #elif defined(INFINITY)
| /* Might not work, but is required by ISO C99 */
| #define zend_isinf(a) (((a)==INFINITY)?1:0)
| #elif defined(HAVE_FPCLASS)
| #define zend_isinf(a) ((fpclass(a) == FP_PINF) || (fpclass(a) == FP_NINF))
| #else
| #define zend_isinf(a) 0
| #endif
|
| int main(int argc, char** argv)
| {
| return zend_isinf(atof("INF")) && zend_isinf(atof("-INF")) ? 0 : 1;
| }
|
configure:5742: result: no
configure:5750: checking whether HUGE_VAL == INF
configure:5784: clang -o conftest -g -O2 -fvisibility=hidden -no-cpp-precomp conftest.c >&5
configure:5784: $? = 0
configure:5784: ./conftest
configure:5784: $? = 0
configure:5798: result: yes
configure:5806: checking whether HUGE_VAL + -HUGEVAL == NAN
configure:5842: clang -o conftest -g -O2 -fvisibility=hidden -no-cpp-precomp conftest.c >&5
configure:5842: $? = 0
configure:5842: ./conftest
configure:5842: $? = 1
configure: program exited with status 1
configure: failed program was:
| /* confdefs.h */
| #define PACKAGE_NAME ""
| #define PACKAGE_TARNAME ""
| #define PACKAGE_VERSION ""
| #define PACKAGE_STRING ""
| #define PACKAGE_BUGREPORT ""
| #define PACKAGE_URL ""
| #define STDC_HEADERS 1
| #define HAVE_SYS_TYPES_H 1
| #define HAVE_SYS_STAT_H 1
| #define HAVE_STDLIB_H 1
| #define HAVE_STRING_H 1
| #define HAVE_MEMORY_H 1
| #define HAVE_STRINGS_H 1
| #define HAVE_INTTYPES_H 1
| #define HAVE_STDINT_H 1
| #define HAVE_UNISTD_H 1
| #define __EXTENSIONS__ 1
| #define _ALL_SOURCE 1
| #define _GNU_SOURCE 1
| #define _POSIX_PTHREAD_SEMANTICS 1
| #define _TANDEM_SOURCE 1
| #define HAVE_DEV_URANDOM 1
| #define HAVE_HUGE_VAL_INF 1
| /* end confdefs.h. */
|
| #include <math.h>
| #include <stdlib.h>
|
| #ifdef HAVE_ISNAN
| #define zend_isnan(a) isnan(a)
| #elif defined(HAVE_FPCLASS)
| #define zend_isnan(a) ((fpclass(a) == FP_SNAN) || (fpclass(a) == FP_QNAN))
| #else
| #define zend_isnan(a) 0
| #endif
|
| int main(int argc, char** argv)
| {
| #if defined(__sparc__) && !(__GNUC__ >= 3)
| /* prevent bug #27830 */
| return 1;
| #else
| return zend_isnan(HUGE_VAL + -HUGE_VAL) ? 0 : 1;
| #endif
| }
|
configure:5856: result: no
configure:5864: checking whether __cpuid_count is available
configure:5886: clang -o conftest -g -O2 -fvisibility=hidden -no-cpp-precomp conftest.c >&5
configure:5886: $? = 0
configure:5898: result: yes
configure:6022: clang -o conftest -g -O2 -fvisibility=hidden -no-cpp-precomp conftest.c >&5
configure:6022: $? = 0
configure:6037: checking for pthreads_cflags
configure:6067: clang -o conftest -g -O2 -fvisibility=hidden -kthread -no-cpp-precomp conftest.c >&5
clang: error: unknown argument '-kthread'; did you mean '-pthread'?
configure:6067: $? = 1
configure: failed program was:
| /* confdefs.h */
| #define PACKAGE_NAME ""
| #define PACKAGE_TARNAME ""
| #define PACKAGE_VERSION ""
| #define PACKAGE_STRING ""
| #define PACKAGE_BUGREPORT ""
| #define PACKAGE_URL ""
| #define STDC_HEADERS 1
| #define HAVE_SYS_TYPES_H 1
| #define HAVE_SYS_STAT_H 1
| #define HAVE_STDLIB_H 1
| #define HAVE_STRING_H 1
| #define HAVE_MEMORY_H 1
| #define HAVE_STRINGS_H 1
| #define HAVE_INTTYPES_H 1
| #define HAVE_STDINT_H 1
| #define HAVE_UNISTD_H 1
| #define __EXTENSIONS__ 1
| #define _ALL_SOURCE 1
| #define _GNU_SOURCE 1
| #define _POSIX_PTHREAD_SEMANTICS 1
| #define _TANDEM_SOURCE 1
| #define HAVE_DEV_URANDOM 1
| #define HAVE_HUGE_VAL_INF 1
| #define HAVE_CPUID_COUNT 1
| /* end confdefs.h. */
|
| #include <pthread.h>
| #include <stddef.h>
|
| void *thread_routine(void *data) {
| return data;
| }
|
| int main() {
| pthread_t thd;
| pthread_mutexattr_t mattr;
| int data = 1;
| pthread_mutexattr_init(&mattr);
| return pthread_create(&thd, NULL, thread_routine, &data);
| }
configure:6067: clang -o conftest -g -O2 -fvisibility=hidden -pthread -no-cpp-precomp conftest.c >&5
configure:6067: $? = 0
configure:6088: result: -pthread
configure:6091: checking for pthreads_lib
configure:6121: clang -o conftest -g -O2 -fvisibility=hidden -no-cpp-precomp conftest.c -lpthread >&5
configure:6121: $? = 0
configure:6142: result: pthread
configure:6219: result:
configure:6221: result: Configuring SAPI modules
configure:6255: checking for Apache 2.0 handler-module support via DSO through APXS
configure:6880: result: yes
configure:6918: checking for setproctitle
configure:6918: clang -o conftest -g -O2 -fvisibility=hidden -no-cpp-precomp conftest.c >&5
Undefined symbols for architecture x86_64:
"_setproctitle", referenced from:
_main in conftest-c49ff8.o
ld: symbol(s) not found for architecture x86_64
clang: error: linker command failed with exit code 1 (use -v to see invocation)
configure:6918: $? = 1
configure: failed program was:
| /* confdefs.h */
| #define PACKAGE_NAME ""
| #define PACKAGE_TARNAME ""
| #define PACKAGE_VERSION ""
| #define PACKAGE_STRING ""
| #define PACKAGE_BUGREPORT ""
| #define PACKAGE_URL ""
| #define STDC_HEADERS 1
| #define HAVE_SYS_TYPES_H 1
| #define HAVE_SYS_STAT_H 1
| #define HAVE_STDLIB_H 1
| #define HAVE_STRING_H 1
| #define HAVE_MEMORY_H 1
| #define HAVE_STRINGS_H 1
| #define HAVE_INTTYPES_H 1
| #define HAVE_STDINT_H 1
| #define HAVE_UNISTD_H 1
| #define __EXTENSIONS__ 1
| #define _ALL_SOURCE 1
| #define _GNU_SOURCE 1
| #define _POSIX_PTHREAD_SEMANTICS 1
| #define _TANDEM_SOURCE 1
| #define HAVE_DEV_URANDOM 1
| #define HAVE_HUGE_VAL_INF 1
| #define HAVE_CPUID_COUNT 1
| /* end confdefs.h. */
| /* Define setproctitle to an innocuous variant, in case <limits.h> declares setproctitle.
| For example, HP-UX 11i <limits.h> declares gettimeofday. */
| #define setproctitle innocuous_setproctitle
|
| /* System header to define __stub macros and hopefully few prototypes,
| which can conflict with char setproctitle (); below.
| Prefer <limits.h> to <assert.h> if __STDC__ is defined, since
| <limits.h> exists even on freestanding compilers. */
|
| #ifdef __STDC__
| # include <limits.h>
| #else
| # include <assert.h>
| #endif
|
| #undef setproctitle
|
| /* Override any GCC internal prototype to avoid an error.
| Use char because int might match the return type of a GCC
| builtin and then its argument prototype would still apply. */
| #ifdef __cplusplus
| extern "C"
| #endif
| char setproctitle ();
| /* The GNU C library defines this for functions which it implements
| to always fail with ENOSYS. Some functions are actually named
| something starting with __ and the normal name is an alias. */
| #if defined __stub_setproctitle || defined __stub___setproctitle
| choke me
| #endif
|
| int
| main ()
| {
| return setproctitle ();
| ;
| return 0;
| }
configure:6918: result: no
configure:6930: checking sys/pstat.h usability
configure:6930: clang -c -g -O2 -fvisibility=hidden -no-cpp-precomp conftest.c >&5
conftest.c:60:10: fatal error: 'sys/pstat.h' file not found
#include <sys/pstat.h>
^~~~~~~~~~~~~
1 error generated.
configure:6930: $? = 1
configure: failed program was:
| /* confdefs.h */
| #define PACKAGE_NAME ""
| #define PACKAGE_TARNAME ""
| #define PACKAGE_VERSION ""
| #define PACKAGE_STRING ""
| #define PACKAGE_BUGREPORT ""
| #define PACKAGE_URL ""
| #define STDC_HEADERS 1
| #define HAVE_SYS_TYPES_H 1
| #define HAVE_SYS_STAT_H 1
| #define HAVE_STDLIB_H 1
| #define HAVE_STRING_H 1
| #define HAVE_MEMORY_H 1
| #define HAVE_STRINGS_H 1
| #define HAVE_INTTYPES_H 1
| #define HAVE_STDINT_H 1
| #define HAVE_UNISTD_H 1
| #define __EXTENSIONS__ 1
| #define _ALL_SOURCE 1
| #define _GNU_SOURCE 1
| #define _POSIX_PTHREAD_SEMANTICS 1
| #define _TANDEM_SOURCE 1
| #define HAVE_DEV_URANDOM 1
| #define HAVE_HUGE_VAL_INF 1
| #define HAVE_CPUID_COUNT 1
| /* end confdefs.h. */
| #include <stdio.h>
| #ifdef HAVE_SYS_TYPES_H
| # include <sys/types.h>
| #endif
| #ifdef HAVE_SYS_STAT_H
| # include <sys/stat.h>
| #endif
| #ifdef STDC_HEADERS
| # include <stdlib.h>
| # include <stddef.h>
| #else
| # ifdef HAVE_STDLIB_H
| # include <stdlib.h>
| # endif
| #endif
| #ifdef HAVE_STRING_H
| # if !defined STDC_HEADERS && defined HAVE_MEMORY_H
| # include <memory.h>
| # endif
| # include <string.h>
| #endif
| #ifdef HAVE_STRINGS_H
| # include <strings.h>
| #endif
| #ifdef HAVE_INTTYPES_H
| # include <inttypes.h>
| #endif
| #ifdef HAVE_STDINT_H
| # include <stdint.h>
| #endif
| #ifdef HAVE_UNISTD_H
| # include <unistd.h>
| #endif
| #include <sys/pstat.h>
configure:6930: result: no
configure:6930: checking sys/pstat.h presence
configure:6930: clang -E -no-cpp-precomp conftest.c
conftest.c:27:10: fatal error: 'sys/pstat.h' file not found
#include <sys/pstat.h>
^~~~~~~~~~~~~
1 error generated.
configure:6930: $? = 1
configure: failed program was:
| /* confdefs.h */
| #define PACKAGE_NAME ""
| #define PACKAGE_TARNAME ""
| #define PACKAGE_VERSION ""
| #define PACKAGE_STRING ""
| #define PACKAGE_BUGREPORT ""
| #define PACKAGE_URL ""
| #define STDC_HEADERS 1
| #define HAVE_SYS_TYPES_H 1
| #define HAVE_SYS_STAT_H 1
| #define HAVE_STDLIB_H 1
| #define HAVE_STRING_H 1
| #define HAVE_MEMORY_H 1
| #define HAVE_STRINGS_H 1
| #define HAVE_INTTYPES_H 1
| #define HAVE_STDINT_H 1
| #define HAVE_UNISTD_H 1
| #define __EXTENSIONS__ 1
| #define _ALL_SOURCE 1
| #define _GNU_SOURCE 1
| #define _POSIX_PTHREAD_SEMANTICS 1
| #define _TANDEM_SOURCE 1
| #define HAVE_DEV_URANDOM 1
| #define HAVE_HUGE_VAL_INF 1
| #define HAVE_CPUID_COUNT 1
| /* end confdefs.h. */
| #include <sys/pstat.h>
configure:6930: result: no
configure:6930: checking for sys/pstat.h
configure:6930: result: no
configure:6941: checking for PS_STRINGS
configure:6960: clang -o conftest -g -O2 -fvisibility=hidden -no-cpp-precomp conftest.c >&5
conftest.c:28:10: fatal error: 'sys/exec.h' file not found
#include <sys/exec.h>
^~~~~~~~~~~~
1 error generated.
configure:6960: $? = 1
configure: failed program was:
| /* confdefs.h */
| #define PACKAGE_NAME ""
| #define PACKAGE_TARNAME ""
| #define PACKAGE_VERSION ""
| #define PACKAGE_STRING ""
| #define PACKAGE_BUGREPORT ""
| #define PACKAGE_URL ""
| #define STDC_HEADERS 1
| #define HAVE_SYS_TYPES_H 1
| #define HAVE_SYS_STAT_H 1
| #define HAVE_STDLIB_H 1
| #define HAVE_STRING_H 1
| #define HAVE_MEMORY_H 1
| #define HAVE_STRINGS_H 1
| #define HAVE_INTTYPES_H 1
| #define HAVE_STDINT_H 1
| #define HAVE_UNISTD_H 1
| #define __EXTENSIONS__ 1
| #define _ALL_SOURCE 1
| #define _GNU_SOURCE 1
| #define _POSIX_PTHREAD_SEMANTICS 1
| #define _TANDEM_SOURCE 1
| #define HAVE_DEV_URANDOM 1
| #define HAVE_HUGE_VAL_INF 1
| #define HAVE_CPUID_COUNT 1
| /* end confdefs.h. */
| #include <machine/vmparam.h>
| #include <sys/exec.h>
|
| int
| main ()
| {
| PS_STRINGS->ps_nargvstr = 1;
| PS_STRINGS->ps_argvstr = "foo";
| ;
| return 0;
| }
configure:6968: result: no
configure:6976: checking for CLI build
configure:7135: result: yes
configure:7163: checking for embedded SAPI library support
configure:7362: result: no
configure:7422: checking for FPM build
configure:7425: result: yes
configure:7432: checking for setenv
configure:7432: clang -o conftest -g -O2 -fvisibility=hidden -no-cpp-precomp conftest.c >&5
configure:7432: $? = 0
configure:7432: result: yes
configure:7432: checking for clearenv
configure:7432: clang -o conftest -g -O2 -fvisibility=hidden -no-cpp-precomp conftest.c >&5
Undefined symbols for architecture x86_64:
"_clearenv", referenced from:
_main in conftest-4fd938.o
ld: symbol(s) not found for architecture x86_64
clang: error: linker command failed with exit code 1 (use -v to see invocation)
configure:7432: $? = 1
configure: failed program was:
| /* confdefs.h */
| #define PACKAGE_NAME ""
| #define PACKAGE_TARNAME ""
| #define PACKAGE_VERSION ""
| #define PACKAGE_STRING ""
| #define PACKAGE_BUGREPORT ""
| #define PACKAGE_URL ""
| #define STDC_HEADERS 1
| #define HAVE_SYS_TYPES_H 1
| #define HAVE_SYS_STAT_H 1
| #define HAVE_STDLIB_H 1
| #define HAVE_STRING_H 1
| #define HAVE_MEMORY_H 1
| #define HAVE_STRINGS_H 1
| #define HAVE_INTTYPES_H 1
| #define HAVE_STDINT_H 1
| #define HAVE_UNISTD_H 1
| #define __EXTENSIONS__ 1
| #define _ALL_SOURCE 1
| #define _GNU_SOURCE 1
| #define _POSIX_PTHREAD_SEMANTICS 1
| #define _TANDEM_SOURCE 1
| #define HAVE_DEV_URANDOM 1
| #define HAVE_HUGE_VAL_INF 1
| #define HAVE_CPUID_COUNT 1
| #define HAVE_SETENV 1
| /* end confdefs.h. */
| /* Define clearenv to an innocuous variant, in case <limits.h> declares clearenv.
| For example, HP-UX 11i <limits.h> declares gettimeofday. */
| #define clearenv innocuous_clearenv
|
| /* System header to define __stub macros and hopefully few prototypes,
| which can conflict with char clearenv (); below.
| Prefer <limits.h> to <assert.h> if __STDC__ is defined, since
| <limits.h> exists even on freestanding compilers. */
|
| #ifdef __STDC__
| # include <limits.h>
| #else
| # include <assert.h>
| #endif
|
| #undef clearenv
|
| /* Override any GCC internal prototype to avoid an error.
| Use char because int might match the return type of a GCC
| builtin and then its argument prototype would still apply. */
| #ifdef __cplusplus
| extern "C"
| #endif
| char clearenv ();
| /* The GNU C library defines this for functions which it implements
| to always fail with ENOSYS. Some functions are actually named
| something starting with __ and the normal name is an alias. */
| #if defined __stub_clearenv || defined __stub___clearenv
| choke me
| #endif
|
| int
| main ()
| {
| return clearenv ();
| ;
| return 0;
| }
configure:7432: result: no
configure:7432: checking for setproctitle
configure:7432: result: no
configure:7432: checking for setproctitle_fast
configure:7432: clang -o conftest -g -O2 -fvisibility=hidden -no-cpp-precomp conftest.c >&5
Undefined symbols for architecture x86_64:
"_setproctitle_fast", referenced from:
_main in conftest-fc5bb3.o
ld: symbol(s) not found for architecture x86_64
clang: error: linker command failed with exit code 1 (use -v to see invocation)
configure:7432: $? = 1
configure: failed program was:
| /* confdefs.h */
| #define PACKAGE_NAME ""
| #define PACKAGE_TARNAME ""
| #define PACKAGE_VERSION ""
| #define PACKAGE_STRING ""
| #define PACKAGE_BUGREPORT ""
| #define PACKAGE_URL ""
| #define STDC_HEADERS 1
| #define HAVE_SYS_TYPES_H 1
| #define HAVE_SYS_STAT_H 1
| #define HAVE_STDLIB_H 1
| #define HAVE_STRING_H 1
| #define HAVE_MEMORY_H 1
| #define HAVE_STRINGS_H 1
| #define HAVE_INTTYPES_H 1
| #define HAVE_STDINT_H 1
| #define HAVE_UNISTD_H 1
| #define __EXTENSIONS__ 1
| #define _ALL_SOURCE 1
| #define _GNU_SOURCE 1
| #define _POSIX_PTHREAD_SEMANTICS 1
| #define _TANDEM_SOURCE 1
| #define HAVE_DEV_URANDOM 1
| #define HAVE_HUGE_VAL_INF 1
| #define HAVE_CPUID_COUNT 1
| #define HAVE_SETENV 1
| /* end confdefs.h. */
| /* Define setproctitle_fast to an innocuous variant, in case <limits.h> declares setproctitle_fast.
| For example, HP-UX 11i <limits.h> declares gettimeofday. */
| #define setproctitle_fast innocuous_setproctitle_fast
|
| /* System header to define __stub macros and hopefully few prototypes,
| which can conflict with char setproctitle_fast (); below.
| Prefer <limits.h> to <assert.h> if __STDC__ is defined, since
| <limits.h> exists even on freestanding compilers. */
|
| #ifdef __STDC__
| # include <limits.h>
| #else
| # include <assert.h>
| #endif
|
| #undef setproctitle_fast
|
| /* Override any GCC internal prototype to avoid an error.
| Use char because int might match the return type of a GCC
| builtin and then its argument prototype would still apply. */
| #ifdef __cplusplus
| extern "C"
| #endif
| char setproctitle_fast ();
| /* The GNU C library defines this for functions which it implements
| to always fail with ENOSYS. Some functions are actually named
| something starting with __ and the normal name is an alias. */
| #if defined __stub_setproctitle_fast || defined __stub___setproctitle_fast
| choke me
| #endif
|
| int
| main ()
| {
| return setproctitle_fast ();
| ;
| return 0;
| }
configure:7432: result: no
configure:7442: checking for library containing socket
configure:7473: clang -o conftest -g -O2 -fvisibility=hidden -no-cpp-precomp conftest.c >&5
configure:7473: $? = 0
configure:7490: result: none required
configure:7498: checking for library containing inet_addr
configure:7529: clang -o conftest -g -O2 -fvisibility=hidden -no-cpp-precomp conftest.c >&5
configure:7529: $? = 0
configure:7546: result: none required
configure:7558: checking errno.h usability
configure:7558: clang -c -g -O2 -fvisibility=hidden -no-cpp-precomp conftest.c >&5
configure:7558: $? = 0
configure:7558: result: yes
configure:7558: checking errno.h presence
configure:7558: clang -E -no-cpp-precomp conftest.c
configure:7558: $? = 0
configure:7558: result: yes
configure:7558: checking for errno.h
configure:7558: result: yes
configure:7558: checking fcntl.h usability
configure:7558: clang -c -g -O2 -fvisibility=hidden -no-cpp-precomp conftest.c >&5
configure:7558: $? = 0
configure:7558: result: yes
configure:7558: checking fcntl.h presence
configure:7558: clang -E -no-cpp-precomp conftest.c
configure:7558: $? = 0
configure:7558: result: yes
configure:7558: checking for fcntl.h
configure:7558: result: yes
configure:7558: checking stdio.h usability
configure:7558: clang -c -g -O2 -fvisibility=hidden -no-cpp-precomp conftest.c >&5
configure:7558: $? = 0
configure:7558: result: yes
configure:7558: checking stdio.h presence
configure:7558: clang -E -no-cpp-precomp conftest.c
configure:7558: $? = 0
configure:7558: result: yes
configure:7558: checking for stdio.h
configure:7558: result: yes
configure:7558: checking for stdlib.h
configure:7558: result: yes
configure:7558: checking for unistd.h
configure:7558: result: yes
configure:7558: checking sys/uio.h usability
configure:7558: clang -c -g -O2 -fvisibility=hidden -no-cpp-precomp conftest.c >&5
configure:7558: $? = 0
configure:7558: result: yes
configure:7558: checking sys/uio.h presence
configure:7558: clang -E -no-cpp-precomp conftest.c
configure:7558: $? = 0
configure:7558: result: yes
configure:7558: checking for sys/uio.h
configure:7558: result: yes
configure:7571: checking sys/select.h usability
configure:7571: clang -c -g -O2 -fvisibility=hidden -no-cpp-precomp conftest.c >&5
configure:7571: $? = 0
configure:7571: result: yes
configure:7571: checking sys/select.h presence
configure:7571: clang -E -no-cpp-precomp conftest.c
configure:7571: $? = 0
configure:7571: result: yes
configure:7571: checking for sys/select.h
configure:7571: result: yes
configure:7571: checking sys/socket.h usability
configure:7571: clang -c -g -O2 -fvisibility=hidden -no-cpp-precomp conftest.c >&5
configure:7571: $? = 0
configure:7571: result: yes
configure:7571: checking sys/socket.h presence
configure:7571: clang -E -no-cpp-precomp conftest.c
configure:7571: $? = 0
configure:7571: result: yes
configure:7571: checking for sys/socket.h
configure:7571: result: yes
configure:7571: checking sys/time.h usability
configure:7571: clang -c -g -O2 -fvisibility=hidden -no-cpp-precomp conftest.c >&5
configure:7571: $? = 0
configure:7571: result: yes
configure:7571: checking sys/time.h presence
configure:7571: clang -E -no-cpp-precomp conftest.c
configure:7571: $? = 0
configure:7571: result: yes
configure:7571: checking for sys/time.h
configure:7571: result: yes
configure:7584: checking arpa/inet.h usability
configure:7584: clang -c -g -O2 -fvisibility=hidden -no-cpp-precomp conftest.c >&5
configure:7584: $? = 0
configure:7584: result: yes
configure:7584: checking arpa/inet.h presence
configure:7584: clang -E -no-cpp-precomp conftest.c
configure:7584: $? = 0
configure:7584: result: yes
configure:7584: checking for arpa/inet.h
configure:7584: result: yes
configure:7584: checking netinet/in.h usability
configure:7584: clang -c -g -O2 -fvisibility=hidden -no-cpp-precomp conftest.c >&5
configure:7584: $? = 0
configure:7584: result: yes
configure:7584: checking netinet/in.h presence
configure:7584: clang -E -no-cpp-precomp conftest.c
configure:7584: $? = 0
configure:7584: result: yes
configure:7584: checking for netinet/in.h
configure:7584: result: yes
configure:7596: checking sysexits.h usability
configure:7596: clang -c -g -O2 -fvisibility=hidden -no-cpp-precomp conftest.c >&5
configure:7596: $? = 0
configure:7596: result: yes
configure:7596: checking sysexits.h presence
configure:7596: clang -E -no-cpp-precomp conftest.c
configure:7596: $? = 0
configure:7596: result: yes
configure:7596: checking for sysexits.h
configure:7596: result: yes
configure:7608: checking for prctl
configure:7622: clang -c -g -O2 -fvisibility=hidden -no-cpp-precomp conftest.c >&5
conftest.c:40:10: fatal error: 'sys/prctl.h' file not found
#include <sys/prctl.h>
^~~~~~~~~~~~~
1 error generated.
configure:7622: $? = 1
configure: failed program was:
| /* confdefs.h */
| #define PACKAGE_NAME ""
| #define PACKAGE_TARNAME ""
| #define PACKAGE_VERSION ""
| #define PACKAGE_STRING ""
| #define PACKAGE_BUGREPORT ""
| #define PACKAGE_URL ""
| #define STDC_HEADERS 1
| #define HAVE_SYS_TYPES_H 1
| #define HAVE_SYS_STAT_H 1
| #define HAVE_STDLIB_H 1
| #define HAVE_STRING_H 1
| #define HAVE_MEMORY_H 1
| #define HAVE_STRINGS_H 1
| #define HAVE_INTTYPES_H 1
| #define HAVE_STDINT_H 1
| #define HAVE_UNISTD_H 1
| #define __EXTENSIONS__ 1
| #define _ALL_SOURCE 1
| #define _GNU_SOURCE 1
| #define _POSIX_PTHREAD_SEMANTICS 1
| #define _TANDEM_SOURCE 1
| #define HAVE_DEV_URANDOM 1
| #define HAVE_HUGE_VAL_INF 1
| #define HAVE_CPUID_COUNT 1
| #define HAVE_SETENV 1
| #define HAVE_ERRNO_H 1
| #define HAVE_FCNTL_H 1
| #define HAVE_STDIO_H 1
| #define HAVE_STDLIB_H 1
| #define HAVE_UNISTD_H 1
| #define HAVE_SYS_UIO_H 1
| #define HAVE_SYS_SELECT_H 1
| #define HAVE_SYS_SOCKET_H 1
| #define HAVE_SYS_TIME_H 1
| #define HAVE_ARPA_INET_H 1
| #define HAVE_NETINET_IN_H 1
| #define HAVE_SYSEXITS_H 1
| /* end confdefs.h. */
| #include <sys/prctl.h>
| int
| main ()
| {
| prctl(0, 0, 0, 0, 0);
| ;
| return 0;
| }
configure:7632: result: no
configure:7641: checking for clock_gettime
configure:7655: clang -o conftest -g -O2 -fvisibility=hidden -no-cpp-precomp conftest.c >&5
configure:7655: $? = 0
configure:7658: result: yes
configure:7773: checking for ptrace
configure:7789: clang -c -g -O2 -fvisibility=hidden -no-cpp-precomp conftest.c >&5
configure:7789: $? = 0
configure:7792: result: yes
configure:7804: checking whether ptrace works
configure:7884: clang -o conftest -g -O2 -fvisibility=hidden -no-cpp-precomp conftest.c >&5
conftest.c:71:26: warning: 'ePtAttachDeprecated' is deprecated: PT_ATTACH is deprecated. See PT_ATTACHEXC [-Wdeprecated-declarations]
if (0 > ptrace(PTRACE_ATTACH, child, 0, 0)) {
^
conftest.c:50:29: note: expanded from macro 'PTRACE_ATTACH'
#define PTRACE_ATTACH PT_ATTACH
^
/Library/Developer/CommandLineTools/SDKs/MacOSX11.0.sdk/usr/include/sys/ptrace.h:85:25: note: expanded from macro 'PT_ATTACH'
#define PT_ATTACH ePtAttachDeprecated /* trace some running process */
^
/Library/Developer/CommandLineTools/SDKs/MacOSX11.0.sdk/usr/include/sys/ptrace.h:71:22: note: 'ePtAttachDeprecated' has been explicitly marked deprecated here
ePtAttachDeprecated __deprecated_enum_msg("PT_ATTACH is deprecated. See PT_ATTACHEXC") = 10
^
/Library/Developer/CommandLineTools/SDKs/MacOSX11.0.sdk/usr/include/sys/cdefs.h:206:38: note: expanded from macro '__deprecated_enum_msg'
#define __deprecated_enum_msg(_msg) __deprecated_msg(_msg)
^
/Library/Developer/CommandLineTools/SDKs/MacOSX11.0.sdk/usr/include/sys/cdefs.h:200:48: note: expanded from macro '__deprecated_msg'
#define __deprecated_msg(_msg) __attribute__((__deprecated__(_msg)))
^
1 warning generated.
configure:7884: $? = 0
configure:7884: ./conftest
configure:7884: $? = 2
configure: program exited with status 2
configure: failed program was:
| /* confdefs.h */
| #define PACKAGE_NAME ""
| #define PACKAGE_TARNAME ""
| #define PACKAGE_VERSION ""
| #define PACKAGE_STRING ""
| #define PACKAGE_BUGREPORT ""
| #define PACKAGE_URL ""
| #define STDC_HEADERS 1
| #define HAVE_SYS_TYPES_H 1
| #define HAVE_SYS_STAT_H 1
| #define HAVE_STDLIB_H 1
| #define HAVE_STRING_H 1
| #define HAVE_MEMORY_H 1
| #define HAVE_STRINGS_H 1
| #define HAVE_INTTYPES_H 1
| #define HAVE_STDINT_H 1
| #define HAVE_UNISTD_H 1
| #define __EXTENSIONS__ 1
| #define _ALL_SOURCE 1
| #define _GNU_SOURCE 1
| #define _POSIX_PTHREAD_SEMANTICS 1
| #define _TANDEM_SOURCE 1
| #define HAVE_DEV_URANDOM 1
| #define HAVE_HUGE_VAL_INF 1
| #define HAVE_CPUID_COUNT 1
| #define HAVE_SETENV 1
| #define HAVE_ERRNO_H 1
| #define HAVE_FCNTL_H 1
| #define HAVE_STDIO_H 1
| #define HAVE_STDLIB_H 1
| #define HAVE_UNISTD_H 1
| #define HAVE_SYS_UIO_H 1
| #define HAVE_SYS_SELECT_H 1
| #define HAVE_SYS_SOCKET_H 1
| #define HAVE_SYS_TIME_H 1
| #define HAVE_ARPA_INET_H 1
| #define HAVE_NETINET_IN_H 1
| #define HAVE_SYSEXITS_H 1
| #define HAVE_CLOCK_GETTIME 1
| /* end confdefs.h. */
|
| #include <unistd.h>
| #include <signal.h>
| #include <sys/wait.h>
| #include <sys/types.h>
| #include <sys/ptrace.h>
| #include <errno.h>
|
| #if !defined(PTRACE_ATTACH) && defined(PT_ATTACH)
| #define PTRACE_ATTACH PT_ATTACH
| #endif
|
| #if !defined(PTRACE_DETACH) && defined(PT_DETACH)
| #define PTRACE_DETACH PT_DETACH
| #endif
|
| #if !defined(PTRACE_PEEKDATA) && defined(PT_READ_D)
| #define PTRACE_PEEKDATA PT_READ_D
| #endif
|
| int main()
| {
| long v1 = (unsigned int) -1; /* copy will fail if sizeof(long) == 8 and we've got "int ptrace()" */
| long v2;
| pid_t child;
| int status;
|
| if ( (child = fork()) ) { /* parent */
| int ret = 0;
|
| if (0 > ptrace(PTRACE_ATTACH, child, 0, 0)) {
| return 2;
| }
|
| waitpid(child, &status, 0);
|
| #ifdef PT_IO
| struct ptrace_io_desc ptio = {
| .piod_op = PIOD_READ_D,
| .piod_offs = &v1,
| .piod_addr = &v2,
| .piod_len = sizeof(v1)
| };
|
| if (0 > ptrace(PT_IO, child, (void *) &ptio, 0)) {
| ret = 3;
| }
| #else
| errno = 0;
|
| v2 = ptrace(PTRACE_PEEKDATA, child, (void *) &v1, 0);
|
| if (errno) {
| ret = 4;
| }
| #endif
| ptrace(PTRACE_DETACH, child, (void *) 1, 0);
|
| kill(child, SIGKILL);
|
| return ret ? ret : (v1 != v2);
| }
| else { /* child */
| sleep(10);
| return 0;
| }
| }
|
configure:7893: result: no
configure:7912: checking for mach_vm_read
configure:7930: clang -c -g -O2 -fvisibility=hidden -no-cpp-precomp conftest.c >&5
configure:7930: $? = 0
configure:7933: result: yes
configure:8045: checking if gcc supports __sync_bool_compare_and_swap
configure:8062: clang -o conftest -g -O2 -fvisibility=hidden -no-cpp-precomp conftest.c >&5
configure:8062: $? = 0
configure:8064: result: yes
configure:8082: checking for TCP_INFO
configure:8096: clang -c -g -O2 -fvisibility=hidden -no-cpp-precomp conftest.c >&5
conftest.c:47:17: error: variable has incomplete type 'struct tcp_info'
struct tcp_info ti; int x = TCP_INFO;
^
conftest.c:47:8: note: forward declaration of 'struct tcp_info'
struct tcp_info ti; int x = TCP_INFO;
^
conftest.c:47:29: error: use of undeclared identifier 'TCP_INFO'
struct tcp_info ti; int x = TCP_INFO;
^
2 errors generated.
configure:8096: $? = 1
configure: failed program was:
| /* confdefs.h */
| #define PACKAGE_NAME ""
| #define PACKAGE_TARNAME ""
| #define PACKAGE_VERSION ""
| #define PACKAGE_STRING ""
| #define PACKAGE_BUGREPORT ""
| #define PACKAGE_URL ""
| #define STDC_HEADERS 1
| #define HAVE_SYS_TYPES_H 1
| #define HAVE_SYS_STAT_H 1
| #define HAVE_STDLIB_H 1
| #define HAVE_STRING_H 1
| #define HAVE_MEMORY_H 1
| #define HAVE_STRINGS_H 1
| #define HAVE_INTTYPES_H 1
| #define HAVE_STDINT_H 1
| #define HAVE_UNISTD_H 1
| #define __EXTENSIONS__ 1
| #define _ALL_SOURCE 1
| #define _GNU_SOURCE 1
| #define _POSIX_PTHREAD_SEMANTICS 1
| #define _TANDEM_SOURCE 1
| #define HAVE_DEV_URANDOM 1
| #define HAVE_HUGE_VAL_INF 1
| #define HAVE_CPUID_COUNT 1
| #define HAVE_SETENV 1
| #define HAVE_ERRNO_H 1
| #define HAVE_FCNTL_H 1
| #define HAVE_STDIO_H 1
| #define HAVE_STDLIB_H 1
| #define HAVE_UNISTD_H 1
| #define HAVE_SYS_UIO_H 1
| #define HAVE_SYS_SELECT_H 1
| #define HAVE_SYS_SOCKET_H 1
| #define HAVE_SYS_TIME_H 1
| #define HAVE_ARPA_INET_H 1
| #define HAVE_NETINET_IN_H 1
| #define HAVE_SYSEXITS_H 1
| #define HAVE_CLOCK_GETTIME 1
| #define HAVE_MACH_VM_READ 1
| #define HAVE_BUILTIN_ATOMIC 1
| /* end confdefs.h. */
| #include <netinet/tcp.h>
| int
| main ()
| {
| struct tcp_info ti; int x = TCP_INFO;
| ;
| return 0;
| }
configure:8104: result: no
configure:8117: checking for SO_LISTENQLEN
configure:8131: clang -c -g -O2 -fvisibility=hidden -no-cpp-precomp conftest.c >&5
conftest.c:47:9: error: use of undeclared identifier 'SO_LISTENQLIMIT'
int x = SO_LISTENQLIMIT; int y = SO_LISTENQLEN;
^
conftest.c:47:34: error: use of undeclared identifier 'SO_LISTENQLEN'
int x = SO_LISTENQLIMIT; int y = SO_LISTENQLEN;
^
2 errors generated.
configure:8131: $? = 1
configure: failed program was:
| /* confdefs.h */
| #define PACKAGE_NAME ""
| #define PACKAGE_TARNAME ""
| #define PACKAGE_VERSION ""
| #define PACKAGE_STRING ""
| #define PACKAGE_BUGREPORT ""
| #define PACKAGE_URL ""
| #define STDC_HEADERS 1
| #define HAVE_SYS_TYPES_H 1
| #define HAVE_SYS_STAT_H 1
| #define HAVE_STDLIB_H 1
| #define HAVE_STRING_H 1
| #define HAVE_MEMORY_H 1
| #define HAVE_STRINGS_H 1
| #define HAVE_INTTYPES_H 1
| #define HAVE_STDINT_H 1
| #define HAVE_UNISTD_H 1
| #define __EXTENSIONS__ 1
| #define _ALL_SOURCE 1
| #define _GNU_SOURCE 1
| #define _POSIX_PTHREAD_SEMANTICS 1
| #define _TANDEM_SOURCE 1
| #define HAVE_DEV_URANDOM 1
| #define HAVE_HUGE_VAL_INF 1
| #define HAVE_CPUID_COUNT 1
| #define HAVE_SETENV 1
| #define HAVE_ERRNO_H 1
| #define HAVE_FCNTL_H 1
| #define HAVE_STDIO_H 1
| #define HAVE_STDLIB_H 1
| #define HAVE_UNISTD_H 1
| #define HAVE_SYS_UIO_H 1
| #define HAVE_SYS_SELECT_H 1
| #define HAVE_SYS_SOCKET_H 1
| #define HAVE_SYS_TIME_H 1
| #define HAVE_ARPA_INET_H 1
| #define HAVE_NETINET_IN_H 1
| #define HAVE_SYSEXITS_H 1
| #define HAVE_CLOCK_GETTIME 1
| #define HAVE_MACH_VM_READ 1
| #define HAVE_BUILTIN_ATOMIC 1
| /* end confdefs.h. */
| #include <sys/socket.h>
| int
| main ()
| {
| int x = SO_LISTENQLIMIT; int y = SO_LISTENQLEN;
| ;
| return 0;
| }
configure:8139: result: no
configure:8153: checking for sysconf
configure:8167: clang -c -g -O2 -fvisibility=hidden -no-cpp-precomp conftest.c >&5
configure:8167: $? = 0
configure:8172: result: yes
configure:8184: checking for times
configure:8198: clang -c -g -O2 -fvisibility=hidden -no-cpp-precomp conftest.c >&5
configure:8198: $? = 0
configure:8203: result: yes
configure:8215: checking for kqueue
configure:8239: clang -c -g -O2 -fvisibility=hidden -no-cpp-precomp conftest.c >&5
configure:8239: $? = 0
configure:8244: result: yes
configure:8256: checking for port framework
configure:8279: clang -c -g -O2 -fvisibility=hidden -no-cpp-precomp conftest.c >&5
conftest.c:47:12: fatal error: 'port.h' file not found
#include <port.h>
^~~~~~~~
1 error generated.
configure:8279: $? = 1
configure: failed program was:
| /* confdefs.h */
| #define PACKAGE_NAME ""
| #define PACKAGE_TARNAME ""
| #define PACKAGE_VERSION ""
| #define PACKAGE_STRING ""
| #define PACKAGE_BUGREPORT ""
| #define PACKAGE_URL ""
| #define STDC_HEADERS 1
| #define HAVE_SYS_TYPES_H 1
| #define HAVE_SYS_STAT_H 1
| #define HAVE_STDLIB_H 1
| #define HAVE_STRING_H 1
| #define HAVE_MEMORY_H 1
| #define HAVE_STRINGS_H 1
| #define HAVE_INTTYPES_H 1
| #define HAVE_STDINT_H 1
| #define HAVE_UNISTD_H 1
| #define __EXTENSIONS__ 1
| #define _ALL_SOURCE 1
| #define _GNU_SOURCE 1
| #define _POSIX_PTHREAD_SEMANTICS 1
| #define _TANDEM_SOURCE 1
| #define HAVE_DEV_URANDOM 1
| #define HAVE_HUGE_VAL_INF 1
| #define HAVE_CPUID_COUNT 1
| #define HAVE_SETENV 1
| #define HAVE_ERRNO_H 1
| #define HAVE_FCNTL_H 1
| #define HAVE_STDIO_H 1
| #define HAVE_STDLIB_H 1
| #define HAVE_UNISTD_H 1
| #define HAVE_SYS_UIO_H 1
| #define HAVE_SYS_SELECT_H 1
| #define HAVE_SYS_SOCKET_H 1
| #define HAVE_SYS_TIME_H 1
| #define HAVE_ARPA_INET_H 1
| #define HAVE_NETINET_IN_H 1
| #define HAVE_SYSEXITS_H 1
| #define HAVE_CLOCK_GETTIME 1
| #define HAVE_MACH_VM_READ 1
| #define HAVE_BUILTIN_ATOMIC 1
| #define HAVE_SYSCONF 1
| #define HAVE_TIMES 1
| #define HAVE_KQUEUE 1
| /* end confdefs.h. */
|
| #include <port.h>
|
| int
| main ()
| {
|
| int port;
|
| port = port_create();
| if (port < 0) {
| return 1;
| }
|
| ;
| return 0;
| }
configure:8289: result: no
configure:8296: checking for /dev/poll
configure:8321: clang -c -g -O2 -fvisibility=hidden -no-cpp-precomp conftest.c >&5
conftest.c:48:12: fatal error: 'sys/devpoll.h' file not found
#include <sys/devpoll.h>
^~~~~~~~~~~~~~~
1 error generated.
configure:8321: $? = 1
configure: failed program was:
| /* confdefs.h */
| #define PACKAGE_NAME ""
| #define PACKAGE_TARNAME ""
| #define PACKAGE_VERSION ""
| #define PACKAGE_STRING ""
| #define PACKAGE_BUGREPORT ""
| #define PACKAGE_URL ""
| #define STDC_HEADERS 1
| #define HAVE_SYS_TYPES_H 1
| #define HAVE_SYS_STAT_H 1
| #define HAVE_STDLIB_H 1
| #define HAVE_STRING_H 1
| #define HAVE_MEMORY_H 1
| #define HAVE_STRINGS_H 1
| #define HAVE_INTTYPES_H 1
| #define HAVE_STDINT_H 1
| #define HAVE_UNISTD_H 1
| #define __EXTENSIONS__ 1
| #define _ALL_SOURCE 1
| #define _GNU_SOURCE 1
| #define _POSIX_PTHREAD_SEMANTICS 1
| #define _TANDEM_SOURCE 1
| #define HAVE_DEV_URANDOM 1
| #define HAVE_HUGE_VAL_INF 1
| #define HAVE_CPUID_COUNT 1
| #define HAVE_SETENV 1
| #define HAVE_ERRNO_H 1
| #define HAVE_FCNTL_H 1
| #define HAVE_STDIO_H 1
| #define HAVE_STDLIB_H 1
| #define HAVE_UNISTD_H 1
| #define HAVE_SYS_UIO_H 1
| #define HAVE_SYS_SELECT_H 1
| #define HAVE_SYS_SOCKET_H 1
| #define HAVE_SYS_TIME_H 1
| #define HAVE_ARPA_INET_H 1
| #define HAVE_NETINET_IN_H 1
| #define HAVE_SYSEXITS_H 1
| #define HAVE_CLOCK_GETTIME 1
| #define HAVE_MACH_VM_READ 1
| #define HAVE_BUILTIN_ATOMIC 1
| #define HAVE_SYSCONF 1
| #define HAVE_TIMES 1
| #define HAVE_KQUEUE 1
| /* end confdefs.h. */
|
| #include <stdio.h>
| #include <sys/devpoll.h>
|
| int
| main ()
| {
|
| int n, dp;
| struct dvpoll dvp;
| dp = 0;
| dvp.dp_fds = NULL;
| dvp.dp_nfds = 0;
| dvp.dp_timeout = 0;
| n = ioctl(dp, DP_POLL, &dvp)
|
| ;
| return 0;
| }
configure:8331: result: no
configure:8338: checking for epoll
configure:8374: clang -c -g -O2 -fvisibility=hidden -no-cpp-precomp conftest.c >&5
conftest.c:47:12: fatal error: 'sys/epoll.h' file not found
#include <sys/epoll.h>
^~~~~~~~~~~~~
1 error generated.
configure:8374: $? = 1
configure: failed program was:
| /* confdefs.h */
| #define PACKAGE_NAME ""
| #define PACKAGE_TARNAME ""
| #define PACKAGE_VERSION ""
| #define PACKAGE_STRING ""
| #define PACKAGE_BUGREPORT ""
| #define PACKAGE_URL ""
| #define STDC_HEADERS 1
| #define HAVE_SYS_TYPES_H 1
| #define HAVE_SYS_STAT_H 1
| #define HAVE_STDLIB_H 1
| #define HAVE_STRING_H 1
| #define HAVE_MEMORY_H 1
| #define HAVE_STRINGS_H 1
| #define HAVE_INTTYPES_H 1
| #define HAVE_STDINT_H 1
| #define HAVE_UNISTD_H 1
| #define __EXTENSIONS__ 1
| #define _ALL_SOURCE 1
| #define _GNU_SOURCE 1
| #define _POSIX_PTHREAD_SEMANTICS 1
| #define _TANDEM_SOURCE 1
| #define HAVE_DEV_URANDOM 1
| #define HAVE_HUGE_VAL_INF 1
| #define HAVE_CPUID_COUNT 1
| #define HAVE_SETENV 1
| #define HAVE_ERRNO_H 1
| #define HAVE_FCNTL_H 1
| #define HAVE_STDIO_H 1
| #define HAVE_STDLIB_H 1
| #define HAVE_UNISTD_H 1
| #define HAVE_SYS_UIO_H 1
| #define HAVE_SYS_SELECT_H 1
| #define HAVE_SYS_SOCKET_H 1
| #define HAVE_SYS_TIME_H 1
| #define HAVE_ARPA_INET_H 1
| #define HAVE_NETINET_IN_H 1
| #define HAVE_SYSEXITS_H 1
| #define HAVE_CLOCK_GETTIME 1
| #define HAVE_MACH_VM_READ 1
| #define HAVE_BUILTIN_ATOMIC 1
| #define HAVE_SYSCONF 1
| #define HAVE_TIMES 1
| #define HAVE_KQUEUE 1
| /* end confdefs.h. */
|
| #include <sys/epoll.h>
|
| int
| main ()
| {
|
| int epollfd;
| struct epoll_event e;
|
| epollfd = epoll_create(1);
| if (epollfd < 0) {
| return 1;
| }
|
| e.events = EPOLLIN | EPOLLET;
| e.data.fd = 0;
|
| if (epoll_ctl(epollfd, EPOLL_CTL_ADD, 0, &e) == -1) {
| return 1;
| }
|
| e.events = 0;
| if (epoll_wait(epollfd, &e, 1, 1) < 0) {
| return 1;
| }
|
| ;
| return 0;
| }
configure:8384: result: no
configure:8391: checking for poll
configure:8417: clang -c -g -O2 -fvisibility=hidden -no-cpp-precomp conftest.c >&5
configure:8417: $? = 0
configure:8422: result: yes
configure:8434: checking for select
configure:8465: clang -c -g -O2 -fvisibility=hidden -no-cpp-precomp conftest.c >&5
configure:8465: $? = 0
configure:8470: result: yes
configure:8482: checking for apparmor
configure:8499: clang -o conftest -g -O2 -fvisibility=hidden -no-cpp-precomp conftest.c -lapparmor >&5
conftest.c:48:10: fatal error: 'sys/apparmor.h' file not found
#include <sys/apparmor.h>
^~~~~~~~~~~~~~~~
1 error generated.
configure:8499: $? = 1
configure: failed program was:
| /* confdefs.h */
| #define PACKAGE_NAME ""
| #define PACKAGE_TARNAME ""
| #define PACKAGE_VERSION ""
| #define PACKAGE_STRING ""
| #define PACKAGE_BUGREPORT ""
| #define PACKAGE_URL ""
| #define STDC_HEADERS 1
| #define HAVE_SYS_TYPES_H 1
| #define HAVE_SYS_STAT_H 1
| #define HAVE_STDLIB_H 1
| #define HAVE_STRING_H 1
| #define HAVE_MEMORY_H 1
| #define HAVE_STRINGS_H 1
| #define HAVE_INTTYPES_H 1
| #define HAVE_STDINT_H 1
| #define HAVE_UNISTD_H 1
| #define __EXTENSIONS__ 1
| #define _ALL_SOURCE 1
| #define _GNU_SOURCE 1
| #define _POSIX_PTHREAD_SEMANTICS 1
| #define _TANDEM_SOURCE 1
| #define HAVE_DEV_URANDOM 1
| #define HAVE_HUGE_VAL_INF 1
| #define HAVE_CPUID_COUNT 1
| #define HAVE_SETENV 1
| #define HAVE_ERRNO_H 1
| #define HAVE_FCNTL_H 1
| #define HAVE_STDIO_H 1
| #define HAVE_STDLIB_H 1
| #define HAVE_UNISTD_H 1
| #define HAVE_SYS_UIO_H 1
| #define HAVE_SYS_SELECT_H 1
| #define HAVE_SYS_SOCKET_H 1
| #define HAVE_SYS_TIME_H 1
| #define HAVE_ARPA_INET_H 1
| #define HAVE_NETINET_IN_H 1
| #define HAVE_SYSEXITS_H 1
| #define HAVE_CLOCK_GETTIME 1
| #define HAVE_MACH_VM_READ 1
| #define HAVE_BUILTIN_ATOMIC 1
| #define HAVE_SYSCONF 1
| #define HAVE_TIMES 1
| #define HAVE_KQUEUE 1
| #define HAVE_POLL 1
| #define HAVE_SELECT 1
| /* end confdefs.h. */
| #include <sys/apparmor.h>
| int
| main ()
| {
| change_hat("test", 0);
| ;
| return 0;
| }
configure:8510: result: no
configure:9206: checking for LiteSpeed support
configure:9376: result: no
configure:9386: checking for phpdbg support
configure:9421: result: yes
configure:9430: checking for phpdbg web SAPI support
configure:9465: result: yes
configure:9474: checking for phpdbg debug build
configure:9488: result: no
configure:9497: checking for phpdbg readline support
configure:9511: result: yes
configure:9518: checking whether termios.h defines TIOCGWINSZ
configure:9541: result: yes
configure:9595: checking for phpdbg and readline integration
configure:9603: result: ok
configure:10043: checking for CGI build
configure:10046: result: yes
configure:10048: checking for socklen_t in sys/socket.h
configure:10057: result: yes
configure:10069: checking for sun_len in sys/un.h
configure:10078: result: yes
configure:10090: checking whether cross-process locking is required by accept()
configure:10101: result: no
configure:10251: checking for chosen SAPI module
configure:10253: result: apache2handler
configure:10256: checking for executable SAPI binaries
configure:10259: result: cli fpm phpdbg cgi
configure:10312: result:
configure:10314: result: Running system checks
configure:10322: checking for sendmail
configure:10341: found /usr/sbin/sendmail
configure:10354: result: /usr/sbin/sendmail
configure:10368: checking whether system uses EBCDIC
configure:10387: clang -o conftest -g -O2 -fvisibility=hidden -no-cpp-precomp conftest.c >&5
configure:10387: $? = 0
configure:10387: ./conftest
configure:10387: $? = 1
configure: program exited with status 1
configure: failed program was:
| /* confdefs.h */
| #define PACKAGE_NAME ""
| #define PACKAGE_TARNAME ""
| #define PACKAGE_VERSION ""
| #define PACKAGE_STRING ""
| #define PACKAGE_BUGREPORT ""
| #define PACKAGE_URL ""
| #define STDC_HEADERS 1
| #define HAVE_SYS_TYPES_H 1
| #define HAVE_SYS_STAT_H 1
| #define HAVE_STDLIB_H 1
| #define HAVE_STRING_H 1
| #define HAVE_MEMORY_H 1
| #define HAVE_STRINGS_H 1
| #define HAVE_INTTYPES_H 1
| #define HAVE_STDINT_H 1
| #define HAVE_UNISTD_H 1
| #define __EXTENSIONS__ 1
| #define _ALL_SOURCE 1
| #define _GNU_SOURCE 1
| #define _POSIX_PTHREAD_SEMANTICS 1
| #define _TANDEM_SOURCE 1
| #define HAVE_DEV_URANDOM 1
| #define HAVE_HUGE_VAL_INF 1
| #define HAVE_CPUID_COUNT 1
| #define HAVE_SETENV 1
| #define HAVE_ERRNO_H 1
| #define HAVE_FCNTL_H 1
| #define HAVE_STDIO_H 1
| #define HAVE_STDLIB_H 1
| #define HAVE_UNISTD_H 1
| #define HAVE_SYS_UIO_H 1
| #define HAVE_SYS_SELECT_H 1
| #define HAVE_SYS_SOCKET_H 1
| #define HAVE_SYS_TIME_H 1
| #define HAVE_ARPA_INET_H 1
| #define HAVE_NETINET_IN_H 1
| #define HAVE_SYSEXITS_H 1
| #define HAVE_CLOCK_GETTIME 1
| #define HAVE_MACH_VM_READ 1
| #define HAVE_BUILTIN_ATOMIC 1
| #define HAVE_SYSCONF 1
| #define HAVE_TIMES 1
| #define HAVE_KQUEUE 1
| #define HAVE_POLL 1
| #define HAVE_SELECT 1
| #define PHP_FPM_SYSTEMD "simple"
| #define PHP_FPM_USER "_www"
| #define PHP_FPM_GROUP "_www"
| #define HAVE_PHPDBG 1
| #define PHPDBG_DEBUG 0
| #define HAVE_PHPDBG_READLINE 1
| #define HAVE_SOCKLEN_T 1
| #define HAVE_SOCKADDR_UN_SUN_LEN 1
| /* end confdefs.h. */
|
| int main(void) {
| return (unsigned char)'A' != (unsigned char)0xC1;
| }
|
configure:10401: result: no
configure:10410: checking whether byte ordering is bigendian
configure:10436: clang -o conftest -g -O2 -fvisibility=hidden -no-cpp-precomp conftest.c >&5
configure:10436: $? = 0
configure:10436: ./conftest
configure:10436: $? = 1
configure: program exited with status 1
configure: failed program was:
| /* confdefs.h */
| #define PACKAGE_NAME ""
| #define PACKAGE_TARNAME ""
| #define PACKAGE_VERSION ""
| #define PACKAGE_STRING ""
| #define PACKAGE_BUGREPORT ""
| #define PACKAGE_URL ""
| #define STDC_HEADERS 1
| #define HAVE_SYS_TYPES_H 1
| #define HAVE_SYS_STAT_H 1
| #define HAVE_STDLIB_H 1
| #define HAVE_STRING_H 1
| #define HAVE_MEMORY_H 1
| #define HAVE_STRINGS_H 1
| #define HAVE_INTTYPES_H 1
| #define HAVE_STDINT_H 1
| #define HAVE_UNISTD_H 1
| #define __EXTENSIONS__ 1
| #define _ALL_SOURCE 1
| #define _GNU_SOURCE 1
| #define _POSIX_PTHREAD_SEMANTICS 1
| #define _TANDEM_SOURCE 1
| #define HAVE_DEV_URANDOM 1
| #define HAVE_HUGE_VAL_INF 1
| #define HAVE_CPUID_COUNT 1
| #define HAVE_SETENV 1
| #define HAVE_ERRNO_H 1
| #define HAVE_FCNTL_H 1
| #define HAVE_STDIO_H 1
| #define HAVE_STDLIB_H 1
| #define HAVE_UNISTD_H 1
| #define HAVE_SYS_UIO_H 1
| #define HAVE_SYS_SELECT_H 1
| #define HAVE_SYS_SOCKET_H 1
| #define HAVE_SYS_TIME_H 1
| #define HAVE_ARPA_INET_H 1
| #define HAVE_NETINET_IN_H 1
| #define HAVE_SYSEXITS_H 1
| #define HAVE_CLOCK_GETTIME 1
| #define HAVE_MACH_VM_READ 1
| #define HAVE_BUILTIN_ATOMIC 1
| #define HAVE_SYSCONF 1
| #define HAVE_TIMES 1
| #define HAVE_KQUEUE 1
| #define HAVE_POLL 1
| #define HAVE_SELECT 1
| #define PHP_FPM_SYSTEMD "simple"
| #define PHP_FPM_USER "_www"
| #define PHP_FPM_GROUP "_www"
| #define HAVE_PHPDBG 1
| #define PHPDBG_DEBUG 0
| #define HAVE_PHPDBG_READLINE 1
| #define HAVE_SOCKLEN_T 1
| #define HAVE_SOCKADDR_UN_SUN_LEN 1
| /* end confdefs.h. */
|
| int main(void)
| {
| short one = 1;
| char *cp = (char *)&one;
|
| if (*cp == 0) {
| return(0);
| } else {
| return(1);
| }
| }
|
configure:10447: result: no
configure:10457: checking whether writing to stdout works
configure:10486: clang -o conftest -g -O2 -fvisibility=hidden -no-cpp-precomp conftest.c >&5
conftest.c:63:1: warning: type specifier missing, defaults to 'int' [-Wimplicit-int]
main()
^
1 warning generated.
configure:10486: $? = 0
configure:10486: ./conftest
configure:10486: $? = 0
configure:10501: result: yes
configure:10560: checking for socket
configure:10560: clang -o conftest -g -O2 -fvisibility=hidden -no-cpp-precomp conftest.c >&5
configure:10560: $? = 0
configure:10560: result: yes
configure:10728: checking for socketpair
configure:10728: clang -o conftest -g -O2 -fvisibility=hidden -no-cpp-precomp conftest.c >&5
configure:10728: $? = 0
configure:10728: result: yes
configure:10896: checking for htonl
configure:10896: clang -o conftest -g -O2 -fvisibility=hidden -no-cpp-precomp conftest.c >&5
configure:10896: $? = 0
configure:10896: result: yes
configure:11064: checking for gethostname
configure:11064: clang -o conftest -g -O2 -fvisibility=hidden -no-cpp-precomp conftest.c >&5
configure:11064: $? = 0
configure:11064: result: yes
configure:11232: checking for gethostbyaddr
configure:11232: clang -o conftest -g -O2 -fvisibility=hidden -no-cpp-precomp conftest.c >&5
configure:11232: $? = 0
configure:11232: result: yes
configure:11400: checking for yp_get_default_domain
configure:11400: clang -o conftest -g -O2 -fvisibility=hidden -no-cpp-precomp conftest.c >&5
configure:11400: $? = 0
configure:11400: result: yes
configure:11569: checking for dlopen
configure:11569: clang -o conftest -g -O2 -fvisibility=hidden -no-cpp-precomp conftest.c >&5
configure:11569: $? = 0
configure:11569: result: yes
configure:11737: checking for sin in -lm
configure:11762: clang -o conftest -g -O2 -fvisibility=hidden -no-cpp-precomp conftest.c -lm >&5
conftest.c:72:6: warning: incompatible redeclaration of library function 'sin' [-Wincompatible-library-redeclaration]
char sin ();
^
conftest.c:72:6: note: 'sin' is a builtin with type 'double (double)'
1 warning generated.
configure:11762: $? = 0
configure:11771: result: yes
configure:11788: checking for inet_aton
configure:11788: clang -o conftest -g -O2 -fvisibility=hidden -no-cpp-precomp conftest.c -lm >&5
configure:11788: $? = 0
configure:11788: result: yes
configure:12088: checking for ANSI C header files
configure:12192: result: yes
configure:12203: checking for dirent.h that defines DIR
configure:12222: clang -c -g -O2 -fvisibility=hidden -no-cpp-precomp conftest.c >&5
configure:12222: $? = 0
configure:12230: result: yes
configure:12243: checking for library containing opendir
configure:12274: clang -o conftest -g -O2 -fvisibility=hidden -no-cpp-precomp conftest.c -lm >&5
configure:12274: $? = 0
configure:12291: result: none required
configure:12421: checking for inttypes.h
configure:12421: result: yes
configure:12421: checking for stdint.h
configure:12421: result: yes
configure:12421: checking for dirent.h
configure:12421: clang -c -g -O2 -fvisibility=hidden -no-cpp-precomp conftest.c >&5
configure:12421: $? = 0
configure:12421: result: yes
configure:12421: checking for ApplicationServices/ApplicationServices.h
configure:12421: clang -c -g -O2 -fvisibility=hidden -no-cpp-precomp conftest.c >&5
configure:12421: $? = 0
configure:12421: result: yes
configure:12421: checking for sys/param.h
configure:12421: clang -c -g -O2 -fvisibility=hidden -no-cpp-precomp conftest.c >&5
configure:12421: $? = 0
configure:12421: result: yes
configure:12421: checking for sys/types.h
configure:12421: result: yes
configure:12421: checking for sys/time.h
configure:12421: result: yes
configure:12421: checking for netinet/in.h
configure:12421: result: yes
configure:12421: checking for alloca.h
configure:12421: clang -c -g -O2 -fvisibility=hidden -no-cpp-precomp conftest.c >&5
configure:12421: $? = 0
configure:12421: result: yes
configure:12421: checking for arpa/inet.h
configure:12421: result: yes
configure:12421: checking for arpa/nameser.h
configure:12421: clang -c -g -O2 -fvisibility=hidden -no-cpp-precomp conftest.c >&5
configure:12421: $? = 0
configure:12421: result: yes
configure:12421: checking for assert.h
configure:12421: clang -c -g -O2 -fvisibility=hidden -no-cpp-precomp conftest.c >&5
configure:12421: $? = 0
configure:12421: result: yes
configure:12421: checking for crypt.h
configure:12421: clang -c -g -O2 -fvisibility=hidden -no-cpp-precomp conftest.c >&5
conftest.c:99:10: fatal error: 'crypt.h' file not found
#include <crypt.h>
^~~~~~~~~
1 error generated.
configure:12421: $? = 1
configure: failed program was:
| /* confdefs.h */
| #define PACKAGE_NAME ""
| #define PACKAGE_TARNAME ""
| #define PACKAGE_VERSION ""
| #define PACKAGE_STRING ""
| #define PACKAGE_BUGREPORT ""
| #define PACKAGE_URL ""
| #define STDC_HEADERS 1
| #define HAVE_SYS_TYPES_H 1
| #define HAVE_SYS_STAT_H 1
| #define HAVE_STDLIB_H 1
| #define HAVE_STRING_H 1
| #define HAVE_MEMORY_H 1
| #define HAVE_STRINGS_H 1
| #define HAVE_INTTYPES_H 1
| #define HAVE_STDINT_H 1
| #define HAVE_UNISTD_H 1
| #define __EXTENSIONS__ 1
| #define _ALL_SOURCE 1
| #define _GNU_SOURCE 1
| #define _POSIX_PTHREAD_SEMANTICS 1
| #define _TANDEM_SOURCE 1
| #define HAVE_DEV_URANDOM 1
| #define HAVE_HUGE_VAL_INF 1
| #define HAVE_CPUID_COUNT 1
| #define HAVE_SETENV 1
| #define HAVE_ERRNO_H 1
| #define HAVE_FCNTL_H 1
| #define HAVE_STDIO_H 1
| #define HAVE_STDLIB_H 1
| #define HAVE_UNISTD_H 1
| #define HAVE_SYS_UIO_H 1
| #define HAVE_SYS_SELECT_H 1
| #define HAVE_SYS_SOCKET_H 1
| #define HAVE_SYS_TIME_H 1
| #define HAVE_ARPA_INET_H 1
| #define HAVE_NETINET_IN_H 1
| #define HAVE_SYSEXITS_H 1
| #define HAVE_CLOCK_GETTIME 1
| #define HAVE_MACH_VM_READ 1
| #define HAVE_BUILTIN_ATOMIC 1
| #define HAVE_SYSCONF 1
| #define HAVE_TIMES 1
| #define HAVE_KQUEUE 1
| #define HAVE_POLL 1
| #define HAVE_SELECT 1
| #define PHP_FPM_SYSTEMD "simple"
| #define PHP_FPM_USER "_www"
| #define PHP_FPM_GROUP "_www"
| #define HAVE_PHPDBG 1
| #define PHPDBG_DEBUG 0
| #define HAVE_PHPDBG_READLINE 1
| #define HAVE_SOCKLEN_T 1
| #define HAVE_SOCKADDR_UN_SUN_LEN 1
| #define PHP_WRITE_STDOUT 1
| #define HAVE_SOCKET 1
| #define HAVE_SOCKETPAIR 1
| #define HAVE_HTONL 1
| #define HAVE_GETHOSTNAME 1
| #define HAVE_GETHOSTBYADDR 1
| #define HAVE_YP_GET_DEFAULT_DOMAIN 1
| #define HAVE_DLOPEN 1
| #define HAVE_LIBDL 1
| #define HAVE_LIBM 1
| #define HAVE_INET_ATON 1
| #define STDC_HEADERS 1
| #define HAVE_DIRENT_H 1
| #define HAVE_INTTYPES_H 1
| #define HAVE_STDINT_H 1
| #define HAVE_DIRENT_H 1
| #define HAVE_APPLICATIONSERVICES_APPLICATIONSERVICES_H 1
| #define HAVE_SYS_PARAM_H 1
| #define HAVE_SYS_TYPES_H 1
| #define HAVE_SYS_TIME_H 1
| #define HAVE_NETINET_IN_H 1
| #define HAVE_ALLOCA_H 1
| #define HAVE_ARPA_INET_H 1
| #define HAVE_ARPA_NAMESER_H 1
| #define HAVE_ASSERT_H 1
| /* end confdefs.h. */
|
| #ifdef HAVE_SYS_PARAM_H
| #include <sys/param.h>
| #endif
| #ifdef HAVE_SYS_TYPES_H
| #include <sys/types.h>
| #endif
| #ifdef HAVE_SYS_TIME_H
| #include <sys/time.h>
| #endif
| #ifdef HAVE_NETINET_IN_H
| #include <netinet/in.h>
| #endif
| #ifdef HAVE_ARPA_NAMESER_H
| #include <arpa/nameser.h>
| #endif
|
|
| #include <crypt.h>
configure:12421: result: no
configure:12421: checking for dns.h
configure:12421: clang -c -g -O2 -fvisibility=hidden -no-cpp-precomp conftest.c >&5
configure:12421: $? = 0
configure:12421: result: yes
configure:12421: checking for fcntl.h
configure:12421: result: yes
configure:12421: checking for grp.h
configure:12421: clang -c -g -O2 -fvisibility=hidden -no-cpp-precomp conftest.c >&5
configure:12421: $? = 0
configure:12421: result: yes
configure:12421: checking for ieeefp.h
configure:12421: clang -c -g -O2 -fvisibility=hidden -no-cpp-precomp conftest.c >&5
conftest.c:102:10: fatal error: 'ieeefp.h' file not found
#include <ieeefp.h>
^~~~~~~~~~
1 error generated.
configure:12421: $? = 1
configure: failed program was:
| /* confdefs.h */
| #define PACKAGE_NAME ""
| #define PACKAGE_TARNAME ""
| #define PACKAGE_VERSION ""
| #define PACKAGE_STRING ""
| #define PACKAGE_BUGREPORT ""
| #define PACKAGE_URL ""
| #define STDC_HEADERS 1
| #define HAVE_SYS_TYPES_H 1
| #define HAVE_SYS_STAT_H 1
| #define HAVE_STDLIB_H 1
| #define HAVE_STRING_H 1
| #define HAVE_MEMORY_H 1
| #define HAVE_STRINGS_H 1
| #define HAVE_INTTYPES_H 1
| #define HAVE_STDINT_H 1
| #define HAVE_UNISTD_H 1
| #define __EXTENSIONS__ 1
| #define _ALL_SOURCE 1
| #define _GNU_SOURCE 1
| #define _POSIX_PTHREAD_SEMANTICS 1
| #define _TANDEM_SOURCE 1
| #define HAVE_DEV_URANDOM 1
| #define HAVE_HUGE_VAL_INF 1
| #define HAVE_CPUID_COUNT 1
| #define HAVE_SETENV 1
| #define HAVE_ERRNO_H 1
| #define HAVE_FCNTL_H 1
| #define HAVE_STDIO_H 1
| #define HAVE_STDLIB_H 1
| #define HAVE_UNISTD_H 1
| #define HAVE_SYS_UIO_H 1
| #define HAVE_SYS_SELECT_H 1
| #define HAVE_SYS_SOCKET_H 1
| #define HAVE_SYS_TIME_H 1
| #define HAVE_ARPA_INET_H 1
| #define HAVE_NETINET_IN_H 1
| #define HAVE_SYSEXITS_H 1
| #define HAVE_CLOCK_GETTIME 1
| #define HAVE_MACH_VM_READ 1
| #define HAVE_BUILTIN_ATOMIC 1
| #define HAVE_SYSCONF 1
| #define HAVE_TIMES 1
| #define HAVE_KQUEUE 1
| #define HAVE_POLL 1
| #define HAVE_SELECT 1
| #define PHP_FPM_SYSTEMD "simple"
| #define PHP_FPM_USER "_www"
| #define PHP_FPM_GROUP "_www"
| #define HAVE_PHPDBG 1
| #define PHPDBG_DEBUG 0
| #define HAVE_PHPDBG_READLINE 1
| #define HAVE_SOCKLEN_T 1
| #define HAVE_SOCKADDR_UN_SUN_LEN 1
| #define PHP_WRITE_STDOUT 1
| #define HAVE_SOCKET 1
| #define HAVE_SOCKETPAIR 1
| #define HAVE_HTONL 1
| #define HAVE_GETHOSTNAME 1
| #define HAVE_GETHOSTBYADDR 1
| #define HAVE_YP_GET_DEFAULT_DOMAIN 1
| #define HAVE_DLOPEN 1
| #define HAVE_LIBDL 1
| #define HAVE_LIBM 1
| #define HAVE_INET_ATON 1
| #define STDC_HEADERS 1
| #define HAVE_DIRENT_H 1
| #define HAVE_INTTYPES_H 1
| #define HAVE_STDINT_H 1
| #define HAVE_DIRENT_H 1
| #define HAVE_APPLICATIONSERVICES_APPLICATIONSERVICES_H 1
| #define HAVE_SYS_PARAM_H 1
| #define HAVE_SYS_TYPES_H 1
| #define HAVE_SYS_TIME_H 1
| #define HAVE_NETINET_IN_H 1
| #define HAVE_ALLOCA_H 1
| #define HAVE_ARPA_INET_H 1
| #define HAVE_ARPA_NAMESER_H 1
| #define HAVE_ASSERT_H 1
| #define HAVE_DNS_H 1
| #define HAVE_FCNTL_H 1
| #define HAVE_GRP_H 1
| /* end confdefs.h. */
|
| #ifdef HAVE_SYS_PARAM_H
| #include <sys/param.h>
| #endif
| #ifdef HAVE_SYS_TYPES_H
| #include <sys/types.h>
| #endif
| #ifdef HAVE_SYS_TIME_H
| #include <sys/time.h>
| #endif
| #ifdef HAVE_NETINET_IN_H
| #include <netinet/in.h>
| #endif
| #ifdef HAVE_ARPA_NAMESER_H
| #include <arpa/nameser.h>
| #endif
|
|
| #include <ieeefp.h>
configure:12421: result: no
configure:12421: checking for langinfo.h
configure:12421: clang -c -g -O2 -fvisibility=hidden -no-cpp-precomp conftest.c >&5
configure:12421: $? = 0
configure:12421: result: yes
configure:12421: checking for limits.h
configure:12421: clang -c -g -O2 -fvisibility=hidden -no-cpp-precomp conftest.c >&5
configure:12421: $? = 0
configure:12421: result: yes
configure:12421: checking for locale.h
configure:12421: clang -c -g -O2 -fvisibility=hidden -no-cpp-precomp conftest.c >&5
configure:12421: $? = 0
configure:12421: result: yes
configure:12421: checking for monetary.h
configure:12421: clang -c -g -O2 -fvisibility=hidden -no-cpp-precomp conftest.c >&5
configure:12421: $? = 0
configure:12421: result: yes
configure:12421: checking for netdb.h
configure:12421: clang -c -g -O2 -fvisibility=hidden -no-cpp-precomp conftest.c >&5
configure:12421: $? = 0
configure:12421: result: yes
configure:12421: checking for poll.h
configure:12421: clang -c -g -O2 -fvisibility=hidden -no-cpp-precomp conftest.c >&5
configure:12421: $? = 0
configure:12421: result: yes
configure:12421: checking for pwd.h
configure:12421: clang -c -g -O2 -fvisibility=hidden -no-cpp-precomp conftest.c >&5
configure:12421: $? = 0
configure:12421: result: yes
configure:12421: checking for resolv.h
configure:12421: clang -c -g -O2 -fvisibility=hidden -no-cpp-precomp conftest.c >&5
configure:12421: $? = 0
configure:12421: result: yes
configure:12421: checking for signal.h
configure:12421: clang -c -g -O2 -fvisibility=hidden -no-cpp-precomp conftest.c >&5
configure:12421: $? = 0
configure:12421: result: yes
configure:12421: checking for stdarg.h
configure:12421: clang -c -g -O2 -fvisibility=hidden -no-cpp-precomp conftest.c >&5
configure:12421: $? = 0
configure:12421: result: yes
configure:12421: checking for stdlib.h
configure:12421: result: yes
configure:12421: checking for string.h
configure:12421: result: yes
configure:12421: checking for syslog.h
configure:12421: clang -c -g -O2 -fvisibility=hidden -no-cpp-precomp conftest.c >&5
configure:12421: $? = 0
configure:12421: result: yes
configure:12421: checking for sysexits.h
configure:12421: result: yes
configure:12421: checking for sys/ioctl.h
configure:12421: clang -c -g -O2 -fvisibility=hidden -no-cpp-precomp conftest.c >&5
configure:12421: $? = 0
configure:12421: result: yes
configure:12421: checking for sys/file.h
configure:12421: clang -c -g -O2 -fvisibility=hidden -no-cpp-precomp conftest.c >&5
configure:12421: $? = 0
configure:12421: result: yes
configure:12421: checking for sys/mman.h
configure:12421: clang -c -g -O2 -fvisibility=hidden -no-cpp-precomp conftest.c >&5
configure:12421: $? = 0
configure:12421: result: yes
configure:12421: checking for sys/mount.h
configure:12421: clang -c -g -O2 -fvisibility=hidden -no-cpp-precomp conftest.c >&5
configure:12421: $? = 0
configure:12421: result: yes
configure:12421: checking for sys/poll.h
configure:12421: clang -c -g -O2 -fvisibility=hidden -no-cpp-precomp conftest.c >&5
configure:12421: $? = 0
configure:12421: result: yes
configure:12421: checking for sys/resource.h
configure:12421: clang -c -g -O2 -fvisibility=hidden -no-cpp-precomp conftest.c >&5
configure:12421: $? = 0
configure:12421: result: yes
configure:12421: checking for sys/select.h
configure:12421: result: yes
configure:12421: checking for sys/socket.h
configure:12421: result: yes
configure:12421: checking for sys/stat.h
configure:12421: result: yes
configure:12421: checking for sys/statfs.h
configure:12421: clang -c -g -O2 -fvisibility=hidden -no-cpp-precomp conftest.c >&5
conftest.c:125:10: fatal error: 'sys/statfs.h' file not found
#include <sys/statfs.h>
^~~~~~~~~~~~~~
1 error generated.
configure:12421: $? = 1
configure: failed program was:
| /* confdefs.h */
| #define PACKAGE_NAME ""
| #define PACKAGE_TARNAME ""
| #define PACKAGE_VERSION ""
| #define PACKAGE_STRING ""
| #define PACKAGE_BUGREPORT ""
| #define PACKAGE_URL ""
| #define STDC_HEADERS 1
| #define HAVE_SYS_TYPES_H 1
| #define HAVE_SYS_STAT_H 1
| #define HAVE_STDLIB_H 1
| #define HAVE_STRING_H 1
| #define HAVE_MEMORY_H 1
| #define HAVE_STRINGS_H 1
| #define HAVE_INTTYPES_H 1
| #define HAVE_STDINT_H 1
| #define HAVE_UNISTD_H 1
| #define __EXTENSIONS__ 1
| #define _ALL_SOURCE 1
| #define _GNU_SOURCE 1
| #define _POSIX_PTHREAD_SEMANTICS 1
| #define _TANDEM_SOURCE 1
| #define HAVE_DEV_URANDOM 1
| #define HAVE_HUGE_VAL_INF 1
| #define HAVE_CPUID_COUNT 1
| #define HAVE_SETENV 1
| #define HAVE_ERRNO_H 1
| #define HAVE_FCNTL_H 1
| #define HAVE_STDIO_H 1
| #define HAVE_STDLIB_H 1
| #define HAVE_UNISTD_H 1
| #define HAVE_SYS_UIO_H 1
| #define HAVE_SYS_SELECT_H 1
| #define HAVE_SYS_SOCKET_H 1
| #define HAVE_SYS_TIME_H 1
| #define HAVE_ARPA_INET_H 1
| #define HAVE_NETINET_IN_H 1
| #define HAVE_SYSEXITS_H 1
| #define HAVE_CLOCK_GETTIME 1
| #define HAVE_MACH_VM_READ 1
| #define HAVE_BUILTIN_ATOMIC 1
| #define HAVE_SYSCONF 1
| #define HAVE_TIMES 1
| #define HAVE_KQUEUE 1
| #define HAVE_POLL 1
| #define HAVE_SELECT 1
| #define PHP_FPM_SYSTEMD "simple"
| #define PHP_FPM_USER "_www"
| #define PHP_FPM_GROUP "_www"
| #define HAVE_PHPDBG 1
| #define PHPDBG_DEBUG 0
| #define HAVE_PHPDBG_READLINE 1
| #define HAVE_SOCKLEN_T 1
| #define HAVE_SOCKADDR_UN_SUN_LEN 1
| #define PHP_WRITE_STDOUT 1
| #define HAVE_SOCKET 1
| #define HAVE_SOCKETPAIR 1
| #define HAVE_HTONL 1
| #define HAVE_GETHOSTNAME 1
| #define HAVE_GETHOSTBYADDR 1
| #define HAVE_YP_GET_DEFAULT_DOMAIN 1
| #define HAVE_DLOPEN 1
| #define HAVE_LIBDL 1
| #define HAVE_LIBM 1
| #define HAVE_INET_ATON 1
| #define STDC_HEADERS 1
| #define HAVE_DIRENT_H 1
| #define HAVE_INTTYPES_H 1
| #define HAVE_STDINT_H 1
| #define HAVE_DIRENT_H 1
| #define HAVE_APPLICATIONSERVICES_APPLICATIONSERVICES_H 1
| #define HAVE_SYS_PARAM_H 1
| #define HAVE_SYS_TYPES_H 1
| #define HAVE_SYS_TIME_H 1
| #define HAVE_NETINET_IN_H 1
| #define HAVE_ALLOCA_H 1
| #define HAVE_ARPA_INET_H 1
| #define HAVE_ARPA_NAMESER_H 1
| #define HAVE_ASSERT_H 1
| #define HAVE_DNS_H 1
| #define HAVE_FCNTL_H 1
| #define HAVE_GRP_H 1
| #define HAVE_LANGINFO_H 1
| #define HAVE_LIMITS_H 1
| #define HAVE_LOCALE_H 1
| #define HAVE_MONETARY_H 1
| #define HAVE_NETDB_H 1
| #define HAVE_POLL_H 1
| #define HAVE_PWD_H 1
| #define HAVE_RESOLV_H 1
| #define HAVE_SIGNAL_H 1
| #define HAVE_STDARG_H 1
| #define HAVE_STDLIB_H 1
| #define HAVE_STRING_H 1
| #define HAVE_SYSLOG_H 1
| #define HAVE_SYSEXITS_H 1
| #define HAVE_SYS_IOCTL_H 1
| #define HAVE_SYS_FILE_H 1
| #define HAVE_SYS_MMAN_H 1
| #define HAVE_SYS_MOUNT_H 1
| #define HAVE_SYS_POLL_H 1
| #define HAVE_SYS_RESOURCE_H 1
| #define HAVE_SYS_SELECT_H 1
| #define HAVE_SYS_SOCKET_H 1
| #define HAVE_SYS_STAT_H 1
| /* end confdefs.h. */
|
| #ifdef HAVE_SYS_PARAM_H
| #include <sys/param.h>
| #endif
| #ifdef HAVE_SYS_TYPES_H
| #include <sys/types.h>
| #endif
| #ifdef HAVE_SYS_TIME_H
| #include <sys/time.h>
| #endif
| #ifdef HAVE_NETINET_IN_H
| #include <netinet/in.h>
| #endif
| #ifdef HAVE_ARPA_NAMESER_H
| #include <arpa/nameser.h>
| #endif
|
|
| #include <sys/statfs.h>
configure:12421: result: no
configure:12421: checking for sys/statvfs.h
configure:12421: clang -c -g -O2 -fvisibility=hidden -no-cpp-precomp conftest.c >&5
configure:12421: $? = 0
configure:12421: result: yes
configure:12421: checking for sys/vfs.h
configure:12421: clang -c -g -O2 -fvisibility=hidden -no-cpp-precomp conftest.c >&5
conftest.c:126:10: fatal error: 'sys/vfs.h' file not found
#include <sys/vfs.h>
^~~~~~~~~~~
1 error generated.
configure:12421: $? = 1
configure: failed program was:
| /* confdefs.h */
| #define PACKAGE_NAME ""
| #define PACKAGE_TARNAME ""
| #define PACKAGE_VERSION ""
| #define PACKAGE_STRING ""
| #define PACKAGE_BUGREPORT ""
| #define PACKAGE_URL ""
| #define STDC_HEADERS 1
| #define HAVE_SYS_TYPES_H 1
| #define HAVE_SYS_STAT_H 1
| #define HAVE_STDLIB_H 1
| #define HAVE_STRING_H 1
| #define HAVE_MEMORY_H 1
| #define HAVE_STRINGS_H 1
| #define HAVE_INTTYPES_H 1
| #define HAVE_STDINT_H 1
| #define HAVE_UNISTD_H 1
| #define __EXTENSIONS__ 1
| #define _ALL_SOURCE 1
| #define _GNU_SOURCE 1
| #define _POSIX_PTHREAD_SEMANTICS 1
| #define _TANDEM_SOURCE 1
| #define HAVE_DEV_URANDOM 1
| #define HAVE_HUGE_VAL_INF 1
| #define HAVE_CPUID_COUNT 1
| #define HAVE_SETENV 1
| #define HAVE_ERRNO_H 1
| #define HAVE_FCNTL_H 1
| #define HAVE_STDIO_H 1
| #define HAVE_STDLIB_H 1
| #define HAVE_UNISTD_H 1
| #define HAVE_SYS_UIO_H 1
| #define HAVE_SYS_SELECT_H 1
| #define HAVE_SYS_SOCKET_H 1
| #define HAVE_SYS_TIME_H 1
| #define HAVE_ARPA_INET_H 1
| #define HAVE_NETINET_IN_H 1
| #define HAVE_SYSEXITS_H 1
| #define HAVE_CLOCK_GETTIME 1
| #define HAVE_MACH_VM_READ 1
| #define HAVE_BUILTIN_ATOMIC 1
| #define HAVE_SYSCONF 1
| #define HAVE_TIMES 1
| #define HAVE_KQUEUE 1
| #define HAVE_POLL 1
| #define HAVE_SELECT 1
| #define PHP_FPM_SYSTEMD "simple"
| #define PHP_FPM_USER "_www"
| #define PHP_FPM_GROUP "_www"
| #define HAVE_PHPDBG 1
| #define PHPDBG_DEBUG 0
| #define HAVE_PHPDBG_READLINE 1
| #define HAVE_SOCKLEN_T 1
| #define HAVE_SOCKADDR_UN_SUN_LEN 1
| #define PHP_WRITE_STDOUT 1
| #define HAVE_SOCKET 1
| #define HAVE_SOCKETPAIR 1
| #define HAVE_HTONL 1
| #define HAVE_GETHOSTNAME 1
| #define HAVE_GETHOSTBYADDR 1
| #define HAVE_YP_GET_DEFAULT_DOMAIN 1
| #define HAVE_DLOPEN 1
| #define HAVE_LIBDL 1
| #define HAVE_LIBM 1
| #define HAVE_INET_ATON 1
| #define STDC_HEADERS 1
| #define HAVE_DIRENT_H 1
| #define HAVE_INTTYPES_H 1
| #define HAVE_STDINT_H 1
| #define HAVE_DIRENT_H 1
| #define HAVE_APPLICATIONSERVICES_APPLICATIONSERVICES_H 1
| #define HAVE_SYS_PARAM_H 1
| #define HAVE_SYS_TYPES_H 1
| #define HAVE_SYS_TIME_H 1
| #define HAVE_NETINET_IN_H 1
| #define HAVE_ALLOCA_H 1
| #define HAVE_ARPA_INET_H 1
| #define HAVE_ARPA_NAMESER_H 1
| #define HAVE_ASSERT_H 1
| #define HAVE_DNS_H 1
| #define HAVE_FCNTL_H 1
| #define HAVE_GRP_H 1
| #define HAVE_LANGINFO_H 1
| #define HAVE_LIMITS_H 1
| #define HAVE_LOCALE_H 1
| #define HAVE_MONETARY_H 1
| #define HAVE_NETDB_H 1
| #define HAVE_POLL_H 1
| #define HAVE_PWD_H 1
| #define HAVE_RESOLV_H 1
| #define HAVE_SIGNAL_H 1
| #define HAVE_STDARG_H 1
| #define HAVE_STDLIB_H 1
| #define HAVE_STRING_H 1
| #define HAVE_SYSLOG_H 1
| #define HAVE_SYSEXITS_H 1
| #define HAVE_SYS_IOCTL_H 1
| #define HAVE_SYS_FILE_H 1
| #define HAVE_SYS_MMAN_H 1
| #define HAVE_SYS_MOUNT_H 1
| #define HAVE_SYS_POLL_H 1
| #define HAVE_SYS_RESOURCE_H 1
| #define HAVE_SYS_SELECT_H 1
| #define HAVE_SYS_SOCKET_H 1
| #define HAVE_SYS_STAT_H 1
| #define HAVE_SYS_STATVFS_H 1
| /* end confdefs.h. */
|
| #ifdef HAVE_SYS_PARAM_H
| #include <sys/param.h>
| #endif
| #ifdef HAVE_SYS_TYPES_H
| #include <sys/types.h>
| #endif
| #ifdef HAVE_SYS_TIME_H
| #include <sys/time.h>
| #endif
| #ifdef HAVE_NETINET_IN_H
| #include <netinet/in.h>
| #endif
| #ifdef HAVE_ARPA_NAMESER_H
| #include <arpa/nameser.h>
| #endif
|
|
| #include <sys/vfs.h>
configure:12421: result: no
configure:12421: checking for sys/sysexits.h
configure:12421: clang -c -g -O2 -fvisibility=hidden -no-cpp-precomp conftest.c >&5
conftest.c:126:10: fatal error: 'sys/sysexits.h' file not found
#include <sys/sysexits.h>
^~~~~~~~~~~~~~~~
1 error generated.
configure:12421: $? = 1
configure: failed program was:
| /* confdefs.h */
| #define PACKAGE_NAME ""
| #define PACKAGE_TARNAME ""
| #define PACKAGE_VERSION ""
| #define PACKAGE_STRING ""
| #define PACKAGE_BUGREPORT ""
| #define PACKAGE_URL ""
| #define STDC_HEADERS 1
| #define HAVE_SYS_TYPES_H 1
| #define HAVE_SYS_STAT_H 1
| #define HAVE_STDLIB_H 1
| #define HAVE_STRING_H 1
| #define HAVE_MEMORY_H 1
| #define HAVE_STRINGS_H 1
| #define HAVE_INTTYPES_H 1
| #define HAVE_STDINT_H 1
| #define HAVE_UNISTD_H 1
| #define __EXTENSIONS__ 1
| #define _ALL_SOURCE 1
| #define _GNU_SOURCE 1
| #define _POSIX_PTHREAD_SEMANTICS 1
| #define _TANDEM_SOURCE 1
| #define HAVE_DEV_URANDOM 1
| #define HAVE_HUGE_VAL_INF 1
| #define HAVE_CPUID_COUNT 1
| #define HAVE_SETENV 1
| #define HAVE_ERRNO_H 1
| #define HAVE_FCNTL_H 1
| #define HAVE_STDIO_H 1
| #define HAVE_STDLIB_H 1
| #define HAVE_UNISTD_H 1
| #define HAVE_SYS_UIO_H 1
| #define HAVE_SYS_SELECT_H 1
| #define HAVE_SYS_SOCKET_H 1
| #define HAVE_SYS_TIME_H 1
| #define HAVE_ARPA_INET_H 1
| #define HAVE_NETINET_IN_H 1
| #define HAVE_SYSEXITS_H 1
| #define HAVE_CLOCK_GETTIME 1
| #define HAVE_MACH_VM_READ 1
| #define HAVE_BUILTIN_ATOMIC 1
| #define HAVE_SYSCONF 1
| #define HAVE_TIMES 1
| #define HAVE_KQUEUE 1
| #define HAVE_POLL 1
| #define HAVE_SELECT 1
| #define PHP_FPM_SYSTEMD "simple"
| #define PHP_FPM_USER "_www"
| #define PHP_FPM_GROUP "_www"
| #define HAVE_PHPDBG 1
| #define PHPDBG_DEBUG 0
| #define HAVE_PHPDBG_READLINE 1
| #define HAVE_SOCKLEN_T 1
| #define HAVE_SOCKADDR_UN_SUN_LEN 1
| #define PHP_WRITE_STDOUT 1
| #define HAVE_SOCKET 1
| #define HAVE_SOCKETPAIR 1
| #define HAVE_HTONL 1
| #define HAVE_GETHOSTNAME 1
| #define HAVE_GETHOSTBYADDR 1
| #define HAVE_YP_GET_DEFAULT_DOMAIN 1
| #define HAVE_DLOPEN 1
| #define HAVE_LIBDL 1
| #define HAVE_LIBM 1
| #define HAVE_INET_ATON 1
| #define STDC_HEADERS 1
| #define HAVE_DIRENT_H 1
| #define HAVE_INTTYPES_H 1
| #define HAVE_STDINT_H 1
| #define HAVE_DIRENT_H 1
| #define HAVE_APPLICATIONSERVICES_APPLICATIONSERVICES_H 1
| #define HAVE_SYS_PARAM_H 1
| #define HAVE_SYS_TYPES_H 1
| #define HAVE_SYS_TIME_H 1
| #define HAVE_NETINET_IN_H 1
| #define HAVE_ALLOCA_H 1
| #define HAVE_ARPA_INET_H 1
| #define HAVE_ARPA_NAMESER_H 1
| #define HAVE_ASSERT_H 1
| #define HAVE_DNS_H 1
| #define HAVE_FCNTL_H 1
| #define HAVE_GRP_H 1
| #define HAVE_LANGINFO_H 1
| #define HAVE_LIMITS_H 1
| #define HAVE_LOCALE_H 1
| #define HAVE_MONETARY_H 1
| #define HAVE_NETDB_H 1
| #define HAVE_POLL_H 1
| #define HAVE_PWD_H 1
| #define HAVE_RESOLV_H 1
| #define HAVE_SIGNAL_H 1
| #define HAVE_STDARG_H 1
| #define HAVE_STDLIB_H 1
| #define HAVE_STRING_H 1
| #define HAVE_SYSLOG_H 1
| #define HAVE_SYSEXITS_H 1
| #define HAVE_SYS_IOCTL_H 1
| #define HAVE_SYS_FILE_H 1
| #define HAVE_SYS_MMAN_H 1
| #define HAVE_SYS_MOUNT_H 1
| #define HAVE_SYS_POLL_H 1
| #define HAVE_SYS_RESOURCE_H 1
| #define HAVE_SYS_SELECT_H 1
| #define HAVE_SYS_SOCKET_H 1
| #define HAVE_SYS_STAT_H 1
| #define HAVE_SYS_STATVFS_H 1
| /* end confdefs.h. */
|
| #ifdef HAVE_SYS_PARAM_H
| #include <sys/param.h>
| #endif
| #ifdef HAVE_SYS_TYPES_H
| #include <sys/types.h>
| #endif
| #ifdef HAVE_SYS_TIME_H
| #include <sys/time.h>
| #endif
| #ifdef HAVE_NETINET_IN_H
| #include <netinet/in.h>
| #endif
| #ifdef HAVE_ARPA_NAMESER_H
| #include <arpa/nameser.h>
| #endif
|
|
| #include <sys/sysexits.h>
configure:12421: result: no
configure:12421: checking for sys/varargs.h
configure:12421: clang -c -g -O2 -fvisibility=hidden -no-cpp-precomp conftest.c >&5
conftest.c:126:10: fatal error: 'sys/varargs.h' file not found
#include <sys/varargs.h>
^~~~~~~~~~~~~~~
1 error generated.
configure:12421: $? = 1
configure: failed program was:
| /* confdefs.h */
| #define PACKAGE_NAME ""
| #define PACKAGE_TARNAME ""
| #define PACKAGE_VERSION ""
| #define PACKAGE_STRING ""
| #define PACKAGE_BUGREPORT ""
| #define PACKAGE_URL ""
| #define STDC_HEADERS 1
| #define HAVE_SYS_TYPES_H 1
| #define HAVE_SYS_STAT_H 1
| #define HAVE_STDLIB_H 1
| #define HAVE_STRING_H 1
| #define HAVE_MEMORY_H 1
| #define HAVE_STRINGS_H 1
| #define HAVE_INTTYPES_H 1
| #define HAVE_STDINT_H 1
| #define HAVE_UNISTD_H 1
| #define __EXTENSIONS__ 1
| #define _ALL_SOURCE 1
| #define _GNU_SOURCE 1
| #define _POSIX_PTHREAD_SEMANTICS 1
| #define _TANDEM_SOURCE 1
| #define HAVE_DEV_URANDOM 1
| #define HAVE_HUGE_VAL_INF 1
| #define HAVE_CPUID_COUNT 1
| #define HAVE_SETENV 1
| #define HAVE_ERRNO_H 1
| #define HAVE_FCNTL_H 1
| #define HAVE_STDIO_H 1
| #define HAVE_STDLIB_H 1
| #define HAVE_UNISTD_H 1
| #define HAVE_SYS_UIO_H 1
| #define HAVE_SYS_SELECT_H 1
| #define HAVE_SYS_SOCKET_H 1
| #define HAVE_SYS_TIME_H 1
| #define HAVE_ARPA_INET_H 1
| #define HAVE_NETINET_IN_H 1
| #define HAVE_SYSEXITS_H 1
| #define HAVE_CLOCK_GETTIME 1
| #define HAVE_MACH_VM_READ 1
| #define HAVE_BUILTIN_ATOMIC 1
| #define HAVE_SYSCONF 1
| #define HAVE_TIMES 1
| #define HAVE_KQUEUE 1
| #define HAVE_POLL 1
| #define HAVE_SELECT 1
| #define PHP_FPM_SYSTEMD "simple"
| #define PHP_FPM_USER "_www"
| #define PHP_FPM_GROUP "_www"
| #define HAVE_PHPDBG 1
| #define PHPDBG_DEBUG 0
| #define HAVE_PHPDBG_READLINE 1
| #define HAVE_SOCKLEN_T 1
| #define HAVE_SOCKADDR_UN_SUN_LEN 1
| #define PHP_WRITE_STDOUT 1
| #define HAVE_SOCKET 1
| #define HAVE_SOCKETPAIR 1
| #define HAVE_HTONL 1
| #define HAVE_GETHOSTNAME 1
| #define HAVE_GETHOSTBYADDR 1
| #define HAVE_YP_GET_DEFAULT_DOMAIN 1
| #define HAVE_DLOPEN 1
| #define HAVE_LIBDL 1
| #define HAVE_LIBM 1
| #define HAVE_INET_ATON 1
| #define STDC_HEADERS 1
| #define HAVE_DIRENT_H 1
| #define HAVE_INTTYPES_H 1
| #define HAVE_STDINT_H 1
| #define HAVE_DIRENT_H 1
| #define HAVE_APPLICATIONSERVICES_APPLICATIONSERVICES_H 1
| #define HAVE_SYS_PARAM_H 1
| #define HAVE_SYS_TYPES_H 1
| #define HAVE_SYS_TIME_H 1
| #define HAVE_NETINET_IN_H 1
| #define HAVE_ALLOCA_H 1
| #define HAVE_ARPA_INET_H 1
| #define HAVE_ARPA_NAMESER_H 1
| #define HAVE_ASSERT_H 1
| #define HAVE_DNS_H 1
| #define HAVE_FCNTL_H 1
| #define HAVE_GRP_H 1
| #define HAVE_LANGINFO_H 1
| #define HAVE_LIMITS_H 1
| #define HAVE_LOCALE_H 1
| #define HAVE_MONETARY_H 1
| #define HAVE_NETDB_H 1
| #define HAVE_POLL_H 1
| #define HAVE_PWD_H 1
| #define HAVE_RESOLV_H 1
| #define HAVE_SIGNAL_H 1
| #define HAVE_STDARG_H 1
| #define HAVE_STDLIB_H 1
| #define HAVE_STRING_H 1
| #define HAVE_SYSLOG_H 1
| #define HAVE_SYSEXITS_H 1
| #define HAVE_SYS_IOCTL_H 1
| #define HAVE_SYS_FILE_H 1
| #define HAVE_SYS_MMAN_H 1
| #define HAVE_SYS_MOUNT_H 1
| #define HAVE_SYS_POLL_H 1
| #define HAVE_SYS_RESOURCE_H 1
| #define HAVE_SYS_SELECT_H 1
| #define HAVE_SYS_SOCKET_H 1
| #define HAVE_SYS_STAT_H 1
| #define HAVE_SYS_STATVFS_H 1
| /* end confdefs.h. */
|
| #ifdef HAVE_SYS_PARAM_H
| #include <sys/param.h>
| #endif
| #ifdef HAVE_SYS_TYPES_H
| #include <sys/types.h>
| #endif
| #ifdef HAVE_SYS_TIME_H
| #include <sys/time.h>
| #endif
| #ifdef HAVE_NETINET_IN_H
| #include <netinet/in.h>
| #endif
| #ifdef HAVE_ARPA_NAMESER_H
| #include <arpa/nameser.h>
| #endif
|
|
| #include <sys/varargs.h>
configure:12421: result: no
configure:12421: checking for sys/wait.h
configure:12421: clang -c -g -O2 -fvisibility=hidden -no-cpp-precomp conftest.c >&5
configure:12421: $? = 0
configure:12421: result: yes
configure:12421: checking for sys/loadavg.h
configure:12421: clang -c -g -O2 -fvisibility=hidden -no-cpp-precomp conftest.c >&5
conftest.c:127:10: fatal error: 'sys/loadavg.h' file not found
#include <sys/loadavg.h>
^~~~~~~~~~~~~~~
1 error generated.
configure:12421: $? = 1
configure: failed program was:
| /* confdefs.h */
| #define PACKAGE_NAME ""
| #define PACKAGE_TARNAME ""
| #define PACKAGE_VERSION ""
| #define PACKAGE_STRING ""
| #define PACKAGE_BUGREPORT ""
| #define PACKAGE_URL ""
| #define STDC_HEADERS 1
| #define HAVE_SYS_TYPES_H 1
| #define HAVE_SYS_STAT_H 1
| #define HAVE_STDLIB_H 1
| #define HAVE_STRING_H 1
| #define HAVE_MEMORY_H 1
| #define HAVE_STRINGS_H 1
| #define HAVE_INTTYPES_H 1
| #define HAVE_STDINT_H 1
| #define HAVE_UNISTD_H 1
| #define __EXTENSIONS__ 1
| #define _ALL_SOURCE 1
| #define _GNU_SOURCE 1
| #define _POSIX_PTHREAD_SEMANTICS 1
| #define _TANDEM_SOURCE 1
| #define HAVE_DEV_URANDOM 1
| #define HAVE_HUGE_VAL_INF 1
| #define HAVE_CPUID_COUNT 1
| #define HAVE_SETENV 1
| #define HAVE_ERRNO_H 1
| #define HAVE_FCNTL_H 1
| #define HAVE_STDIO_H 1
| #define HAVE_STDLIB_H 1
| #define HAVE_UNISTD_H 1
| #define HAVE_SYS_UIO_H 1
| #define HAVE_SYS_SELECT_H 1
| #define HAVE_SYS_SOCKET_H 1
| #define HAVE_SYS_TIME_H 1
| #define HAVE_ARPA_INET_H 1
| #define HAVE_NETINET_IN_H 1
| #define HAVE_SYSEXITS_H 1
| #define HAVE_CLOCK_GETTIME 1
| #define HAVE_MACH_VM_READ 1
| #define HAVE_BUILTIN_ATOMIC 1
| #define HAVE_SYSCONF 1
| #define HAVE_TIMES 1
| #define HAVE_KQUEUE 1
| #define HAVE_POLL 1
| #define HAVE_SELECT 1
| #define PHP_FPM_SYSTEMD "simple"
| #define PHP_FPM_USER "_www"
| #define PHP_FPM_GROUP "_www"
| #define HAVE_PHPDBG 1
| #define PHPDBG_DEBUG 0
| #define HAVE_PHPDBG_READLINE 1
| #define HAVE_SOCKLEN_T 1
| #define HAVE_SOCKADDR_UN_SUN_LEN 1
| #define PHP_WRITE_STDOUT 1
| #define HAVE_SOCKET 1
| #define HAVE_SOCKETPAIR 1
| #define HAVE_HTONL 1
| #define HAVE_GETHOSTNAME 1
| #define HAVE_GETHOSTBYADDR 1
| #define HAVE_YP_GET_DEFAULT_DOMAIN 1
| #define HAVE_DLOPEN 1
| #define HAVE_LIBDL 1
| #define HAVE_LIBM 1
| #define HAVE_INET_ATON 1
| #define STDC_HEADERS 1
| #define HAVE_DIRENT_H 1
| #define HAVE_INTTYPES_H 1
| #define HAVE_STDINT_H 1
| #define HAVE_DIRENT_H 1
| #define HAVE_APPLICATIONSERVICES_APPLICATIONSERVICES_H 1
| #define HAVE_SYS_PARAM_H 1
| #define HAVE_SYS_TYPES_H 1
| #define HAVE_SYS_TIME_H 1
| #define HAVE_NETINET_IN_H 1
| #define HAVE_ALLOCA_H 1
| #define HAVE_ARPA_INET_H 1
| #define HAVE_ARPA_NAMESER_H 1
| #define HAVE_ASSERT_H 1
| #define HAVE_DNS_H 1
| #define HAVE_FCNTL_H 1
| #define HAVE_GRP_H 1
| #define HAVE_LANGINFO_H 1
| #define HAVE_LIMITS_H 1
| #define HAVE_LOCALE_H 1
| #define HAVE_MONETARY_H 1
| #define HAVE_NETDB_H 1
| #define HAVE_POLL_H 1
| #define HAVE_PWD_H 1
| #define HAVE_RESOLV_H 1
| #define HAVE_SIGNAL_H 1
| #define HAVE_STDARG_H 1
| #define HAVE_STDLIB_H 1
| #define HAVE_STRING_H 1
| #define HAVE_SYSLOG_H 1
| #define HAVE_SYSEXITS_H 1
| #define HAVE_SYS_IOCTL_H 1
| #define HAVE_SYS_FILE_H 1
| #define HAVE_SYS_MMAN_H 1
| #define HAVE_SYS_MOUNT_H 1
| #define HAVE_SYS_POLL_H 1
| #define HAVE_SYS_RESOURCE_H 1
| #define HAVE_SYS_SELECT_H 1
| #define HAVE_SYS_SOCKET_H 1
| #define HAVE_SYS_STAT_H 1
| #define HAVE_SYS_STATVFS_H 1
| #define HAVE_SYS_WAIT_H 1
| /* end confdefs.h. */
|
| #ifdef HAVE_SYS_PARAM_H
| #include <sys/param.h>
| #endif
| #ifdef HAVE_SYS_TYPES_H
| #include <sys/types.h>
| #endif
| #ifdef HAVE_SYS_TIME_H
| #include <sys/time.h>
| #endif
| #ifdef HAVE_NETINET_IN_H
| #include <netinet/in.h>
| #endif
| #ifdef HAVE_ARPA_NAMESER_H
| #include <arpa/nameser.h>
| #endif
|
|
| #include <sys/loadavg.h>
configure:12421: result: no
configure:12421: checking for termios.h
configure:12421: clang -c -g -O2 -fvisibility=hidden -no-cpp-precomp conftest.c >&5
configure:12421: $? = 0
configure:12421: result: yes
configure:12421: checking for unistd.h
configure:12421: result: yes
configure:12421: checking for unix.h
configure:12421: clang -c -g -O2 -fvisibility=hidden -no-cpp-precomp conftest.c >&5
conftest.c:129:10: fatal error: 'unix.h' file not found
#include <unix.h>
^~~~~~~~
1 error generated.
configure:12421: $? = 1
configure: failed program was:
| /* confdefs.h */
| #define PACKAGE_NAME ""
| #define PACKAGE_TARNAME ""
| #define PACKAGE_VERSION ""
| #define PACKAGE_STRING ""
| #define PACKAGE_BUGREPORT ""
| #define PACKAGE_URL ""
| #define STDC_HEADERS 1
| #define HAVE_SYS_TYPES_H 1
| #define HAVE_SYS_STAT_H 1
| #define HAVE_STDLIB_H 1
| #define HAVE_STRING_H 1
| #define HAVE_MEMORY_H 1
| #define HAVE_STRINGS_H 1
| #define HAVE_INTTYPES_H 1
| #define HAVE_STDINT_H 1
| #define HAVE_UNISTD_H 1
| #define __EXTENSIONS__ 1
| #define _ALL_SOURCE 1
| #define _GNU_SOURCE 1
| #define _POSIX_PTHREAD_SEMANTICS 1
| #define _TANDEM_SOURCE 1
| #define HAVE_DEV_URANDOM 1
| #define HAVE_HUGE_VAL_INF 1
| #define HAVE_CPUID_COUNT 1
| #define HAVE_SETENV 1
| #define HAVE_ERRNO_H 1
| #define HAVE_FCNTL_H 1
| #define HAVE_STDIO_H 1
| #define HAVE_STDLIB_H 1
| #define HAVE_UNISTD_H 1
| #define HAVE_SYS_UIO_H 1
| #define HAVE_SYS_SELECT_H 1
| #define HAVE_SYS_SOCKET_H 1
| #define HAVE_SYS_TIME_H 1
| #define HAVE_ARPA_INET_H 1
| #define HAVE_NETINET_IN_H 1
| #define HAVE_SYSEXITS_H 1
| #define HAVE_CLOCK_GETTIME 1
| #define HAVE_MACH_VM_READ 1
| #define HAVE_BUILTIN_ATOMIC 1
| #define HAVE_SYSCONF 1
| #define HAVE_TIMES 1
| #define HAVE_KQUEUE 1
| #define HAVE_POLL 1
| #define HAVE_SELECT 1
| #define PHP_FPM_SYSTEMD "simple"
| #define PHP_FPM_USER "_www"
| #define PHP_FPM_GROUP "_www"
| #define HAVE_PHPDBG 1
| #define PHPDBG_DEBUG 0
| #define HAVE_PHPDBG_READLINE 1
| #define HAVE_SOCKLEN_T 1
| #define HAVE_SOCKADDR_UN_SUN_LEN 1
| #define PHP_WRITE_STDOUT 1
| #define HAVE_SOCKET 1
| #define HAVE_SOCKETPAIR 1
| #define HAVE_HTONL 1
| #define HAVE_GETHOSTNAME 1
| #define HAVE_GETHOSTBYADDR 1
| #define HAVE_YP_GET_DEFAULT_DOMAIN 1
| #define HAVE_DLOPEN 1
| #define HAVE_LIBDL 1
| #define HAVE_LIBM 1
| #define HAVE_INET_ATON 1
| #define STDC_HEADERS 1
| #define HAVE_DIRENT_H 1
| #define HAVE_INTTYPES_H 1
| #define HAVE_STDINT_H 1
| #define HAVE_DIRENT_H 1
| #define HAVE_APPLICATIONSERVICES_APPLICATIONSERVICES_H 1
| #define HAVE_SYS_PARAM_H 1
| #define HAVE_SYS_TYPES_H 1
| #define HAVE_SYS_TIME_H 1
| #define HAVE_NETINET_IN_H 1
| #define HAVE_ALLOCA_H 1
| #define HAVE_ARPA_INET_H 1
| #define HAVE_ARPA_NAMESER_H 1
| #define HAVE_ASSERT_H 1
| #define HAVE_DNS_H 1
| #define HAVE_FCNTL_H 1
| #define HAVE_GRP_H 1
| #define HAVE_LANGINFO_H 1
| #define HAVE_LIMITS_H 1
| #define HAVE_LOCALE_H 1
| #define HAVE_MONETARY_H 1
| #define HAVE_NETDB_H 1
| #define HAVE_POLL_H 1
| #define HAVE_PWD_H 1
| #define HAVE_RESOLV_H 1
| #define HAVE_SIGNAL_H 1
| #define HAVE_STDARG_H 1
| #define HAVE_STDLIB_H 1
| #define HAVE_STRING_H 1
| #define HAVE_SYSLOG_H 1
| #define HAVE_SYSEXITS_H 1
| #define HAVE_SYS_IOCTL_H 1
| #define HAVE_SYS_FILE_H 1
| #define HAVE_SYS_MMAN_H 1
| #define HAVE_SYS_MOUNT_H 1
| #define HAVE_SYS_POLL_H 1
| #define HAVE_SYS_RESOURCE_H 1
| #define HAVE_SYS_SELECT_H 1
| #define HAVE_SYS_SOCKET_H 1
| #define HAVE_SYS_STAT_H 1
| #define HAVE_SYS_STATVFS_H 1
| #define HAVE_SYS_WAIT_H 1
| #define HAVE_TERMIOS_H 1
| #define HAVE_UNISTD_H 1
| /* end confdefs.h. */
|
| #ifdef HAVE_SYS_PARAM_H
| #include <sys/param.h>
| #endif
| #ifdef HAVE_SYS_TYPES_H
| #include <sys/types.h>
| #endif
| #ifdef HAVE_SYS_TIME_H
| #include <sys/time.h>
| #endif
| #ifdef HAVE_NETINET_IN_H
| #include <netinet/in.h>
| #endif
| #ifdef HAVE_ARPA_NAMESER_H
| #include <arpa/nameser.h>
| #endif
|
|
| #include <unix.h>
configure:12421: result: no
configure:12421: checking for utime.h
configure:12421: clang -c -g -O2 -fvisibility=hidden -no-cpp-precomp conftest.c >&5
configure:12421: $? = 0
configure:12421: result: yes
configure:12421: checking for sys/utsname.h
configure:12421: clang -c -g -O2 -fvisibility=hidden -no-cpp-precomp conftest.c >&5
configure:12421: $? = 0
configure:12421: result: yes
configure:12421: checking for sys/ipc.h
configure:12421: clang -c -g -O2 -fvisibility=hidden -no-cpp-precomp conftest.c >&5
configure:12421: $? = 0
configure:12421: result: yes
configure:12421: checking for dlfcn.h
configure:12421: clang -c -g -O2 -fvisibility=hidden -no-cpp-precomp conftest.c >&5
configure:12421: $? = 0
configure:12421: result: yes
configure:12421: checking for assert.h
configure:12421: result: yes
configure:12421: checking for tmmintrin.h
configure:12421: clang -c -g -O2 -fvisibility=hidden -no-cpp-precomp conftest.c >&5
configure:12421: $? = 0
configure:12421: result: yes
configure:12421: checking for nmmintrin.h
configure:12421: clang -c -g -O2 -fvisibility=hidden -no-cpp-precomp conftest.c >&5
configure:12421: $? = 0
configure:12421: result: yes
configure:12421: checking for immintrin.h
configure:12421: clang -c -g -O2 -fvisibility=hidden -no-cpp-precomp conftest.c >&5
configure:12421: $? = 0
configure:12421: result: yes
configure:12450: checking for fopencookie
configure:12450: clang -o conftest -g -O2 -fvisibility=hidden -no-cpp-precomp conftest.c -lm >&5
Undefined symbols for architecture x86_64:
"_fopencookie", referenced from:
_main in conftest-6fdd04.o
ld: symbol(s) not found for architecture x86_64
clang: error: linker command failed with exit code 1 (use -v to see invocation)
configure:12450: $? = 1
configure: failed program was:
| /* confdefs.h */
| #define PACKAGE_NAME ""
| #define PACKAGE_TARNAME ""
| #define PACKAGE_VERSION ""
| #define PACKAGE_STRING ""
| #define PACKAGE_BUGREPORT ""
| #define PACKAGE_URL ""
| #define STDC_HEADERS 1
| #define HAVE_SYS_TYPES_H 1
| #define HAVE_SYS_STAT_H 1
| #define HAVE_STDLIB_H 1
| #define HAVE_STRING_H 1
| #define HAVE_MEMORY_H 1
| #define HAVE_STRINGS_H 1
| #define HAVE_INTTYPES_H 1
| #define HAVE_STDINT_H 1
| #define HAVE_UNISTD_H 1
| #define __EXTENSIONS__ 1
| #define _ALL_SOURCE 1
| #define _GNU_SOURCE 1
| #define _POSIX_PTHREAD_SEMANTICS 1
| #define _TANDEM_SOURCE 1
| #define HAVE_DEV_URANDOM 1
| #define HAVE_HUGE_VAL_INF 1
| #define HAVE_CPUID_COUNT 1
| #define HAVE_SETENV 1
| #define HAVE_ERRNO_H 1
| #define HAVE_FCNTL_H 1
| #define HAVE_STDIO_H 1
| #define HAVE_STDLIB_H 1
| #define HAVE_UNISTD_H 1
| #define HAVE_SYS_UIO_H 1
| #define HAVE_SYS_SELECT_H 1
| #define HAVE_SYS_SOCKET_H 1
| #define HAVE_SYS_TIME_H 1
| #define HAVE_ARPA_INET_H 1
| #define HAVE_NETINET_IN_H 1
| #define HAVE_SYSEXITS_H 1
| #define HAVE_CLOCK_GETTIME 1
| #define HAVE_MACH_VM_READ 1
| #define HAVE_BUILTIN_ATOMIC 1
| #define HAVE_SYSCONF 1
| #define HAVE_TIMES 1
| #define HAVE_KQUEUE 1
| #define HAVE_POLL 1
| #define HAVE_SELECT 1
| #define PHP_FPM_SYSTEMD "simple"
| #define PHP_FPM_USER "_www"
| #define PHP_FPM_GROUP "_www"
| #define HAVE_PHPDBG 1
| #define PHPDBG_DEBUG 0
| #define HAVE_PHPDBG_READLINE 1
| #define HAVE_SOCKLEN_T 1
| #define HAVE_SOCKADDR_UN_SUN_LEN 1
| #define PHP_WRITE_STDOUT 1
| #define HAVE_SOCKET 1
| #define HAVE_SOCKETPAIR 1
| #define HAVE_HTONL 1
| #define HAVE_GETHOSTNAME 1
| #define HAVE_GETHOSTBYADDR 1
| #define HAVE_YP_GET_DEFAULT_DOMAIN 1
| #define HAVE_DLOPEN 1
| #define HAVE_LIBDL 1
| #define HAVE_LIBM 1
| #define HAVE_INET_ATON 1
| #define STDC_HEADERS 1
| #define HAVE_DIRENT_H 1
| #define HAVE_INTTYPES_H 1
| #define HAVE_STDINT_H 1
| #define HAVE_DIRENT_H 1
| #define HAVE_APPLICATIONSERVICES_APPLICATIONSERVICES_H 1
| #define HAVE_SYS_PARAM_H 1
| #define HAVE_SYS_TYPES_H 1
| #define HAVE_SYS_TIME_H 1
| #define HAVE_NETINET_IN_H 1
| #define HAVE_ALLOCA_H 1
| #define HAVE_ARPA_INET_H 1
| #define HAVE_ARPA_NAMESER_H 1
| #define HAVE_ASSERT_H 1
| #define HAVE_DNS_H 1
| #define HAVE_FCNTL_H 1
| #define HAVE_GRP_H 1
| #define HAVE_LANGINFO_H 1
| #define HAVE_LIMITS_H 1
| #define HAVE_LOCALE_H 1
| #define HAVE_MONETARY_H 1
| #define HAVE_NETDB_H 1
| #define HAVE_POLL_H 1
| #define HAVE_PWD_H 1
| #define HAVE_RESOLV_H 1
| #define HAVE_SIGNAL_H 1
| #define HAVE_STDARG_H 1
| #define HAVE_STDLIB_H 1
| #define HAVE_STRING_H 1
| #define HAVE_SYSLOG_H 1
| #define HAVE_SYSEXITS_H 1
| #define HAVE_SYS_IOCTL_H 1
| #define HAVE_SYS_FILE_H 1
| #define HAVE_SYS_MMAN_H 1
| #define HAVE_SYS_MOUNT_H 1
| #define HAVE_SYS_POLL_H 1
| #define HAVE_SYS_RESOURCE_H 1
| #define HAVE_SYS_SELECT_H 1
| #define HAVE_SYS_SOCKET_H 1
| #define HAVE_SYS_STAT_H 1
| #define HAVE_SYS_STATVFS_H 1
| #define HAVE_SYS_WAIT_H 1
| #define HAVE_TERMIOS_H 1
| #define HAVE_UNISTD_H 1
| #define HAVE_UTIME_H 1
| #define HAVE_SYS_UTSNAME_H 1
| #define HAVE_SYS_IPC_H 1
| #define HAVE_DLFCN_H 1
| #define HAVE_ASSERT_H 1
| #define HAVE_TMMINTRIN_H 1
| #define HAVE_NMMINTRIN_H 1
| #define HAVE_IMMINTRIN_H 1
| /* end confdefs.h. */
| /* Define fopencookie to an innocuous variant, in case <limits.h> declares fopencookie.
| For example, HP-UX 11i <limits.h> declares gettimeofday. */
| #define fopencookie innocuous_fopencookie
|
| /* System header to define __stub macros and hopefully few prototypes,
| which can conflict with char fopencookie (); below.
| Prefer <limits.h> to <assert.h> if __STDC__ is defined, since
| <limits.h> exists even on freestanding compilers. */
|
| #ifdef __STDC__
| # include <limits.h>
| #else
| # include <assert.h>
| #endif
|
| #undef fopencookie
|