Skip to content

Instantly share code, notes, and snippets.

Embed
What would you like to do?
PyBind11 error log
Microsoft (R) Build Engine version 15.9.21+g9802d43bc3 for .NET Framework
Copyright (C) Microsoft Corporation. All rights reserved.
Build started 1/23/2020 9:54:23 AM.
Project "C:\Users\Ismael_Venegas\Projects\pybind11\build\tests\check.vcxproj" on node 1 (default targets).
Project "C:\Users\Ismael_Venegas\Projects\pybind11\build\tests\check.vcxproj" (1) is building "C:\Users\Ismael_Venegas\Projects\pybind11\build\ZERO_CHECK.vcxproj" (2) on node 1 (default targets).
InitializeBuildStatus:
Creating "x64\Release\ZERO_CHECK\ZERO_CHECK.tlog\unsuccessfulbuild" because "AlwaysCreate" was specified.
CustomBuild:
All outputs are up-to-date.
FinalizeBuildStatus:
Deleting file "x64\Release\ZERO_CHECK\ZERO_CHECK.tlog\unsuccessfulbuild".
Touching "x64\Release\ZERO_CHECK\ZERO_CHECK.tlog\ZERO_CHECK.lastbuildstate".
Done Building Project "C:\Users\Ismael_Venegas\Projects\pybind11\build\ZERO_CHECK.vcxproj" (default targets).
Project "C:\Users\Ismael_Venegas\Projects\pybind11\build\tests\check.vcxproj" (1) is building "C:\Users\Ismael_Venegas\Projects\pybind11\build\tests\pytest.vcxproj" (3) on node 1 (default targets).
Project "C:\Users\Ismael_Venegas\Projects\pybind11\build\tests\pytest.vcxproj" (3) is building "C:\Users\Ismael_Venegas\Projects\pybind11\build\tests\cross_module_gil_utils.vcxproj" (4) on node 1 (default targets).
InitializeBuildStatus:
Creating "cross_module_gil_utils.dir\Release\cross_mo.C4B9EA4D.tlog\unsuccessfulbuild" because "AlwaysCreate" was specified.
CustomBuild:
All outputs are up-to-date.
ClCompile:
All outputs are up-to-date.
Link:
All outputs are up-to-date.
cross_module_gil_utils.vcxproj -> C:\Users\Ismael_Venegas\Projects\pybind11\tests\cross_module_gil_utils.cp37-win_amd64.pyd
FinalizeBuildStatus:
Deleting file "cross_module_gil_utils.dir\Release\cross_mo.C4B9EA4D.tlog\unsuccessfulbuild".
Touching "cross_module_gil_utils.dir\Release\cross_mo.C4B9EA4D.tlog\cross_module_gil_utils.lastbuildstate".
Done Building Project "C:\Users\Ismael_Venegas\Projects\pybind11\build\tests\cross_module_gil_utils.vcxproj" (default targets).
Project "C:\Users\Ismael_Venegas\Projects\pybind11\build\tests\pytest.vcxproj" (3) is building "C:\Users\Ismael_Venegas\Projects\pybind11\build\tests\pybind11_cross_module_tests.vcxproj" (5) on node 1 (default targets).
InitializeBuildStatus:
Creating "pybind11_cross_module_tests.dir\Release\pybind11.D9250730.tlog\unsuccessfulbuild" because "AlwaysCreate" was specified.
CustomBuild:
All outputs are up-to-date.
ClCompile:
All outputs are up-to-date.
Link:
All outputs are up-to-date.
pybind11_cross_module_tests.vcxproj -> C:\Users\Ismael_Venegas\Projects\pybind11\tests\pybind11_cross_module_tests.cp37-win_amd64.pyd
FinalizeBuildStatus:
Deleting file "pybind11_cross_module_tests.dir\Release\pybind11.D9250730.tlog\unsuccessfulbuild".
Touching "pybind11_cross_module_tests.dir\Release\pybind11.D9250730.tlog\pybind11_cross_module_tests.lastbuildstate".
Done Building Project "C:\Users\Ismael_Venegas\Projects\pybind11\build\tests\pybind11_cross_module_tests.vcxproj" (default targets).
Project "C:\Users\Ismael_Venegas\Projects\pybind11\build\tests\pytest.vcxproj" (3) is building "C:\Users\Ismael_Venegas\Projects\pybind11\build\tests\pybind11_tests.vcxproj" (6) on node 1 (default targets).
InitializeBuildStatus:
Creating "pybind11_tests.dir\Release\pybind11_tests.tlog\unsuccessfulbuild" because "AlwaysCreate" was specified.
CustomBuild:
All outputs are up-to-date.
ClCompile:
All outputs are up-to-date.
Link:
All outputs are up-to-date.
pybind11_tests.vcxproj -> C:\Users\Ismael_Venegas\Projects\pybind11\tests\pybind11_tests.cp37-win_amd64.pyd
PostBuildEvent:
setlocal
C:\Users\Ismael_Venegas\AppData\Local\Continuum\anaconda3\python.exe C:/Users/Ismael_Venegas/Projects/pybind11/tools/libsize.py C:/Users/Ismael_Venegas/Projects/pybind11/tests/pybind11_tests.cp37-win_amd64.pyd C:/Users/Ismael_Venegas/Projects/pybind11/build/tests/sosize-pybind11_tests.cp37-win_amd64.pyd.txt
if %errorlevel% neq 0 goto :cmEnd
:cmEnd
endlocal & call :cmErrorLevel %errorlevel% & goto :cmDone
:cmErrorLevel
exit /b %1
:cmDone
if %errorlevel% neq 0 goto :VCEnd
:VCEnd
------ pybind11_tests.cp37-win_amd64.pyd file size: 2720256 (no change)
FinalizeBuildStatus:
Deleting file "pybind11_tests.dir\Release\pybind11_tests.tlog\unsuccessfulbuild".
Touching "pybind11_tests.dir\Release\pybind11_tests.tlog\pybind11_tests.lastbuildstate".
Done Building Project "C:\Users\Ismael_Venegas\Projects\pybind11\build\tests\pybind11_tests.vcxproj" (default targets).
InitializeBuildStatus:
Creating "x64\Release\pytest\pytest.tlog\unsuccessfulbuild" because "AlwaysCreate" was specified.
CustomBuild:
============================= test session starts =============================
platform win32 -- Python 3.7.6, pytest-5.3.2, py-1.8.1, pluggy-0.13.1
rootdir: C:\Users\Ismael_Venegas\Projects\pybind11\tests, inifile: pytest.ini
plugins: hypothesis-4.54.2, arraydiff-0.3, astropy-header-0.1.1, doctestplus-0.5.0, openfiles-0.4.0, remotedata-0.3.2
collected 333 items
test_async.py .. [ 0%]
test_buffers.py ...... [ 2%]
test_builtin_casters.py ....s........... [ 7%]
test_call_policies.py ........ [ 9%]
test_callbacks.py ......... [ 12%]
test_chrono.py ........... [ 15%]
test_class.py ................. [ 20%]
test_constants_and_functions.py .... [ 21%]
test_copy_move.py ....s.. [ 24%]
test_docstring_options.py . [ 24%]
test_eigen.py sssssssssssssssssssssssss [ 31%]
test_enum.py ...... [ 33%]
test_eval.py . [ 33%]
test_exceptions.py ....... [ 36%]
test_factory_constructors.py ......... [ 38%]
test_gil_scoped.py ..... [ 40%]
test_iostream.py ............ [ 43%]
test_kwargs_and_defaults.py ..... [ 45%]
test_local_bindings.py .......... [ 48%]
test_methods_and_attributes.py .................... [ 54%]
test_modules.py ..... [ 55%]
test_multiple_inheritance.py ........... [ 59%]
test_numpy_array.py .................................... [ 69%]
test_numpy_dtypes.py ............. [ 73%]
test_numpy_vectorize.py ....... [ 75%]
test_opaque_types.py .. [ 76%]
test_operator_overloading.py ... [ 77%]
test_pickling.py ..... [ 78%]
test_pytypes.py ............. [ 82%]
test_sequences_and_iterators.py ....... [ 84%]
test_smart_ptr.py ............. [ 88%]
test_stl.py ........sss....... [ 94%]
test_stl_binders.py ......... [ 96%]
test_tagbased_polymorphic.py . [ 97%]
test_union.py . [ 97%]
test_virtual_functions.py ........ [100%]
=========================== short test summary info ===========================
SKIPPED [1] test_builtin_casters.py:130: no <string_view>
SKIPPED [1] test_copy_move.py:68: no <optional>
SKIPPED [1] test_eigen.py:25: eigen and/or numpy are not installed
SKIPPED [1] test_eigen.py:34: eigen and/or numpy are not installed
SKIPPED [1] test_eigen.py:43: eigen and/or numpy are not installed
SKIPPED [1] test_eigen.py:72: eigen and/or numpy are not installed
SKIPPED [1] test_eigen.py:99: eigen and/or numpy are not installed
SKIPPED [1] test_eigen.py:122: eigen and/or numpy are not installed
SKIPPED [1] test_eigen.py:131: eigen and/or numpy are not installed
SKIPPED [1] test_eigen.py:154: eigen and/or numpy are not installed
SKIPPED [1] test_eigen.py:195: eigen and/or numpy are not installed
SKIPPED [1] test_eigen.py:206: eigen and/or numpy are not installed
SKIPPED [1] test_eigen.py:224: eigen and/or numpy are not installed
SKIPPED [1] test_eigen.py:352: eigen and/or numpy are not installed
SKIPPED [1] test_eigen.py:373: eigen and/or numpy are not installed
SKIPPED [1] test_eigen.py:442: eigen and/or numpy are not installed
SKIPPED [1] test_eigen.py:489: eigen and/or numpy are not installed
SKIPPED [1] test_eigen.py:531: eigen and/or numpy are not installed
SKIPPED [1] test_eigen.py:576: eigen and/or numpy are not installed
SKIPPED [1] test_eigen.py:590: eigen and/or numpy are not installed
SKIPPED [1] test_eigen.py:608: eigen and/or numpy are not installed
SKIPPED [1] test_eigen.py:623: eigen and/or numpy are not installed
SKIPPED [1] test_eigen.py:644: eigen and/or scipy are not installed
SKIPPED [1] test_eigen.py:654: eigen and/or scipy are not installed
SKIPPED [1] test_eigen.py:664: eigen and/or numpy are not installed
SKIPPED [1] test_eigen.py:673: eigen and/or numpy are not installed
SKIPPED [1] test_eigen.py:688: eigen and/or numpy are not installed
SKIPPED [1] test_stl.py:108: no <optional>
SKIPPED [1] test_stl.py:131: no <experimental/optional>
SKIPPED [1] test_stl.py:152: no <variant>
====================== 303 passed, 30 skipped in 11.73s =======================
FinalizeBuildStatus:
Deleting file "x64\Release\pytest\pytest.tlog\unsuccessfulbuild".
Touching "x64\Release\pytest\pytest.tlog\pytest.lastbuildstate".
Done Building Project "C:\Users\Ismael_Venegas\Projects\pybind11\build\tests\pytest.vcxproj" (default targets).
Project "C:\Users\Ismael_Venegas\Projects\pybind11\build\tests\check.vcxproj" (1) is building "C:\Users\Ismael_Venegas\Projects\pybind11\build\tests\test_cmake_build\test_cmake_build.vcxproj" (7) on node 1 (default targets).
Project "C:\Users\Ismael_Venegas\Projects\pybind11\build\tests\test_cmake_build\test_cmake_build.vcxproj" (7) is building "C:\Users\Ismael_Venegas\Projects\pybind11\build\tests\test_cmake_build\test_installed_embed.vcxproj" (8) on node 1 (default targets).
Project "C:\Users\Ismael_Venegas\Projects\pybind11\build\tests\test_cmake_build\test_installed_embed.vcxproj" (8) is building "C:\Users\Ismael_Venegas\Projects\pybind11\build\tests\test_cmake_build\mock_install.vcxproj" (9) on node 1 (default targets).
InitializeBuildStatus:
Creating "x64\Release\mock_install\mock_install.tlog\unsuccessfulbuild" because "AlwaysCreate" was specified.
CustomBuild:
-- Install configuration: "Release"
-- Up-to-date: C:/Users/Ismael_Venegas/Projects/pybind11/build/mock_install/include/pybind11
-- Up-to-date: C:/Users/Ismael_Venegas/Projects/pybind11/build/mock_install/include/pybind11/attr.h
-- Up-to-date: C:/Users/Ismael_Venegas/Projects/pybind11/build/mock_install/include/pybind11/buffer_info.h
-- Up-to-date: C:/Users/Ismael_Venegas/Projects/pybind11/build/mock_install/include/pybind11/cast.h
-- Up-to-date: C:/Users/Ismael_Venegas/Projects/pybind11/build/mock_install/include/pybind11/chrono.h
-- Up-to-date: C:/Users/Ismael_Venegas/Projects/pybind11/build/mock_install/include/pybind11/common.h
-- Up-to-date: C:/Users/Ismael_Venegas/Projects/pybind11/build/mock_install/include/pybind11/complex.h
-- Up-to-date: C:/Users/Ismael_Venegas/Projects/pybind11/build/mock_install/include/pybind11/detail
-- Up-to-date: C:/Users/Ismael_Venegas/Projects/pybind11/build/mock_install/include/pybind11/detail/class.h
-- Up-to-date: C:/Users/Ismael_Venegas/Projects/pybind11/build/mock_install/include/pybind11/detail/common.h
-- Up-to-date: C:/Users/Ismael_Venegas/Projects/pybind11/build/mock_install/include/pybind11/detail/descr.h
-- Up-to-date: C:/Users/Ismael_Venegas/Projects/pybind11/build/mock_install/include/pybind11/detail/init.h
-- Up-to-date: C:/Users/Ismael_Venegas/Projects/pybind11/build/mock_install/include/pybind11/detail/internals.h
-- Up-to-date: C:/Users/Ismael_Venegas/Projects/pybind11/build/mock_install/include/pybind11/detail/typeid.h
-- Up-to-date: C:/Users/Ismael_Venegas/Projects/pybind11/build/mock_install/include/pybind11/eigen.h
-- Up-to-date: C:/Users/Ismael_Venegas/Projects/pybind11/build/mock_install/include/pybind11/embed.h
-- Up-to-date: C:/Users/Ismael_Venegas/Projects/pybind11/build/mock_install/include/pybind11/eval.h
-- Up-to-date: C:/Users/Ismael_Venegas/Projects/pybind11/build/mock_install/include/pybind11/functional.h
-- Up-to-date: C:/Users/Ismael_Venegas/Projects/pybind11/build/mock_install/include/pybind11/iostream.h
-- Up-to-date: C:/Users/Ismael_Venegas/Projects/pybind11/build/mock_install/include/pybind11/numpy.h
-- Up-to-date: C:/Users/Ismael_Venegas/Projects/pybind11/build/mock_install/include/pybind11/operators.h
-- Up-to-date: C:/Users/Ismael_Venegas/Projects/pybind11/build/mock_install/include/pybind11/options.h
-- Up-to-date: C:/Users/Ismael_Venegas/Projects/pybind11/build/mock_install/include/pybind11/pybind11.h
-- Up-to-date: C:/Users/Ismael_Venegas/Projects/pybind11/build/mock_install/include/pybind11/pytypes.h
-- Up-to-date: C:/Users/Ismael_Venegas/Projects/pybind11/build/mock_install/include/pybind11/stl.h
-- Up-to-date: C:/Users/Ismael_Venegas/Projects/pybind11/build/mock_install/include/pybind11/stl_bind.h
-- Up-to-date: C:/Users/Ismael_Venegas/Projects/pybind11/build/mock_install/share/cmake/pybind11/pybind11Config.cmake
-- Up-to-date: C:/Users/Ismael_Venegas/Projects/pybind11/build/mock_install/share/cmake/pybind11/pybind11ConfigVersion.cmake
-- Up-to-date: C:/Users/Ismael_Venegas/Projects/pybind11/build/mock_install/share/cmake/pybind11/FindPythonLibsNew.cmake
-- Up-to-date: C:/Users/Ismael_Venegas/Projects/pybind11/build/mock_install/share/cmake/pybind11/pybind11Tools.cmake
-- Up-to-date: C:/Users/Ismael_Venegas/Projects/pybind11/build/mock_install/share/cmake/pybind11/pybind11Targets.cmake
FinalizeBuildStatus:
Deleting file "x64\Release\mock_install\mock_install.tlog\unsuccessfulbuild".
Touching "x64\Release\mock_install\mock_install.tlog\mock_install.lastbuildstate".
Done Building Project "C:\Users\Ismael_Venegas\Projects\pybind11\build\tests\test_cmake_build\mock_install.vcxproj" (default targets).
InitializeBuildStatus:
Touching "x64\Release\test_installed_embed\test_ins.6DAD982E.tlog\unsuccessfulbuild".
C:\Program Files (x86)\Microsoft Visual Studio\2017\BuildTools\Common7\IDE\VC\VCTargets\Microsoft.CppCommon.targets(209,5): error MSB6006: "cmd.exe" exited with code 1. [C:\Users\Ismael_Venegas\Projects\pybind11\build\tests\test_cmake_build\test_installed_embed.vcxproj]
Done Building Project "C:\Users\Ismael_Venegas\Projects\pybind11\build\tests\test_cmake_build\test_installed_embed.vcxproj" (default targets) -- FAILED.
Project "C:\Users\Ismael_Venegas\Projects\pybind11\build\tests\test_cmake_build\test_cmake_build.vcxproj" (7) is building "C:\Users\Ismael_Venegas\Projects\pybind11\build\tests\test_cmake_build\test_installed_function.vcxproj" (10) on node 1 (default targets).
InitializeBuildStatus:
Creating "x64\Release\test_installed_function\test_ins.C21B7EC0.tlog\unsuccessfulbuild" because "AlwaysCreate" was specified.
FinalizeBuildStatus:
Deleting file "x64\Release\test_installed_function\test_ins.C21B7EC0.tlog\unsuccessfulbuild".
Touching "x64\Release\test_installed_function\test_ins.C21B7EC0.tlog\test_installed_function.lastbuildstate".
Done Building Project "C:\Users\Ismael_Venegas\Projects\pybind11\build\tests\test_cmake_build\test_installed_function.vcxproj" (default targets).
Project "C:\Users\Ismael_Venegas\Projects\pybind11\build\tests\test_cmake_build\test_cmake_build.vcxproj" (7) is building "C:\Users\Ismael_Venegas\Projects\pybind11\build\tests\test_cmake_build\test_installed_target.vcxproj" (11) on node 1 (default targets).
InitializeBuildStatus:
Creating "x64\Release\test_installed_target\test_ins.CC10AE55.tlog\unsuccessfulbuild" because "AlwaysCreate" was specified.
FinalizeBuildStatus:
Deleting file "x64\Release\test_installed_target\test_ins.CC10AE55.tlog\unsuccessfulbuild".
Touching "x64\Release\test_installed_target\test_ins.CC10AE55.tlog\test_installed_target.lastbuildstate".
Done Building Project "C:\Users\Ismael_Venegas\Projects\pybind11\build\tests\test_cmake_build\test_installed_target.vcxproj" (default targets).
Project "C:\Users\Ismael_Venegas\Projects\pybind11\build\tests\test_cmake_build\test_cmake_build.vcxproj" (7) is building "C:\Users\Ismael_Venegas\Projects\pybind11\build\tests\test_cmake_build\test_subdirectory_embed.vcxproj" (12) on node 1 (default targets).
InitializeBuildStatus:
Touching "x64\Release\test_subdirectory_embed\test_sub.8EED0C63.tlog\unsuccessfulbuild".
C:\Program Files (x86)\Microsoft Visual Studio\2017\BuildTools\Common7\IDE\VC\VCTargets\Microsoft.CppCommon.targets(209,5): error MSB6006: "cmd.exe" exited with code 1. [C:\Users\Ismael_Venegas\Projects\pybind11\build\tests\test_cmake_build\test_subdirectory_embed.vcxproj]
Done Building Project "C:\Users\Ismael_Venegas\Projects\pybind11\build\tests\test_cmake_build\test_subdirectory_embed.vcxproj" (default targets) -- FAILED.
Project "C:\Users\Ismael_Venegas\Projects\pybind11\build\tests\test_cmake_build\test_cmake_build.vcxproj" (7) is building "C:\Users\Ismael_Venegas\Projects\pybind11\build\tests\test_cmake_build\test_subdirectory_function.vcxproj" (13) on node 1 (default targets).
InitializeBuildStatus:
Creating "x64\Release\test_subdirectory_function\test_sub.F4EAB58C.tlog\unsuccessfulbuild" because "AlwaysCreate" was specified.
FinalizeBuildStatus:
Deleting file "x64\Release\test_subdirectory_function\test_sub.F4EAB58C.tlog\unsuccessfulbuild".
Touching "x64\Release\test_subdirectory_function\test_sub.F4EAB58C.tlog\test_subdirectory_function.lastbuildstate".
Done Building Project "C:\Users\Ismael_Venegas\Projects\pybind11\build\tests\test_cmake_build\test_subdirectory_function.vcxproj" (default targets).
Project "C:\Users\Ismael_Venegas\Projects\pybind11\build\tests\test_cmake_build\test_cmake_build.vcxproj" (7) is building "C:\Users\Ismael_Venegas\Projects\pybind11\build\tests\test_cmake_build\test_subdirectory_target.vcxproj" (14) on node 1 (default targets).
InitializeBuildStatus:
Creating "x64\Release\test_subdirectory_target\test_sub.ADB9F18A.tlog\unsuccessfulbuild" because "AlwaysCreate" was specified.
FinalizeBuildStatus:
Deleting file "x64\Release\test_subdirectory_target\test_sub.ADB9F18A.tlog\unsuccessfulbuild".
Touching "x64\Release\test_subdirectory_target\test_sub.ADB9F18A.tlog\test_subdirectory_target.lastbuildstate".
Done Building Project "C:\Users\Ismael_Venegas\Projects\pybind11\build\tests\test_cmake_build\test_subdirectory_target.vcxproj" (default targets).
Done Building Project "C:\Users\Ismael_Venegas\Projects\pybind11\build\tests\test_cmake_build\test_cmake_build.vcxproj" (default targets) -- FAILED.
Done Building Project "C:\Users\Ismael_Venegas\Projects\pybind11\build\tests\check.vcxproj" (default targets) -- FAILED.
Build FAILED.
"C:\Users\Ismael_Venegas\Projects\pybind11\build\tests\check.vcxproj" (default target) (1) ->
"C:\Users\Ismael_Venegas\Projects\pybind11\build\tests\test_cmake_build\test_cmake_build.vcxproj" (default target) (7) ->
"C:\Users\Ismael_Venegas\Projects\pybind11\build\tests\test_cmake_build\test_installed_embed.vcxproj" (default target) (8) ->
(CustomBuild target) ->
C:\Program Files (x86)\Microsoft Visual Studio\2017\BuildTools\Common7\IDE\VC\VCTargets\Microsoft.CppCommon.targets(209,5): error MSB6006: "cmd.exe" exited with code 1. [C:\Users\Ismael_Venegas\Projects\pybind11\build\tests\test_cmake_build\test_installed_embed.vcxproj]
"C:\Users\Ismael_Venegas\Projects\pybind11\build\tests\check.vcxproj" (default target) (1) ->
"C:\Users\Ismael_Venegas\Projects\pybind11\build\tests\test_cmake_build\test_cmake_build.vcxproj" (default target) (7) ->
"C:\Users\Ismael_Venegas\Projects\pybind11\build\tests\test_cmake_build\test_subdirectory_embed.vcxproj" (default target) (12) ->
C:\Program Files (x86)\Microsoft Visual Studio\2017\BuildTools\Common7\IDE\VC\VCTargets\Microsoft.CppCommon.targets(209,5): error MSB6006: "cmd.exe" exited with code 1. [C:\Users\Ismael_Venegas\Projects\pybind11\build\tests\test_cmake_build\test_subdirectory_embed.vcxproj]
0 Warning(s)
2 Error(s)
Time Elapsed 00:00:37.81
Sign up for free to join this conversation on GitHub. Already have an account? Sign in to comment
You can’t perform that action at this time.