Skip to content

Instantly share code, notes, and snippets.

@Strykar Strykar/make.log
Created Jul 23, 2019

Embed
What would you like to do?
DKMS make.log for xtables-addons-3.3 for kernel 5.2.2-arch1-1-ARCH (x86_64)
Tue 23 Jul 2019 04:33:29 AM UTC
make: Entering directory '/usr/lib/modules/5.2.2-arch1-1-ARCH/build'
test -e include/generated/autoconf.h -a -e include/config/auto.conf || ( \
echo >&2; \
echo >&2 " ERROR: Kernel configuration is invalid."; \
echo >&2 " include/generated/autoconf.h or include/config/auto.conf are missing.";\
echo >&2 " Run 'make oldconfig && make prepare' on kernel src to fix it."; \
echo >&2 ; \
/bin/false)
mkdir -p /var/lib/dkms/xtables-addons/3.3/build/extensions/.tmp_versions ; rm -f /var/lib/dkms/xtables-addons/3.3/build/extensions/.tmp_versions/*
make -f ./scripts/Makefile.build obj=/var/lib/dkms/xtables-addons/3.3/build/extensions
make -f ./scripts/Makefile.build obj=/var/lib/dkms/xtables-addons/3.3/build/extensions/ACCOUNT need-builtin=
gcc -Wp,-MD,/var/lib/dkms/xtables-addons/3.3/build/extensions/ACCOUNT/.xt_ACCOUNT.o.d -nostdinc -isystem /usr/lib/gcc/x86_64-pc-linux-gnu/9.1.0/include -I./arch/x86/include -I./arch/x86/include/generated -I./include -I./arch/x86/include/uapi -I./arch/x86/include/generated/uapi -I./include/uapi -I./include/generated/uapi -include ./include/linux/kconfig.h -include ./include/linux/compiler_types.h -D__KERNEL__ -Wall -Wundef -Werror=strict-prototypes -Wno-trigraphs -fno-strict-aliasing -fno-common -fshort-wchar -fno-PIE -Werror=implicit-function-declaration -Werror=implicit-int -Wno-format-security -std=gnu89 -mno-sse -mno-mmx -mno-sse2 -mno-3dnow -mno-avx -m64 -falign-jumps=1 -falign-loops=1 -mno-80387 -mno-fp-ret-in-387 -mpreferred-stack-boundary=3 -mskip-rax-setup -mtune=generic -mno-red-zone -mcmodel=kernel -DCONFIG_AS_CFI=1 -DCONFIG_AS_CFI_SIGNAL_FRAME=1 -DCONFIG_AS_CFI_SECTIONS=1 -DCONFIG_AS_SSSE3=1 -DCONFIG_AS_AVX=1 -DCONFIG_AS_AVX2=1 -DCONFIG_AS_AVX512=1 -DCONFIG_AS_SHA1_NI=1 -DCONFIG_AS_SHA256_NI=1 -Wno-sign-compare -fno-asynchronous-unwind-tables -mindirect-branch=thunk-extern -mindirect-branch-register -fno-jump-tables -fno-delete-null-pointer-checks -Wno-frame-address -Wno-format-truncation -Wno-format-overflow -Wno-address-of-packed-member -O2 --param=allow-store-data-races=0 -fplugin=./scripts/gcc-plugins/structleak_plugin.so -fplugin-arg-structleak_plugin-byref-all -DSTRUCTLEAK_PLUGIN -Wframe-larger-than=2048 -fstack-protector-strong -Wno-unused-but-set-variable -Wno-unused-const-variable -fno-var-tracking-assignments -pg -mrecord-mcount -mfentry -DCC_USING_FENTRY -Wdeclaration-after-statement -Wvla -Wno-pointer-sign -Wno-stringop-truncation -fno-strict-overflow -fno-merge-all-constants -fmerge-constants -fno-stack-check -fconserve-stack -Werror=date-time -Werror=incompatible-pointer-types -Werror=designated-init -fmacro-prefix-map=./= -Wno-packed-not-aligned -I/var/lib/dkms/xtables-addons/3.3/build/extensions/ACCOUNT/.. -DMODULE -DKBUILD_BASENAME='"xt_ACCOUNT"' -DKBUILD_MODNAME='"xt_ACCOUNT"' -c -o /var/lib/dkms/xtables-addons/3.3/build/extensions/ACCOUNT/xt_ACCOUNT.o /var/lib/dkms/xtables-addons/3.3/build/extensions/ACCOUNT/xt_ACCOUNT.c
./tools/objtool/objtool orc generate --module --no-fp --retpoline --uaccess /var/lib/dkms/xtables-addons/3.3/build/extensions/ACCOUNT/xt_ACCOUNT.o
(cat /dev/null; echo kernel//var/lib/dkms/xtables-addons/3.3/build/extensions/ACCOUNT/xt_ACCOUNT.ko;) > /var/lib/dkms/xtables-addons/3.3/build/extensions/ACCOUNT/modules.order
make -f ./scripts/Makefile.build obj=/var/lib/dkms/xtables-addons/3.3/build/extensions/pknock need-builtin=
gcc -Wp,-MD,/var/lib/dkms/xtables-addons/3.3/build/extensions/pknock/.xt_pknock.o.d -nostdinc -isystem /usr/lib/gcc/x86_64-pc-linux-gnu/9.1.0/include -I./arch/x86/include -I./arch/x86/include/generated -I./include -I./arch/x86/include/uapi -I./arch/x86/include/generated/uapi -I./include/uapi -I./include/generated/uapi -include ./include/linux/kconfig.h -include ./include/linux/compiler_types.h -D__KERNEL__ -Wall -Wundef -Werror=strict-prototypes -Wno-trigraphs -fno-strict-aliasing -fno-common -fshort-wchar -fno-PIE -Werror=implicit-function-declaration -Werror=implicit-int -Wno-format-security -std=gnu89 -mno-sse -mno-mmx -mno-sse2 -mno-3dnow -mno-avx -m64 -falign-jumps=1 -falign-loops=1 -mno-80387 -mno-fp-ret-in-387 -mpreferred-stack-boundary=3 -mskip-rax-setup -mtune=generic -mno-red-zone -mcmodel=kernel -DCONFIG_AS_CFI=1 -DCONFIG_AS_CFI_SIGNAL_FRAME=1 -DCONFIG_AS_CFI_SECTIONS=1 -DCONFIG_AS_SSSE3=1 -DCONFIG_AS_AVX=1 -DCONFIG_AS_AVX2=1 -DCONFIG_AS_AVX512=1 -DCONFIG_AS_SHA1_NI=1 -DCONFIG_AS_SHA256_NI=1 -Wno-sign-compare -fno-asynchronous-unwind-tables -mindirect-branch=thunk-extern -mindirect-branch-register -fno-jump-tables -fno-delete-null-pointer-checks -Wno-frame-address -Wno-format-truncation -Wno-format-overflow -Wno-address-of-packed-member -O2 --param=allow-store-data-races=0 -fplugin=./scripts/gcc-plugins/structleak_plugin.so -fplugin-arg-structleak_plugin-byref-all -DSTRUCTLEAK_PLUGIN -Wframe-larger-than=2048 -fstack-protector-strong -Wno-unused-but-set-variable -Wno-unused-const-variable -fno-var-tracking-assignments -pg -mrecord-mcount -mfentry -DCC_USING_FENTRY -Wdeclaration-after-statement -Wvla -Wno-pointer-sign -Wno-stringop-truncation -fno-strict-overflow -fno-merge-all-constants -fmerge-constants -fno-stack-check -fconserve-stack -Werror=date-time -Werror=incompatible-pointer-types -Werror=designated-init -fmacro-prefix-map=./= -Wno-packed-not-aligned -I/var/lib/dkms/xtables-addons/3.3/build/extensions/pknock/.. -DMODULE -DKBUILD_BASENAME='"xt_pknock"' -DKBUILD_MODNAME='"xt_pknock"' -c -o /var/lib/dkms/xtables-addons/3.3/build/extensions/pknock/xt_pknock.o /var/lib/dkms/xtables-addons/3.3/build/extensions/pknock/xt_pknock.c
/var/lib/dkms/xtables-addons/3.3/build/extensions/pknock/xt_pknock.c: In function ‘xt_pknock_mt_init’:
/var/lib/dkms/xtables-addons/3.3/build/extensions/pknock/xt_pknock.c:1128:13: error: ‘struct shash_desc’ has no member named ‘flags’
1128 | crypto.desc.flags = 0;
| ^
make[2]: *** [scripts/Makefile.build:285: /var/lib/dkms/xtables-addons/3.3/build/extensions/pknock/xt_pknock.o] Error 1
make[1]: *** [scripts/Makefile.build:489: /var/lib/dkms/xtables-addons/3.3/build/extensions/pknock] Error 2
make: *** [Makefile:1595: _module_/var/lib/dkms/xtables-addons/3.3/build/extensions] Error 2
make: Leaving directory '/usr/lib/modules/5.2.2-arch1-1-ARCH/build'
Sign up for free to join this conversation on GitHub. Already have an account? Sign in to comment
You can’t perform that action at this time.