Skip to content

Instantly share code, notes, and snippets.

Embed
What would you like to do?
0:14.40 host_stdc++compat.o
0:14.58 /home/ato/Code/gecko/src/build/unix/stdc++compat/stdc++compat.cpp:192:5: error: use of undeclared identifier 'runtime_error'
0:14.58 runtime_error::runtime_error(char const* s)
0:14.58 ^
0:14.58 1 error generated.
0:14.58
0:14.58 In the directory /home/ato/Code/gecko/build/b2g-release/build/unix/stdc++compat
0:14.58 The following command failed to execute properly:
0:14.58 /usr/bin/ccache clang++ -o host_stdc++compat.o -c -DMOZ_ENABLE_JS_DUMP -std=gnu++0x -D_GLIBCXX_USE_CXX11_ABI=0 -MD -MP -MF .deps/host_stdc++compat.o.pp -DMOZ_LIBSTDCXX_VERSION=197653 -I/home/ato/Code/gecko/src/build/unix/stdc++compat -I. -I../../../dist/include -I/home/ato/Code/gecko/build/b2g-release/dist/include/nspr /home/ato/Code/gecko/src/build/unix/stdc++compat/stdc++compat.cpp
0:14.58 /home/ato/Code/gecko/src/config/rules.mk:894: recipe for target 'host_stdc++compat.o' failed
0:14.58 make[5]: *** [host_stdc++compat.o] Error 1
0:14.58 /home/ato/Code/gecko/src/config/recurse.mk:70: recipe for target 'build/unix/stdc++compat/host' failed
0:14.58 make[4]: *** [build/unix/stdc++compat/host] Error 2
0:14.58 /home/ato/Code/gecko/src/config/recurse.mk:32: recipe for target 'export' failed
0:14.58 make[3]: *** [export] Error 2
0:14.58 /home/ato/Code/gecko/src/config/rules.mk:538: recipe for target 'default' failed
0:14.58 make[2]: *** [default] Error 2
0:14.58 /home/ato/Code/gecko/src/client.mk:400: recipe for target 'realbuild' failed
0:14.58 make[1]: *** [realbuild] Error 2
0:14.58 client.mk:171: recipe for target 'build' failed
0:14.58 make: *** [build] Error 2
0:14.62 360 compiler warnings present.
0:15.63 ccache (direct) hit rate: 52.9%; (preprocessed) hit rate: 47.1%; miss rate: 0.0%
Sign up for free to join this conversation on GitHub. Already have an account? Sign in to comment
You can’t perform that action at this time.