Skip to content

Instantly share code, notes, and snippets.

Embed
What would you like to do?
pmOS error log #3
>>> linux-asus-tf700t: Unpacking /var/cache/distfiles/linux-asus-tf700t-cbde2a64b1f7244ed5a85b79dfcb4e56e79dbda5.tar.gz...
>>> linux-asus-tf700t: Applying Wno-error.patch...
'/home/user/build/src/compiler-gcc6.h' -> '/home/user/build/src/tf300t-katkernel-cbde2a64b1f7244ed5a85b79dfcb4e56e79dbda5/include/linux/compiler-gcc6.h'
make: Entering directory '/home/user/build/src/tf300t-katkernel-cbde2a64b1f7244ed5a85b79dfcb4e56e79dbda5'
GEN /home/user/build/src/build/Makefile
HOSTCC scripts/basic/fixdep
HOSTCC scripts/kconfig/conf.o
SHIPPED scripts/kconfig/zconf.tab.c
SHIPPED scripts/kconfig/zconf.lex.c
SHIPPED scripts/kconfig/zconf.hash.c
HOSTCC scripts/kconfig/zconf.tab.o
HOSTLD scripts/kconfig/conf
scripts/kconfig/conf --silentoldconfig Kconfig
fs/Kconfig:311:warning: type of 'ASYNC_FSYNC' redefined from 'boolean' to 'string'
drivers/misc/inv_mpu6050/Kconfig:22:warning: choice value used outside its choice group
drivers/misc/inv_mpu6050/Kconfig:31:warning: choice value used outside its choice group
drivers/misc/inv_mpu6050/Kconfig:40:warning: choice value used outside its choice group
drivers/misc/inv_mpu6050/Kconfig:56:warning: choice value used outside its choice group
drivers/misc/inv_mpu6050/Kconfig:60:warning: choice value used outside its choice group
make: Leaving directory '/home/user/build/src/tf300t-katkernel-cbde2a64b1f7244ed5a85b79dfcb4e56e79dbda5'
GEN /home/user/build/src/build/Makefile
CHK include/linux/version.h
UPD include/linux/version.h
Using /home/user/build/src/tf300t-katkernel-cbde2a64b1f7244ed5a85b79dfcb4e56e79dbda5 as source for kernel
CHK include/generated/utsrelease.h
UPD include/generated/utsrelease.h
HOSTCC scripts/kallsyms
Generating include/generated/mach-types.h
CC scripts/mod/empty.o
HOSTCC scripts/selinux/genheaders/genheaders
HOSTCC scripts/mod/mk_elfconfig
HOSTCC scripts/selinux/mdp/mdp
MKELF scripts/mod/elfconfig.h
HOSTCC scripts/mod/file2alias.o
HOSTCC scripts/mod/modpost.o
HOSTCC scripts/mod/sumversion.o
HOSTCC scripts/conmakehash
HOSTCC scripts/bin2c
HOSTLD scripts/mod/modpost
CC kernel/bounds.s
GEN include/generated/bounds.h
CC arch/arm/kernel/asm-offsets.s
GEN include/generated/asm-offsets.h
CALL /home/user/build/src/tf300t-katkernel-cbde2a64b1f7244ed5a85b79dfcb4e56e79dbda5/scripts/checksyscalls.sh
CC init/main.o
HOSTCC usr/gen_init_cpio
CC arch/arm/kernel/elf.o
CC arch/arm/vfp/vfpmodule.o
AS arch/arm/kernel/entry-armv.o
AS arch/arm/vfp/entry.o
AS arch/arm/kernel/entry-common.o
AS arch/arm/vfp/vfphw.o
CC arch/arm/vfp/vfpsingle.o
CC arch/arm/kernel/irq.o
CHK include/generated/compile.h
CC arch/arm/vfp/vfpdouble.o
UPD include/generated/compile.h
CC init/do_mounts.o
LD arch/arm/vfp/vfp.o
LD arch/arm/vfp/built-in.o
CC arch/arm/mm/extable.o
GEN usr/initramfs_data.cpio
CC arch/arm/kernel/process.o
AS usr/initramfs_data.o
LD usr/built-in.o
CC arch/arm/mm/fault.o
CC arch/arm/common/gic.o
CC arch/arm/kernel/ptrace.o
AS arch/arm/common/fiq_glue.o
CC init/do_mounts_initrd.o
CC arch/arm/common/fiq_glue_setup.o
CC arch/arm/mm/init.o
CC arch/arm/common/fiq_debugger.o
CC arch/arm/kernel/return_address.o
CC init/initramfs.o
/home/user/build/src/tf300t-katkernel-cbde2a64b1f7244ed5a85b79dfcb4e56e79dbda5/arch/arm/kernel/return_address.c:62:2: warning: #warning "TODO: return_address should use unwind tables" [-Wcpp]
#warning "TODO: return_address should use unwind tables"
^~~~~~~
CC arch/arm/kernel/setup.o
CC arch/arm/mm/iomap.o
LD arch/arm/common/built-in.o
AS arch/arm/crypto/aes-armv4.o
CC arch/arm/crypto/aes_glue.o
CC init/calibrate.o
CC init/version.o
CC arch/arm/mm/dma-mapping.o
LD arch/arm/crypto/aes-arm.o
LD arch/arm/crypto/built-in.o
CC arch/arm/kernel/signal.o
CC arch/arm/mach-tegra/ahb.o
CC arch/arm/mach-tegra/apbio.o
CC arch/arm/mm/fault-armv.o
CC arch/arm/kernel/sys_arm.o
CC arch/arm/mach-tegra/common.o
LD init/mounts.o
LD init/built-in.o
CC kernel/sched.o
CC arch/arm/mm/flush.o
CC arch/arm/kernel/stacktrace.o
CC arch/arm/mach-tegra/board-info.o
CC arch/arm/kernel/time.o
CC arch/arm/mm/idmap.o
CC arch/arm/mach-tegra/common-t3.o
CC arch/arm/kernel/traps.o
CC kernel/fork.o
CC arch/arm/mach-tegra/io.o
CC arch/arm/mm/ioremap.o
CC arch/arm/kernel/fiq.o
CC arch/arm/mach-tegra/irq.o
AS arch/arm/kernel/fiqasm.o
CC arch/arm/mm/mmap.o
CC arch/arm/mach-tegra/clock.o
CC arch/arm/kernel/bios32.o
CC kernel/exec_domain.o
CC arch/arm/mm/pgd.o
CC arch/arm/mach-tegra/clock-common.o
CC arch/arm/kernel/isa.o
CC kernel/panic.o
CC arch/arm/mach-tegra/timer.o
AS arch/arm/kernel/sleep.o
CC arch/arm/mm/mmu.o
CC arch/arm/kernel/sched_clock.o
CC kernel/printk.o
CC arch/arm/kernel/smp.o
CC arch/arm/mach-tegra/timerinfo.o
CC arch/arm/mm/vmregion.o
CC kernel/cpu.o
CC arch/arm/mm/pageattr.o
CC arch/arm/mach-tegra/tegra3_clocks.o
CC arch/arm/kernel/smp_tlb.o
CC kernel/exit.o
CC arch/arm/kernel/smp_scu.o
/home/user/build/src/tf300t-katkernel-cbde2a64b1f7244ed5a85b79dfcb4e56e79dbda5/arch/arm/mach-tegra/tegra3_clocks.c: In function 'tegra3_cpu_clk_init':
/home/user/build/src/tf300t-katkernel-cbde2a64b1f7244ed5a85b79dfcb4e56e79dbda5/arch/arm/mach-tegra/tegra3_clocks.c:823:31: warning: logical not is only applied to the left hand side of comparison [-Wlogical-not-parentheses]
c->state = (!is_lp_cluster() == (c->u.cpu.mode == MODE_G))? ON : OFF;
^~
/home/user/build/src/tf300t-katkernel-cbde2a64b1f7244ed5a85b79dfcb4e56e79dbda5/arch/arm/mach-tegra/tegra3_clocks.c: In function 'tegra3_pll_clk_set_rate':
/home/user/build/src/tf300t-katkernel-cbde2a64b1f7244ed5a85b79dfcb4e56e79dbda5/arch/arm/mach-tegra/tegra3_clocks.c:1725:4: warning: ISO C90 forbids mixed declarations and code [-Wdeclaration-after-statement]
unsigned long output_real = input*divN/divM;
^~~~~~~~
CC arch/arm/mm/alignment.o
CC arch/arm/mach-tegra/clocks_stats.o
CC arch/arm/kernel/smp_twd.o
/home/user/build/src/tf300t-katkernel-cbde2a64b1f7244ed5a85b79dfcb4e56e79dbda5/arch/arm/mm/alignment.c: In function 'do_alignment':
/home/user/build/src/tf300t-katkernel-cbde2a64b1f7244ed5a85b79dfcb4e56e79dbda5/arch/arm/mm/alignment.c:326:15: warning: 'offset.un' may be used uninitialized in this function [-Wmaybe-uninitialized]
offset.un = -offset.un;
^~~~~~~~~~
/home/user/build/src/tf300t-katkernel-cbde2a64b1f7244ed5a85b79dfcb4e56e79dbda5/arch/arm/mm/alignment.c:748:21: note: 'offset.un' was declared here
union offset_union offset;
^~~~~~
CC arch/arm/mach-tegra/timer-t3.o
CC arch/arm/mm/highmem.o
CC arch/arm/kernel/unwind.o
CC kernel/itimer.o
CC arch/arm/mach-tegra/pinmux.o
AS arch/arm/mm/abort-ev7.o
AS arch/arm/mm/pabort-v7.o
make[3]: *** No rule to make target 'arch/arm/kernel/div_emulate.o', needed by 'arch/arm/kernel/built-in.o'. Stop.
make[3]: *** Waiting for unfinished jobs....
CC arch/arm/kernel/swp_emulate.o
AS arch/arm/mm/cache-v7.o
CC arch/arm/mm/copypage-v6.o
HZFILE kernel/hz.bc
CC kernel/softirq.o
CC arch/arm/mach-tegra/devices.o
make[2]: *** [/home/user/build/src/tf300t-katkernel-cbde2a64b1f7244ed5a85b79dfcb4e56e79dbda5/Makefile:948: arch/arm/kernel] Error 2
make[2]: *** Waiting for unfinished jobs....
AS arch/arm/mach-tegra/delay.o
CC arch/arm/mm/context.o
CC arch/arm/mach-tegra/powergate.o
CC kernel/resource.o
AS arch/arm/mm/tlb-v7.o
AS arch/arm/mm/proc-v7.o
CC arch/arm/mm/cache-l2x0.o
CC arch/arm/mach-tegra/pm.o
CC arch/arm/mach-tegra/pm-irq.o
CC kernel/sysctl.o
LD arch/arm/mm/built-in.o
CC kernel/sysctl_binary.o
In file included from /home/user/build/src/tf300t-katkernel-cbde2a64b1f7244ed5a85b79dfcb4e56e79dbda5/arch/arm/include/asm/byteorder.h:21:0,
from /home/user/build/src/tf300t-katkernel-cbde2a64b1f7244ed5a85b79dfcb4e56e79dbda5/include/asm-generic/bitops/le.h:5,
from /home/user/build/src/tf300t-katkernel-cbde2a64b1f7244ed5a85b79dfcb4e56e79dbda5/arch/arm/include/asm/bitops.h:308,
from /home/user/build/src/tf300t-katkernel-cbde2a64b1f7244ed5a85b79dfcb4e56e79dbda5/include/linux/bitops.h:22,
from /home/user/build/src/tf300t-katkernel-cbde2a64b1f7244ed5a85b79dfcb4e56e79dbda5/include/linux/kernel.h:17,
from /home/user/build/src/tf300t-katkernel-cbde2a64b1f7244ed5a85b79dfcb4e56e79dbda5/arch/arm/mach-tegra/pm-irq.c:18:
/home/user/build/src/tf300t-katkernel-cbde2a64b1f7244ed5a85b79dfcb4e56e79dbda5/arch/arm/mach-tegra/pm-irq.c:121:21: warning: 'pmc' is static but used in inline function 'read_pmc_wake_status' which is not static
reg |= ((u64)readl(pmc + PMC_WAKE2_STATUS)) << 32;
^
/home/user/build/src/tf300t-katkernel-cbde2a64b1f7244ed5a85b79dfcb4e56e79dbda5/include/linux/byteorder/little_endian.h:33:51: note: in definition of macro '__le32_to_cpu'
#define __le32_to_cpu(x) ((__force __u32)(__le32)(x))
^
/home/user/build/src/tf300t-katkernel-cbde2a64b1f7244ed5a85b79dfcb4e56e79dbda5/arch/arm/include/asm/io.h:196:6: note: in expansion of macro '__raw_readl'
__raw_readl(__mem_pci(c))); __v; })
^~~~~~~~~~~
/home/user/build/src/tf300t-katkernel-cbde2a64b1f7244ed5a85b79dfcb4e56e79dbda5/arch/arm/include/asm/io.h:196:18: note: in expansion of macro '__mem_pci'
__raw_readl(__mem_pci(c))); __v; })
^~~~~~~~~
/home/user/build/src/tf300t-katkernel-cbde2a64b1f7244ed5a85b79dfcb4e56e79dbda5/arch/arm/include/asm/io.h:206:32: note: in expansion of macro 'readl_relaxed'
#define readl(c) ({ u32 __v = readl_relaxed(c); __iormb(); __v; })
^~~~~~~~~~~~~
/home/user/build/src/tf300t-katkernel-cbde2a64b1f7244ed5a85b79dfcb4e56e79dbda5/arch/arm/mach-tegra/pm-irq.c:121:15: note: in expansion of macro 'readl'
reg |= ((u64)readl(pmc + PMC_WAKE2_STATUS)) << 32;
^~~~~
In file included from /home/user/build/src/tf300t-katkernel-cbde2a64b1f7244ed5a85b79dfcb4e56e79dbda5/include/linux/io.h:22:0,
from /home/user/build/src/tf300t-katkernel-cbde2a64b1f7244ed5a85b79dfcb4e56e79dbda5/arch/arm/mach-tegra/pm-irq.c:24:
/home/user/build/src/tf300t-katkernel-cbde2a64b1f7244ed5a85b79dfcb4e56e79dbda5/arch/arm/mach-tegra/pm-irq.c:120:20: warning: 'pmc' is static but used in inline function 'read_pmc_wake_status' which is not static
reg = __raw_readl(pmc + PMC_WAKE_STATUS);
^
/home/user/build/src/tf300t-katkernel-cbde2a64b1f7244ed5a85b79dfcb4e56e79dbda5/arch/arm/include/asm/io.h:56:80: note: in definition of macro '__raw_readl'
#define __raw_readl(a) (__chk_io_ptr(a), *(volatile unsigned int __force *)(a))
^
CC arch/arm/mach-tegra/gic.o
AS arch/arm/mach-tegra/sleep.o
AS arch/arm/mach-tegra/sleep-t3.o
CC arch/arm/mach-tegra/fuse.o
CC arch/arm/mach-tegra/kfuse.o
CC kernel/capability.o
CC arch/arm/mach-tegra/csi.o
CC kernel/ptrace.o
CC arch/arm/mach-tegra/tegra_odm_fuses.o
CC arch/arm/mach-tegra/i2c_error_recovery.o
CC arch/arm/mach-tegra/mc.o
CC kernel/timer.o
CC kernel/user.o
CC arch/arm/mach-tegra/usb_phy.o
CC arch/arm/mach-tegra/tegra3_usb_phy.o
CC kernel/signal.o
CC arch/arm/mach-tegra/tegra2_usb_phy.o
CC kernel/sys.o
/home/user/build/src/tf300t-katkernel-cbde2a64b1f7244ed5a85b79dfcb4e56e79dbda5/arch/arm/mach-tegra/tegra3_usb_phy.c: In function 'uhsic_phy_open':
/home/user/build/src/tf300t-katkernel-cbde2a64b1f7244ed5a85b79dfcb4e56e79dbda5/arch/arm/mach-tegra/tegra3_usb_phy.c:2196:6: warning: unused variable 'ret' [-Wunused-variable]
int ret;
^~~
/home/user/build/src/tf300t-katkernel-cbde2a64b1f7244ed5a85b79dfcb4e56e79dbda5/arch/arm/mach-tegra/tegra3_usb_phy.c: In function 'uhsic_phy_close':
/home/user/build/src/tf300t-katkernel-cbde2a64b1f7244ed5a85b79dfcb4e56e79dbda5/arch/arm/mach-tegra/tegra3_usb_phy.c:2230:6: warning: unused variable 'ret' [-Wunused-variable]
int ret;
^~~
At top level:
/home/user/build/src/tf300t-katkernel-cbde2a64b1f7244ed5a85b79dfcb4e56e79dbda5/arch/arm/mach-tegra/tegra3_usb_phy.c:2174:12: warning: 'hsic_rail_disable' defined but not used [-Wunused-function]
static int hsic_rail_disable(struct tegra_usb_phy *phy)
^~~~~~~~~~~~~~~~~
/home/user/build/src/tf300t-katkernel-cbde2a64b1f7244ed5a85b79dfcb4e56e79dbda5/arch/arm/mach-tegra/tegra3_usb_phy.c:2152:12: warning: 'hsic_rail_enable' defined but not used [-Wunused-function]
static int hsic_rail_enable(struct tegra_usb_phy *phy)
^~~~~~~~~~~~~~~~
CC arch/arm/mach-tegra/fiq.o
CC arch/arm/mach-tegra/tegra_fiq_debugger.o
CC kernel/kmod.o
CC arch/arm/mach-tegra/pwm.o
CC kernel/workqueue.o
CC arch/arm/mach-tegra/dvfs.o
CC arch/arm/mach-tegra/tegra3_dvfs.o
CC kernel/pid.o
/home/user/build/src/tf300t-katkernel-cbde2a64b1f7244ed5a85b79dfcb4e56e79dbda5/arch/arm/mach-tegra/tegra3_dvfs.c:239:17: warning: initialization discards 'const' qualifier from pointer target type [-Wdiscarded-qualifiers]
.millivolts = core_millivolts, \
^
/home/user/build/src/tf300t-katkernel-cbde2a64b1f7244ed5a85b79dfcb4e56e79dbda5/arch/arm/mach-tegra/tegra3_dvfs.c:247:2: note: in expansion of macro 'CORE_DVFS'
CORE_DVFS("cpu_lp", 0, 1, KHZ, 1, 294000, 342000, 427000, 475000, 500000, 500000, 500000, 500000),
^~~~~~~~~
/home/user/build/src/tf300t-katkernel-cbde2a64b1f7244ed5a85b79dfcb4e56e79dbda5/arch/arm/mach-tegra/tegra3_dvfs.c:239:17: warning: initialization discards 'const' qualifier from pointer target type [-Wdiscarded-qualifiers]
.millivolts = core_millivolts, \
^
/home/user/build/src/tf300t-katkernel-cbde2a64b1f7244ed5a85b79dfcb4e56e79dbda5/arch/arm/mach-tegra/tegra3_dvfs.c:248:2: note: in expansion of macro 'CORE_DVFS'
CORE_DVFS("cpu_lp", 1, 1, KHZ, 204000, 294000, 342000, 427000, 475000, 500000, 500000, 500000, 500000),
^~~~~~~~~
/home/user/build/src/tf300t-katkernel-cbde2a64b1f7244ed5a85b79dfcb4e56e79dbda5/arch/arm/mach-tegra/tegra3_dvfs.c:239:17: warning: initialization discards 'const' qualifier from pointer target type [-Wdiscarded-qualifiers]
.millivolts = core_millivolts, \
^
/home/user/build/src/tf300t-katkernel-cbde2a64b1f7244ed5a85b79dfcb4e56e79dbda5/arch/arm/mach-tegra/tegra3_dvfs.c:249:2: note: in expansion of macro 'CORE_DVFS'
CORE_DVFS("cpu_lp", 2, 1, KHZ, 204000, 295000, 370000, 428000, 475000, 513000, 579000, 620000, 620000),
^~~~~~~~~
/home/user/build/src/tf300t-katkernel-cbde2a64b1f7244ed5a85b79dfcb4e56e79dbda5/arch/arm/mach-tegra/tegra3_dvfs.c:239:17: warning: initialization discards 'const' qualifier from pointer target type [-Wdiscarded-qualifiers]
.millivolts = core_millivolts, \
^
/home/user/build/src/tf300t-katkernel-cbde2a64b1f7244ed5a85b79dfcb4e56e79dbda5/arch/arm/mach-tegra/tegra3_dvfs.c:250:2: note: in expansion of macro 'CORE_DVFS'
CORE_DVFS("cpu_lp", 3, 1, KHZ, 1, 1, 1, 1, 1, 1, 450000, 450000, 450000),
^~~~~~~~~
/home/user/build/src/tf300t-katkernel-cbde2a64b1f7244ed5a85b79dfcb4e56e79dbda5/arch/arm/mach-tegra/tegra3_dvfs.c:239:17: warning: initialization discards 'const' qualifier from pointer target type [-Wdiscarded-qualifiers]
.millivolts = core_millivolts, \
^
/home/user/build/src/tf300t-katkernel-cbde2a64b1f7244ed5a85b79dfcb4e56e79dbda5/arch/arm/mach-tegra/tegra3_dvfs.c:252:2: note: in expansion of macro 'CORE_DVFS'
CORE_DVFS("emc", 0, 1, KHZ, 1, 266500, 266500, 266500, 266500, 533000, 533000, 533000, 533000),
^~~~~~~~~
/home/user/build/src/tf300t-katkernel-cbde2a64b1f7244ed5a85b79dfcb4e56e79dbda5/arch/arm/mach-tegra/tegra3_dvfs.c:239:17: warning: initialization discards 'const' qualifier from pointer target type [-Wdiscarded-qualifiers]
.millivolts = core_millivolts, \
^
/home/user/build/src/tf300t-katkernel-cbde2a64b1f7244ed5a85b79dfcb4e56e79dbda5/arch/arm/mach-tegra/tegra3_dvfs.c:253:2: note: in expansion of macro 'CORE_DVFS'
CORE_DVFS("emc", 1, 1, KHZ, 102000, 408000, 408000, 408000, 408000, 667000, 667000, 667000, 667000),
^~~~~~~~~
/home/user/build/src/tf300t-katkernel-cbde2a64b1f7244ed5a85b79dfcb4e56e79dbda5/arch/arm/mach-tegra/tegra3_dvfs.c:239:17: warning: initialization discards 'const' qualifier from pointer target type [-Wdiscarded-qualifiers]
.millivolts = core_millivolts, \
^
/home/user/build/src/tf300t-katkernel-cbde2a64b1f7244ed5a85b79dfcb4e56e79dbda5/arch/arm/mach-tegra/tegra3_dvfs.c:254:2: note: in expansion of macro 'CORE_DVFS'
CORE_DVFS("emc", 2, 1, KHZ, 102000, 450000, 450000, 450000, 450000, 667000, 667000, 800000, 900000),
^~~~~~~~~
/home/user/build/src/tf300t-katkernel-cbde2a64b1f7244ed5a85b79dfcb4e56e79dbda5/arch/arm/mach-tegra/tegra3_dvfs.c:239:17: warning: initialization discards 'const' qualifier from pointer target type [-Wdiscarded-qualifiers]
.millivolts = core_millivolts, \
^
/home/user/build/src/tf300t-katkernel-cbde2a64b1f7244ed5a85b79dfcb4e56e79dbda5/arch/arm/mach-tegra/tegra3_dvfs.c:255:2: note: in expansion of macro 'CORE_DVFS'
CORE_DVFS("emc", 3, 1, KHZ, 1, 1, 1, 1, 1, 1, 625000, 625000, 625000),
^~~~~~~~~
/home/user/build/src/tf300t-katkernel-cbde2a64b1f7244ed5a85b79dfcb4e56e79dbda5/arch/arm/mach-tegra/tegra3_dvfs.c:239:17: warning: initialization discards 'const' qualifier from pointer target type [-Wdiscarded-qualifiers]
.millivolts = core_millivolts, \
^
/home/user/build/src/tf300t-katkernel-cbde2a64b1f7244ed5a85b79dfcb4e56e79dbda5/arch/arm/mach-tegra/tegra3_dvfs.c:257:2: note: in expansion of macro 'CORE_DVFS'
CORE_DVFS("sbus", 0, 1, KHZ, 1, 136000, 164000, 191000, 216000, 216000, 216000, 216000, 216000),
^~~~~~~~~
/home/user/build/src/tf300t-katkernel-cbde2a64b1f7244ed5a85b79dfcb4e56e79dbda5/arch/arm/mach-tegra/tegra3_dvfs.c:239:17: warning: initialization discards 'const' qualifier from pointer target type [-Wdiscarded-qualifiers]
.millivolts = core_millivolts, \
^
/home/user/build/src/tf300t-katkernel-cbde2a64b1f7244ed5a85b79dfcb4e56e79dbda5/arch/arm/mach-tegra/tegra3_dvfs.c:258:2: note: in expansion of macro 'CORE_DVFS'
CORE_DVFS("sbus", 1, 1, KHZ, 102000, 205000, 205000, 227000, 227000, 267000, 267000, 267000, 267000),
^~~~~~~~~
/home/user/build/src/tf300t-katkernel-cbde2a64b1f7244ed5a85b79dfcb4e56e79dbda5/arch/arm/mach-tegra/tegra3_dvfs.c:239:17: warning: initialization discards 'const' qualifier from pointer target type [-Wdiscarded-qualifiers]
.millivolts = core_millivolts, \
^
/home/user/build/src/tf300t-katkernel-cbde2a64b1f7244ed5a85b79dfcb4e56e79dbda5/arch/arm/mach-tegra/tegra3_dvfs.c:259:2: note: in expansion of macro 'CORE_DVFS'
CORE_DVFS("sbus", 2, 1, KHZ, 102000, 205000, 205000, 227000, 227000, 267000, 334000, 334000, 334000),
^~~~~~~~~
/home/user/build/src/tf300t-katkernel-cbde2a64b1f7244ed5a85b79dfcb4e56e79dbda5/arch/arm/mach-tegra/tegra3_dvfs.c:239:17: warning: initialization discards 'const' qualifier from pointer target type [-Wdiscarded-qualifiers]
.millivolts = core_millivolts, \
^
/home/user/build/src/tf300t-katkernel-cbde2a64b1f7244ed5a85b79dfcb4e56e79dbda5/arch/arm/mach-tegra/tegra3_dvfs.c:260:2: note: in expansion of macro 'CORE_DVFS'
CORE_DVFS("sbus", 3, 1, KHZ, 1, 1, 1, 1, 1, 1, 334000, 334000, 334000),
^~~~~~~~~
/home/user/build/src/tf300t-katkernel-cbde2a64b1f7244ed5a85b79dfcb4e56e79dbda5/arch/arm/mach-tegra/tegra3_dvfs.c:239:17: warning: initialization discards 'const' qualifier from pointer target type [-Wdiscarded-qualifiers]
.millivolts = core_millivolts, \
^
/home/user/build/src/tf300t-katkernel-cbde2a64b1f7244ed5a85b79dfcb4e56e79dbda5/arch/arm/mach-tegra/tegra3_dvfs.c:262:2: note: in expansion of macro 'CORE_DVFS'
CORE_DVFS("vi", 0, 1, KHZ, 1, 216000, 285000, 300000, 300000, 300000, 300000, 300000, 300000),
^~~~~~~~~
/home/user/build/src/tf300t-katkernel-cbde2a64b1f7244ed5a85b79dfcb4e56e79dbda5/arch/arm/mach-tegra/tegra3_dvfs.c:239:17: warning: initialization discards 'const' qualifier from pointer target type [-Wdiscarded-qualifiers]
.millivolts = core_millivolts, \
^
/home/user/build/src/tf300t-katkernel-cbde2a64b1f7244ed5a85b79dfcb4e56e79dbda5/arch/arm/mach-tegra/tegra3_dvfs.c:263:2: note: in expansion of macro 'CORE_DVFS'
CORE_DVFS("vi", 1, 1, KHZ, 1, 216000, 267000, 300000, 371000, 409000, 409000, 409000, 409000),
^~~~~~~~~
/home/user/build/src/tf300t-katkernel-cbde2a64b1f7244ed5a85b79dfcb4e56e79dbda5/arch/arm/mach-tegra/tegra3_dvfs.c:239:17: warning: initialization discards 'const' qualifier from pointer target type [-Wdiscarded-qualifiers]
.millivolts = core_millivolts, \
^
/home/user/build/src/tf300t-katkernel-cbde2a64b1f7244ed5a85b79dfcb4e56e79dbda5/arch/arm/mach-tegra/tegra3_dvfs.c:264:2: note: in expansion of macro 'CORE_DVFS'
CORE_DVFS("vi", 2, 1, KHZ, 1, 219000, 267000, 300000, 371000, 409000, 425000, 425000, 425000),
^~~~~~~~~
/home/user/build/src/tf300t-katkernel-cbde2a64b1f7244ed5a85b79dfcb4e56e79dbda5/arch/arm/mach-tegra/tegra3_dvfs.c:239:17: warning: initialization discards 'const' qualifier from pointer target type [-Wdiscarded-qualifiers]
.millivolts = core_millivolts, \
^
/home/user/build/src/tf300t-katkernel-cbde2a64b1f7244ed5a85b79dfcb4e56e79dbda5/arch/arm/mach-tegra/tegra3_dvfs.c:265:2: note: in expansion of macro 'CORE_DVFS'
CORE_DVFS("vi", 3, 1, KHZ, 1, 1, 1, 1, 1, 1, 470000, 470000, 470000),
^~~~~~~~~
/home/user/build/src/tf300t-katkernel-cbde2a64b1f7244ed5a85b79dfcb4e56e79dbda5/arch/arm/mach-tegra/tegra3_dvfs.c:239:17: warning: initialization discards 'const' qualifier from pointer target type [-Wdiscarded-qualifiers]
.millivolts = core_millivolts, \
^
/home/user/build/src/tf300t-katkernel-cbde2a64b1f7244ed5a85b79dfcb4e56e79dbda5/arch/arm/mach-tegra/tegra3_dvfs.c:267:2: note: in expansion of macro 'CORE_DVFS'
CORE_DVFS("vde", 0, 1, KHZ, 200000, 247000, 304000, 352000, 400000, 437000, 484000, 520000, 650000),
^~~~~~~~~
/home/user/build/src/tf300t-katkernel-cbde2a64b1f7244ed5a85b79dfcb4e56e79dbda5/arch/arm/mach-tegra/tegra3_dvfs.c:239:17: warning: initialization discards 'const' qualifier from pointer target type [-Wdiscarded-qualifiers]
.millivolts = core_millivolts, \
^
/home/user/build/src/tf300t-katkernel-cbde2a64b1f7244ed5a85b79dfcb4e56e79dbda5/arch/arm/mach-tegra/tegra3_dvfs.c:268:2: note: in expansion of macro 'CORE_DVFS'
CORE_DVFS("mpe", 0, 1, KHZ, 200000, 247000, 304000, 361000, 408000, 446000, 484000, 520000, 650000),
^~~~~~~~~
/home/user/build/src/tf300t-katkernel-cbde2a64b1f7244ed5a85b79dfcb4e56e79dbda5/arch/arm/mach-tegra/tegra3_dvfs.c:239:17: warning: initialization discards 'const' qualifier from pointer target type [-Wdiscarded-qualifiers]
.millivolts = core_millivolts, \
^
/home/user/build/src/tf300t-katkernel-cbde2a64b1f7244ed5a85b79dfcb4e56e79dbda5/arch/arm/mach-tegra/tegra3_dvfs.c:269:2: note: in expansion of macro 'CORE_DVFS'
CORE_DVFS("2d", 0, 1, KHZ, 200000, 267000, 304000, 361000, 408000, 446000, 484000, 520000, 650000),
^~~~~~~~~
/home/user/build/src/tf300t-katkernel-cbde2a64b1f7244ed5a85b79dfcb4e56e79dbda5/arch/arm/mach-tegra/tegra3_dvfs.c:239:17: warning: initialization discards 'const' qualifier from pointer target type [-Wdiscarded-qualifiers]
.millivolts = core_millivolts, \
^
/home/user/build/src/tf300t-katkernel-cbde2a64b1f7244ed5a85b79dfcb4e56e79dbda5/arch/arm/mach-tegra/tegra3_dvfs.c:270:2: note: in expansion of macro 'CORE_DVFS'
CORE_DVFS("epp", 0, 1, KHZ, 200000, 267000, 304000, 361000, 408000, 446000, 484000, 520000, 650000),
^~~~~~~~~
/home/user/build/src/tf300t-katkernel-cbde2a64b1f7244ed5a85b79dfcb4e56e79dbda5/arch/arm/mach-tegra/tegra3_dvfs.c:239:17: warning: initialization discards 'const' qualifier from pointer target type [-Wdiscarded-qualifiers]
.millivolts = core_millivolts, \
^
/home/user/build/src/tf300t-katkernel-cbde2a64b1f7244ed5a85b79dfcb4e56e79dbda5/arch/arm/mach-tegra/tegra3_dvfs.c:271:2: note: in expansion of macro 'CORE_DVFS'
CORE_DVFS("3d", 0, 1, KHZ, 200000, 267000, 304000, 361000, 408000, 446000, 484000, 520000, 650000),
^~~~~~~~~
/home/user/build/src/tf300t-katkernel-cbde2a64b1f7244ed5a85b79dfcb4e56e79dbda5/arch/arm/mach-tegra/tegra3_dvfs.c:239:17: warning: initialization discards 'const' qualifier from pointer target type [-Wdiscarded-qualifiers]
.millivolts = core_millivolts, \
^
/home/user/build/src/tf300t-katkernel-cbde2a64b1f7244ed5a85b79dfcb4e56e79dbda5/arch/arm/mach-tegra/tegra3_dvfs.c:272:2: note: in expansion of macro 'CORE_DVFS'
CORE_DVFS("3d2", 0, 1, KHZ, 200000, 267000, 304000, 361000, 408000, 446000, 484000, 520000, 650000),
^~~~~~~~~
/home/user/build/src/tf300t-katkernel-cbde2a64b1f7244ed5a85b79dfcb4e56e79dbda5/arch/arm/mach-tegra/tegra3_dvfs.c:239:17: warning: initialization discards 'const' qualifier from pointer target type [-Wdiscarded-qualifiers]
.millivolts = core_millivolts, \
^
/home/user/build/src/tf300t-katkernel-cbde2a64b1f7244ed5a85b79dfcb4e56e79dbda5/arch/arm/mach-tegra/tegra3_dvfs.c:273:2: note: in expansion of macro 'CORE_DVFS'
CORE_DVFS("se", 0, 1, KHZ, 200000, 267000, 304000, 361000, 408000, 446000, 484000, 520000, 650000),
^~~~~~~~~
/home/user/build/src/tf300t-katkernel-cbde2a64b1f7244ed5a85b79dfcb4e56e79dbda5/arch/arm/mach-tegra/tegra3_dvfs.c:239:17: warning: initialization discards 'const' qualifier from pointer target type [-Wdiscarded-qualifiers]
.millivolts = core_millivolts, \
^
/home/user/build/src/tf300t-katkernel-cbde2a64b1f7244ed5a85b79dfcb4e56e79dbda5/arch/arm/mach-tegra/tegra3_dvfs.c:275:2: note: in expansion of macro 'CORE_DVFS'
CORE_DVFS("vde", 1, 1, KHZ, 200000, 247000, 304000, 352000, 400000, 437000, 484000, 520000, 650000),
^~~~~~~~~
/home/user/build/src/tf300t-katkernel-cbde2a64b1f7244ed5a85b79dfcb4e56e79dbda5/arch/arm/mach-tegra/tegra3_dvfs.c:239:17: warning: initialization discards 'const' qualifier from pointer target type [-Wdiscarded-qualifiers]
.millivolts = core_millivolts, \
^
/home/user/build/src/tf300t-katkernel-cbde2a64b1f7244ed5a85b79dfcb4e56e79dbda5/arch/arm/mach-tegra/tegra3_dvfs.c:276:2: note: in expansion of macro 'CORE_DVFS'
CORE_DVFS("mpe", 1, 1, KHZ, 200000, 247000, 304000, 361000, 408000, 446000, 484000, 520000, 650000),
^~~~~~~~~
/home/user/build/src/tf300t-katkernel-cbde2a64b1f7244ed5a85b79dfcb4e56e79dbda5/arch/arm/mach-tegra/tegra3_dvfs.c:239:17: warning: initialization discards 'const' qualifier from pointer target type [-Wdiscarded-qualifiers]
.millivolts = core_millivolts, \
^
/home/user/build/src/tf300t-katkernel-cbde2a64b1f7244ed5a85b79dfcb4e56e79dbda5/arch/arm/mach-tegra/tegra3_dvfs.c:277:2: note: in expansion of macro 'CORE_DVFS'
CORE_DVFS("2d", 1, 1, KHZ, 200000, 267000, 304000, 361000, 408000, 446000, 484000, 520000, 650000),
^~~~~~~~~
/home/user/build/src/tf300t-katkernel-cbde2a64b1f7244ed5a85b79dfcb4e56e79dbda5/arch/arm/mach-tegra/tegra3_dvfs.c:239:17: warning: initialization discards 'const' qualifier from pointer target type [-Wdiscarded-qualifiers]
.millivolts = core_millivolts, \
^
/home/user/build/src/tf300t-katkernel-cbde2a64b1f7244ed5a85b79dfcb4e56e79dbda5/arch/arm/mach-tegra/tegra3_dvfs.c:278:2: note: in expansion of macro 'CORE_DVFS'
CORE_DVFS("epp", 1, 1, KHZ, 200000, 267000, 304000, 361000, 408000, 446000, 484000, 520000, 650000),
^~~~~~~~~
/home/user/build/src/tf300t-katkernel-cbde2a64b1f7244ed5a85b79dfcb4e56e79dbda5/arch/arm/mach-tegra/tegra3_dvfs.c:239:17: warning: initialization discards 'const' qualifier from pointer target type [-Wdiscarded-qualifiers]
.millivolts = core_millivolts, \
^
/home/user/build/src/tf300t-katkernel-cbde2a64b1f7244ed5a85b79dfcb4e56e79dbda5/arch/arm/mach-tegra/tegra3_dvfs.c:279:2: note: in expansion of macro 'CORE_DVFS'
CORE_DVFS("3d", 1, 1, KHZ, 200000, 247000, 304000, 361000, 408000, 446000, 484000, 520000, 650000),
^~~~~~~~~
/home/user/build/src/tf300t-katkernel-cbde2a64b1f7244ed5a85b79dfcb4e56e79dbda5/arch/arm/mach-tegra/tegra3_dvfs.c:239:17: warning: initialization discards 'const' qualifier from pointer target type [-Wdiscarded-qualifiers]
.millivolts = core_millivolts, \
^
/home/user/build/src/tf300t-katkernel-cbde2a64b1f7244ed5a85b79dfcb4e56e79dbda5/arch/arm/mach-tegra/tegra3_dvfs.c:280:2: note: in expansion of macro 'CORE_DVFS'
CORE_DVFS("3d2", 1, 1, KHZ, 200000, 247000, 304000, 361000, 408000, 446000, 484000, 520000, 650000),
^~~~~~~~~
/home/user/build/src/tf300t-katkernel-cbde2a64b1f7244ed5a85b79dfcb4e56e79dbda5/arch/arm/mach-tegra/tegra3_dvfs.c:239:17: warning: initialization discards 'const' qualifier from pointer target type [-Wdiscarded-qualifiers]
.millivolts = core_millivolts, \
^
/home/user/build/src/tf300t-katkernel-cbde2a64b1f7244ed5a85b79dfcb4e56e79dbda5/arch/arm/mach-tegra/tegra3_dvfs.c:281:2: note: in expansion of macro 'CORE_DVFS'
CORE_DVFS("se", 1, 1, KHZ, 200000, 267000, 304000, 361000, 408000, 446000, 484000, 520000, 650000),
^~~~~~~~~
/home/user/build/src/tf300t-katkernel-cbde2a64b1f7244ed5a85b79dfcb4e56e79dbda5/arch/arm/mach-tegra/tegra3_dvfs.c:239:17: warning: initialization discards 'const' qualifier from pointer target type [-Wdiscarded-qualifiers]
.millivolts = core_millivolts, \
^
/home/user/build/src/tf300t-katkernel-cbde2a64b1f7244ed5a85b79dfcb4e56e79dbda5/arch/arm/mach-tegra/tegra3_dvfs.c:283:2: note: in expansion of macro 'CORE_DVFS'
CORE_DVFS("vde", 2, 1, KHZ, 200000, 247000, 304000, 352000, 400000, 437000, 484000, 520000, 650000),
^~~~~~~~~
/home/user/build/src/tf300t-katkernel-cbde2a64b1f7244ed5a85b79dfcb4e56e79dbda5/arch/arm/mach-tegra/tegra3_dvfs.c:239:17: warning: initialization discards 'const' qualifier from pointer target type [-Wdiscarded-qualifiers]
.millivolts = core_millivolts, \
^
/home/user/build/src/tf300t-katkernel-cbde2a64b1f7244ed5a85b79dfcb4e56e79dbda5/arch/arm/mach-tegra/tegra3_dvfs.c:284:2: note: in expansion of macro 'CORE_DVFS'
CORE_DVFS("mpe", 2, 1, KHZ, 200000, 247000, 304000, 361000, 408000, 446000, 484000, 520000, 650000),
^~~~~~~~~
/home/user/build/src/tf300t-katkernel-cbde2a64b1f7244ed5a85b79dfcb4e56e79dbda5/arch/arm/mach-tegra/tegra3_dvfs.c:239:17: warning: initialization discards 'const' qualifier from pointer target type [-Wdiscarded-qualifiers]
.millivolts = core_millivolts, \
^
/home/user/build/src/tf300t-katkernel-cbde2a64b1f7244ed5a85b79dfcb4e56e79dbda5/arch/arm/mach-tegra/tegra3_dvfs.c:285:2: note: in expansion of macro 'CORE_DVFS'
CORE_DVFS("2d", 2, 1, KHZ, 200000, 267000, 304000, 361000, 408000, 446000, 484000, 520000, 650000),
^~~~~~~~~
/home/user/build/src/tf300t-katkernel-cbde2a64b1f7244ed5a85b79dfcb4e56e79dbda5/arch/arm/mach-tegra/tegra3_dvfs.c:239:17: warning: initialization discards 'const' qualifier from pointer target type [-Wdiscarded-qualifiers]
.millivolts = core_millivolts, \
^
/home/user/build/src/tf300t-katkernel-cbde2a64b1f7244ed5a85b79dfcb4e56e79dbda5/arch/arm/mach-tegra/tegra3_dvfs.c:286:2: note: in expansion of macro 'CORE_DVFS'
CORE_DVFS("epp", 2, 1, KHZ, 200000, 267000, 304000, 361000, 408000, 446000, 484000, 520000, 650000),
^~~~~~~~~
/home/user/build/src/tf300t-katkernel-cbde2a64b1f7244ed5a85b79dfcb4e56e79dbda5/arch/arm/mach-tegra/tegra3_dvfs.c:239:17: warning: initialization discards 'const' qualifier from pointer target type [-Wdiscarded-qualifiers]
.millivolts = core_millivolts, \
^
/home/user/build/src/tf300t-katkernel-cbde2a64b1f7244ed5a85b79dfcb4e56e79dbda5/arch/arm/mach-tegra/tegra3_dvfs.c:287:2: note: in expansion of macro 'CORE_DVFS'
CORE_DVFS("3d", 2, 1, KHZ, 200000, 247000, 304000, 361000, 408000, 446000, 484000, 520000, 650000),
^~~~~~~~~
/home/user/build/src/tf300t-katkernel-cbde2a64b1f7244ed5a85b79dfcb4e56e79dbda5/arch/arm/mach-tegra/tegra3_dvfs.c:239:17: warning: initialization discards 'const' qualifier from pointer target type [-Wdiscarded-qualifiers]
.millivolts = core_millivolts, \
^
/home/user/build/src/tf300t-katkernel-cbde2a64b1f7244ed5a85b79dfcb4e56e79dbda5/arch/arm/mach-tegra/tegra3_dvfs.c:288:2: note: in expansion of macro 'CORE_DVFS'
CORE_DVFS("3d2", 2, 1, KHZ, 200000, 247000, 304000, 361000, 408000, 446000, 484000, 520000, 650000),
^~~~~~~~~
/home/user/build/src/tf300t-katkernel-cbde2a64b1f7244ed5a85b79dfcb4e56e79dbda5/arch/arm/mach-tegra/tegra3_dvfs.c:239:17: warning: initialization discards 'const' qualifier from pointer target type [-Wdiscarded-qualifiers]
.millivolts = core_millivolts, \
^
/home/user/build/src/tf300t-katkernel-cbde2a64b1f7244ed5a85b79dfcb4e56e79dbda5/arch/arm/mach-tegra/tegra3_dvfs.c:289:2: note: in expansion of macro 'CORE_DVFS'
CORE_DVFS("se", 2, 1, KHZ, 200000, 267000, 304000, 361000, 408000, 446000, 484000, 520000, 650000),
^~~~~~~~~
/home/user/build/src/tf300t-katkernel-cbde2a64b1f7244ed5a85b79dfcb4e56e79dbda5/arch/arm/mach-tegra/tegra3_dvfs.c:239:17: warning: initialization discards 'const' qualifier from pointer target type [-Wdiscarded-qualifiers]
.millivolts = core_millivolts, \
^
/home/user/build/src/tf300t-katkernel-cbde2a64b1f7244ed5a85b79dfcb4e56e79dbda5/arch/arm/mach-tegra/tegra3_dvfs.c:291:2: note: in expansion of macro 'CORE_DVFS'
CORE_DVFS("vde", 3, 1, KHZ, 1, 1, 1, 1, 1, 1, 484000, 484000, 484000),
^~~~~~~~~
/home/user/build/src/tf300t-katkernel-cbde2a64b1f7244ed5a85b79dfcb4e56e79dbda5/arch/arm/mach-tegra/tegra3_dvfs.c:239:17: warning: initialization discards 'const' qualifier from pointer target type [-Wdiscarded-qualifiers]
.millivolts = core_millivolts, \
^
/home/user/build/src/tf300t-katkernel-cbde2a64b1f7244ed5a85b79dfcb4e56e79dbda5/arch/arm/mach-tegra/tegra3_dvfs.c:292:2: note: in expansion of macro 'CORE_DVFS'
CORE_DVFS("mpe", 3, 1, KHZ, 1, 1, 1, 1, 1, 1, 484000, 484000, 484000),
^~~~~~~~~
/home/user/build/src/tf300t-katkernel-cbde2a64b1f7244ed5a85b79dfcb4e56e79dbda5/arch/arm/mach-tegra/tegra3_dvfs.c:239:17: warning: initialization discards 'const' qualifier from pointer target type [-Wdiscarded-qualifiers]
.millivolts = core_millivolts, \
^
/home/user/build/src/tf300t-katkernel-cbde2a64b1f7244ed5a85b79dfcb4e56e79dbda5/arch/arm/mach-tegra/tegra3_dvfs.c:293:2: note: in expansion of macro 'CORE_DVFS'
CORE_DVFS("2d", 3, 1, KHZ, 1, 1, 1, 1, 1, 1, 484000, 484000, 484000),
^~~~~~~~~
/home/user/build/src/tf300t-katkernel-cbde2a64b1f7244ed5a85b79dfcb4e56e79dbda5/arch/arm/mach-tegra/tegra3_dvfs.c:239:17: warning: initialization discards 'const' qualifier from pointer target type [-Wdiscarded-qualifiers]
.millivolts = core_millivolts, \
^
/home/user/build/src/tf300t-katkernel-cbde2a64b1f7244ed5a85b79dfcb4e56e79dbda5/arch/arm/mach-tegra/tegra3_dvfs.c:294:2: note: in expansion of macro 'CORE_DVFS'
CORE_DVFS("epp", 3, 1, KHZ, 1, 1, 1, 1, 1, 1, 484000, 484000, 484000),
^~~~~~~~~
/home/user/build/src/tf300t-katkernel-cbde2a64b1f7244ed5a85b79dfcb4e56e79dbda5/arch/arm/mach-tegra/tegra3_dvfs.c:239:17: warning: initialization discards 'const' qualifier from pointer target type [-Wdiscarded-qualifiers]
.millivolts = core_millivolts, \
^
/home/user/build/src/tf300t-katkernel-cbde2a64b1f7244ed5a85b79dfcb4e56e79dbda5/arch/arm/mach-tegra/tegra3_dvfs.c:295:2: note: in expansion of macro 'CORE_DVFS'
CORE_DVFS("3d", 3, 1, KHZ, 1, 1, 1, 1, 1, 1, 484000, 484000, 484000),
^~~~~~~~~
/home/user/build/src/tf300t-katkernel-cbde2a64b1f7244ed5a85b79dfcb4e56e79dbda5/arch/arm/mach-tegra/tegra3_dvfs.c:239:17: warning: initialization discards 'const' qualifier from pointer target type [-Wdiscarded-qualifiers]
.millivolts = core_millivolts, \
^
/home/user/build/src/tf300t-katkernel-cbde2a64b1f7244ed5a85b79dfcb4e56e79dbda5/arch/arm/mach-tegra/tegra3_dvfs.c:296:2: note: in expansion of macro 'CORE_DVFS'
CORE_DVFS("3d2", 3, 1, KHZ, 1, 1, 1, 1, 1, 1, 484000, 484000, 484000),
^~~~~~~~~
/home/user/build/src/tf300t-katkernel-cbde2a64b1f7244ed5a85b79dfcb4e56e79dbda5/arch/arm/mach-tegra/tegra3_dvfs.c:239:17: warning: initialization discards 'const' qualifier from pointer target type [-Wdiscarded-qualifiers]
.millivolts = core_millivolts, \
^
/home/user/build/src/tf300t-katkernel-cbde2a64b1f7244ed5a85b79dfcb4e56e79dbda5/arch/arm/mach-tegra/tegra3_dvfs.c:297:2: note: in expansion of macro 'CORE_DVFS'
CORE_DVFS("se", 3, 1, KHZ, 1, 1, 1, 1, 1, 1, 625000, 625000, 625000),
^~~~~~~~~
/home/user/build/src/tf300t-katkernel-cbde2a64b1f7244ed5a85b79dfcb4e56e79dbda5/arch/arm/mach-tegra/tegra3_dvfs.c:239:17: warning: initialization discards 'const' qualifier from pointer target type [-Wdiscarded-qualifiers]
.millivolts = core_millivolts, \
^
/home/user/build/src/tf300t-katkernel-cbde2a64b1f7244ed5a85b79dfcb4e56e79dbda5/arch/arm/mach-tegra/tegra3_dvfs.c:299:2: note: in expansion of macro 'CORE_DVFS'
CORE_DVFS("host1x", 0, 1, KHZ, 100000, 152000, 188000, 222000, 254000, 267000, 267000, 267000, 350000),
^~~~~~~~~
/home/user/build/src/tf300t-katkernel-cbde2a64b1f7244ed5a85b79dfcb4e56e79dbda5/arch/arm/mach-tegra/tegra3_dvfs.c:239:17: warning: initialization discards 'const' qualifier from pointer target type [-Wdiscarded-qualifiers]
.millivolts = core_millivolts, \
^
/home/user/build/src/tf300t-katkernel-cbde2a64b1f7244ed5a85b79dfcb4e56e79dbda5/arch/arm/mach-tegra/tegra3_dvfs.c:300:2: note: in expansion of macro 'CORE_DVFS'
CORE_DVFS("host1x", 1, 1, KHZ, 100000, 152000, 188000, 222000, 254000, 267000, 267000, 267000, 350000),
^~~~~~~~~
/home/user/build/src/tf300t-katkernel-cbde2a64b1f7244ed5a85b79dfcb4e56e79dbda5/arch/arm/mach-tegra/tegra3_dvfs.c:239:17: warning: initialization discards 'const' qualifier from pointer target type [-Wdiscarded-qualifiers]
.millivolts = core_millivolts, \
^
/home/user/build/src/tf300t-katkernel-cbde2a64b1f7244ed5a85b79dfcb4e56e79dbda5/arch/arm/mach-tegra/tegra3_dvfs.c:301:2: note: in expansion of macro 'CORE_DVFS'
CORE_DVFS("host1x", 2, 1, KHZ, 100000, 152000, 188000, 222000, 254000, 267000, 267000, 267000, 350000),
^~~~~~~~~
/home/user/build/src/tf300t-katkernel-cbde2a64b1f7244ed5a85b79dfcb4e56e79dbda5/arch/arm/mach-tegra/tegra3_dvfs.c:239:17: warning: initialization discards 'const' qualifier from pointer target type [-Wdiscarded-qualifiers]
.millivolts = core_millivolts, \
^
/home/user/build/src/tf300t-katkernel-cbde2a64b1f7244ed5a85b79dfcb4e56e79dbda5/arch/arm/mach-tegra/tegra3_dvfs.c:302:2: note: in expansion of macro 'CORE_DVFS'
CORE_DVFS("host1x", 3, 1, KHZ, 1, 1, 1, 1, 1, 1, 242000, 242000, 242000),
^~~~~~~~~
/home/user/build/src/tf300t-katkernel-cbde2a64b1f7244ed5a85b79dfcb4e56e79dbda5/arch/arm/mach-tegra/tegra3_dvfs.c:239:17: warning: initialization discards 'const' qualifier from pointer target type [-Wdiscarded-qualifiers]
.millivolts = core_millivolts, \
^
/home/user/build/src/tf300t-katkernel-cbde2a64b1f7244ed5a85b79dfcb4e56e79dbda5/arch/arm/mach-tegra/tegra3_dvfs.c:304:2: note: in expansion of macro 'CORE_DVFS'
CORE_DVFS("cbus", 0, 1, KHZ, 200000, 247000, 304000, 352000, 400000, 437000, 484000, 520000, 650000),
^~~~~~~~~
/home/user/build/src/tf300t-katkernel-cbde2a64b1f7244ed5a85b79dfcb4e56e79dbda5/arch/arm/mach-tegra/tegra3_dvfs.c:239:17: warning: initialization discards 'const' qualifier from pointer target type [-Wdiscarded-qualifiers]
.millivolts = core_millivolts, \
^
/home/user/build/src/tf300t-katkernel-cbde2a64b1f7244ed5a85b79dfcb4e56e79dbda5/arch/arm/mach-tegra/tegra3_dvfs.c:305:2: note: in expansion of macro 'CORE_DVFS'
CORE_DVFS("cbus", 1, 1, KHZ, 200000, 247000, 304000, 352000, 400000, 437000, 484000, 520000, 650000),
^~~~~~~~~
/home/user/build/src/tf300t-katkernel-cbde2a64b1f7244ed5a85b79dfcb4e56e79dbda5/arch/arm/mach-tegra/tegra3_dvfs.c:239:17: warning: initialization discards 'const' qualifier from pointer target type [-Wdiscarded-qualifiers]
.millivolts = core_millivolts, \
^
/home/user/build/src/tf300t-katkernel-cbde2a64b1f7244ed5a85b79dfcb4e56e79dbda5/arch/arm/mach-tegra/tegra3_dvfs.c:306:2: note: in expansion of macro 'CORE_DVFS'
CORE_DVFS("cbus", 2, 1, KHZ, 200000, 247000, 304000, 352000, 400000, 437000, 484000, 520000, 650000),
^~~~~~~~~
/home/user/build/src/tf300t-katkernel-cbde2a64b1f7244ed5a85b79dfcb4e56e79dbda5/arch/arm/mach-tegra/tegra3_dvfs.c:239:17: warning: initialization discards 'const' qualifier from pointer target type [-Wdiscarded-qualifiers]
.millivolts = core_millivolts, \
^
/home/user/build/src/tf300t-katkernel-cbde2a64b1f7244ed5a85b79dfcb4e56e79dbda5/arch/arm/mach-tegra/tegra3_dvfs.c:307:2: note: in expansion of macro 'CORE_DVFS'
CORE_DVFS("cbus", 3, 1, KHZ, 1, 1, 1, 1, 1, 1, 484000, 484000, 484000),
^~~~~~~~~
/home/user/build/src/tf300t-katkernel-cbde2a64b1f7244ed5a85b79dfcb4e56e79dbda5/arch/arm/mach-tegra/tegra3_dvfs.c:239:17: warning: initialization discards 'const' qualifier from pointer target type [-Wdiscarded-qualifiers]
.millivolts = core_millivolts, \
^
/home/user/build/src/tf300t-katkernel-cbde2a64b1f7244ed5a85b79dfcb4e56e79dbda5/arch/arm/mach-tegra/tegra3_dvfs.c:309:2: note: in expansion of macro 'CORE_DVFS'
CORE_DVFS("pll_c", -1, 1, KHZ, 533000, 667000, 667000, 800000, 800000, 1066000, 1066000, 1066000, 1300000),
^~~~~~~~~
/home/user/build/src/tf300t-katkernel-cbde2a64b1f7244ed5a85b79dfcb4e56e79dbda5/arch/arm/mach-tegra/tegra3_dvfs.c:239:17: warning: initialization discards 'const' qualifier from pointer target type [-Wdiscarded-qualifiers]
.millivolts = core_millivolts, \
^
/home/user/build/src/tf300t-katkernel-cbde2a64b1f7244ed5a85b79dfcb4e56e79dbda5/arch/arm/mach-tegra/tegra3_dvfs.c:317:2: note: in expansion of macro 'CORE_DVFS'
CORE_DVFS("pll_m", -1, 1, KHZ, 533000, 667000, 667000, 800000, 800000, 1066000, 1066000, 1066000, 1066000),
^~~~~~~~~
/home/user/build/src/tf300t-katkernel-cbde2a64b1f7244ed5a85b79dfcb4e56e79dbda5/arch/arm/mach-tegra/tegra3_dvfs.c:239:17: warning: initialization discards 'const' qualifier from pointer target type [-Wdiscarded-qualifiers]
.millivolts = core_millivolts, \
^
/home/user/build/src/tf300t-katkernel-cbde2a64b1f7244ed5a85b79dfcb4e56e79dbda5/arch/arm/mach-tegra/tegra3_dvfs.c:319:2: note: in expansion of macro 'CORE_DVFS'
CORE_DVFS("pll_m", 2, 1, KHZ, 533000, 900000, 900000, 900000, 900000, 1066000, 1066000, 1066000, 1066000),
^~~~~~~~~
/home/user/build/src/tf300t-katkernel-cbde2a64b1f7244ed5a85b79dfcb4e56e79dbda5/arch/arm/mach-tegra/tegra3_dvfs.c:239:17: warning: initialization discards 'const' qualifier from pointer target type [-Wdiscarded-qualifiers]
.millivolts = core_millivolts, \
^
/home/user/build/src/tf300t-katkernel-cbde2a64b1f7244ed5a85b79dfcb4e56e79dbda5/arch/arm/mach-tegra/tegra3_dvfs.c:323:2: note: in expansion of macro 'CORE_DVFS'
CORE_DVFS("mipi", 0, 1, KHZ, 1, 1, 1, 1, 1, 1, 1, 1, 1),
^~~~~~~~~
/home/user/build/src/tf300t-katkernel-cbde2a64b1f7244ed5a85b79dfcb4e56e79dbda5/arch/arm/mach-tegra/tegra3_dvfs.c:239:17: warning: initialization discards 'const' qualifier from pointer target type [-Wdiscarded-qualifiers]
.millivolts = core_millivolts, \
^
/home/user/build/src/tf300t-katkernel-cbde2a64b1f7244ed5a85b79dfcb4e56e79dbda5/arch/arm/mach-tegra/tegra3_dvfs.c:324:2: note: in expansion of macro 'CORE_DVFS'
CORE_DVFS("mipi", 1, 1, KHZ, 1, 1, 1, 1, 1, 60000, 60000, 60000, 60000),
^~~~~~~~~
/home/user/build/src/tf300t-katkernel-cbde2a64b1f7244ed5a85b79dfcb4e56e79dbda5/arch/arm/mach-tegra/tegra3_dvfs.c:239:17: warning: initialization discards 'const' qualifier from pointer target type [-Wdiscarded-qualifiers]
.millivolts = core_millivolts, \
^
/home/user/build/src/tf300t-katkernel-cbde2a64b1f7244ed5a85b79dfcb4e56e79dbda5/arch/arm/mach-tegra/tegra3_dvfs.c:325:2: note: in expansion of macro 'CORE_DVFS'
CORE_DVFS("mipi", 2, 1, KHZ, 1, 1, 1, 1, 1, 60000, 60000, 60000, 60000),
^~~~~~~~~
/home/user/build/src/tf300t-katkernel-cbde2a64b1f7244ed5a85b79dfcb4e56e79dbda5/arch/arm/mach-tegra/tegra3_dvfs.c:239:17: warning: initialization discards 'const' qualifier from pointer target type [-Wdiscarded-qualifiers]
.millivolts = core_millivolts, \
^
/home/user/build/src/tf300t-katkernel-cbde2a64b1f7244ed5a85b79dfcb4e56e79dbda5/arch/arm/mach-tegra/tegra3_dvfs.c:326:2: note: in expansion of macro 'CORE_DVFS'
CORE_DVFS("mipi", 3, 1, KHZ, 1, 1, 1, 1, 1, 1, 1, 1, 1),
^~~~~~~~~
/home/user/build/src/tf300t-katkernel-cbde2a64b1f7244ed5a85b79dfcb4e56e79dbda5/arch/arm/mach-tegra/tegra3_dvfs.c:239:17: warning: initialization discards 'const' qualifier from pointer target type [-Wdiscarded-qualifiers]
.millivolts = core_millivolts, \
^
/home/user/build/src/tf300t-katkernel-cbde2a64b1f7244ed5a85b79dfcb4e56e79dbda5/arch/arm/mach-tegra/tegra3_dvfs.c:328:2: note: in expansion of macro 'CORE_DVFS'
CORE_DVFS("fuse_burn", -1, 1, KHZ, 1, 1, 1, 1, 26000, 26000, 26000, 26000, 26000),
^~~~~~~~~
/home/user/build/src/tf300t-katkernel-cbde2a64b1f7244ed5a85b79dfcb4e56e79dbda5/arch/arm/mach-tegra/tegra3_dvfs.c:239:17: warning: initialization discards 'const' qualifier from pointer target type [-Wdiscarded-qualifiers]
.millivolts = core_millivolts, \
^
/home/user/build/src/tf300t-katkernel-cbde2a64b1f7244ed5a85b79dfcb4e56e79dbda5/arch/arm/mach-tegra/tegra3_dvfs.c:329:2: note: in expansion of macro 'CORE_DVFS'
CORE_DVFS("sdmmc1", -1, 1, KHZ, 104000, 104000, 104000, 104000, 104000, 208000, 208000, 208000, 208000),
^~~~~~~~~
/home/user/build/src/tf300t-katkernel-cbde2a64b1f7244ed5a85b79dfcb4e56e79dbda5/arch/arm/mach-tegra/tegra3_dvfs.c:239:17: warning: initialization discards 'const' qualifier from pointer target type [-Wdiscarded-qualifiers]
.millivolts = core_millivolts, \
^
/home/user/build/src/tf300t-katkernel-cbde2a64b1f7244ed5a85b79dfcb4e56e79dbda5/arch/arm/mach-tegra/tegra3_dvfs.c:330:2: note: in expansion of macro 'CORE_DVFS'
CORE_DVFS("sdmmc3", -1, 1, KHZ, 104000, 104000, 104000, 104000, 104000, 208000, 208000, 208000, 208000),
^~~~~~~~~
/home/user/build/src/tf300t-katkernel-cbde2a64b1f7244ed5a85b79dfcb4e56e79dbda5/arch/arm/mach-tegra/tegra3_dvfs.c:239:17: warning: initialization discards 'const' qualifier from pointer target type [-Wdiscarded-qualifiers]
.millivolts = core_millivolts, \
^
/home/user/build/src/tf300t-katkernel-cbde2a64b1f7244ed5a85b79dfcb4e56e79dbda5/arch/arm/mach-tegra/tegra3_dvfs.c:331:2: note: in expansion of macro 'CORE_DVFS'
CORE_DVFS("sdmmc4", -1, 1, KHZ, 51000, 102000, 102000, 102000, 102000, 102000, 102000, 102000, 102000),
^~~~~~~~~
/home/user/build/src/tf300t-katkernel-cbde2a64b1f7244ed5a85b79dfcb4e56e79dbda5/arch/arm/mach-tegra/tegra3_dvfs.c:239:17: warning: initialization discards 'const' qualifier from pointer target type [-Wdiscarded-qualifiers]
.millivolts = core_millivolts, \
^
/home/user/build/src/tf300t-katkernel-cbde2a64b1f7244ed5a85b79dfcb4e56e79dbda5/arch/arm/mach-tegra/tegra3_dvfs.c:332:2: note: in expansion of macro 'CORE_DVFS'
CORE_DVFS("ndflash", -1, 1, KHZ, 120000, 120000, 120000, 120000, 200000, 200000, 200000, 200000, 200000),
^~~~~~~~~
/home/user/build/src/tf300t-katkernel-cbde2a64b1f7244ed5a85b79dfcb4e56e79dbda5/arch/arm/mach-tegra/tegra3_dvfs.c:239:17: warning: initialization discards 'const' qualifier from pointer target type [-Wdiscarded-qualifiers]
.millivolts = core_millivolts, \
^
/home/user/build/src/tf300t-katkernel-cbde2a64b1f7244ed5a85b79dfcb4e56e79dbda5/arch/arm/mach-tegra/tegra3_dvfs.c:334:2: note: in expansion of macro 'CORE_DVFS'
CORE_DVFS("nor", 0, 1, KHZ, 1, 115000, 130000, 130000, 133000, 133000, 133000, 133000, 133000),
^~~~~~~~~
/home/user/build/src/tf300t-katkernel-cbde2a64b1f7244ed5a85b79dfcb4e56e79dbda5/arch/arm/mach-tegra/tegra3_dvfs.c:239:17: warning: initialization discards 'const' qualifier from pointer target type [-Wdiscarded-qualifiers]
.millivolts = core_millivolts, \
^
/home/user/build/src/tf300t-katkernel-cbde2a64b1f7244ed5a85b79dfcb4e56e79dbda5/arch/arm/mach-tegra/tegra3_dvfs.c:335:2: note: in expansion of macro 'CORE_DVFS'
CORE_DVFS("nor", 1, 1, KHZ, 102000, 115000, 130000, 130000, 133000, 133000, 133000, 133000, 133000),
^~~~~~~~~
/home/user/build/src/tf300t-katkernel-cbde2a64b1f7244ed5a85b79dfcb4e56e79dbda5/arch/arm/mach-tegra/tegra3_dvfs.c:239:17: warning: initialization discards 'const' qualifier from pointer target type [-Wdiscarded-qualifiers]
.millivolts = core_millivolts, \
^
/home/user/build/src/tf300t-katkernel-cbde2a64b1f7244ed5a85b79dfcb4e56e79dbda5/arch/arm/mach-tegra/tegra3_dvfs.c:336:2: note: in expansion of macro 'CORE_DVFS'
CORE_DVFS("nor", 2, 1, KHZ, 102000, 115000, 130000, 130000, 133000, 133000, 133000, 133000, 133000),
^~~~~~~~~
/home/user/build/src/tf300t-katkernel-cbde2a64b1f7244ed5a85b79dfcb4e56e79dbda5/arch/arm/mach-tegra/tegra3_dvfs.c:239:17: warning: initialization discards 'const' qualifier from pointer target type [-Wdiscarded-qualifiers]
.millivolts = core_millivolts, \
^
/home/user/build/src/tf300t-katkernel-cbde2a64b1f7244ed5a85b79dfcb4e56e79dbda5/arch/arm/mach-tegra/tegra3_dvfs.c:337:2: note: in expansion of macro 'CORE_DVFS'
CORE_DVFS("nor", 3, 1, KHZ, 1, 1, 1, 1, 1, 1, 108000, 108000, 108000),
^~~~~~~~~
/home/user/build/src/tf300t-katkernel-cbde2a64b1f7244ed5a85b79dfcb4e56e79dbda5/arch/arm/mach-tegra/tegra3_dvfs.c:239:17: warning: initialization discards 'const' qualifier from pointer target type [-Wdiscarded-qualifiers]
.millivolts = core_millivolts, \
^
/home/user/build/src/tf300t-katkernel-cbde2a64b1f7244ed5a85b79dfcb4e56e79dbda5/arch/arm/mach-tegra/tegra3_dvfs.c:339:2: note: in expansion of macro 'CORE_DVFS'
CORE_DVFS("sbc1", -1, 1, KHZ, 36000, 52000, 60000, 60000, 60000, 100000, 100000, 100000, 100000),
^~~~~~~~~
/home/user/build/src/tf300t-katkernel-cbde2a64b1f7244ed5a85b79dfcb4e56e79dbda5/arch/arm/mach-tegra/tegra3_dvfs.c:239:17: warning: initialization discards 'const' qualifier from pointer target type [-Wdiscarded-qualifiers]
.millivolts = core_millivolts, \
^
/home/user/build/src/tf300t-katkernel-cbde2a64b1f7244ed5a85b79dfcb4e56e79dbda5/arch/arm/mach-tegra/tegra3_dvfs.c:340:2: note: in expansion of macro 'CORE_DVFS'
CORE_DVFS("sbc2", -1, 1, KHZ, 36000, 52000, 60000, 60000, 60000, 100000, 100000, 100000, 100000),
^~~~~~~~~
/home/user/build/src/tf300t-katkernel-cbde2a64b1f7244ed5a85b79dfcb4e56e79dbda5/arch/arm/mach-tegra/tegra3_dvfs.c:239:17: warning: initialization discards 'const' qualifier from pointer target type [-Wdiscarded-qualifiers]
.millivolts = core_millivolts, \
^
/home/user/build/src/tf300t-katkernel-cbde2a64b1f7244ed5a85b79dfcb4e56e79dbda5/arch/arm/mach-tegra/tegra3_dvfs.c:341:2: note: in expansion of macro 'CORE_DVFS'
CORE_DVFS("sbc3", -1, 1, KHZ, 36000, 52000, 60000, 60000, 60000, 100000, 100000, 100000, 100000),
^~~~~~~~~
/home/user/build/src/tf300t-katkernel-cbde2a64b1f7244ed5a85b79dfcb4e56e79dbda5/arch/arm/mach-tegra/tegra3_dvfs.c:239:17: warning: initialization discards 'const' qualifier from pointer target type [-Wdiscarded-qualifiers]
.millivolts = core_millivolts, \
^
/home/user/build/src/tf300t-katkernel-cbde2a64b1f7244ed5a85b79dfcb4e56e79dbda5/arch/arm/mach-tegra/tegra3_dvfs.c:342:2: note: in expansion of macro 'CORE_DVFS'
CORE_DVFS("sbc4", -1, 1, KHZ, 36000, 52000, 60000, 60000, 60000, 100000, 100000, 100000, 100000),
^~~~~~~~~
/home/user/build/src/tf300t-katkernel-cbde2a64b1f7244ed5a85b79dfcb4e56e79dbda5/arch/arm/mach-tegra/tegra3_dvfs.c:239:17: warning: initialization discards 'const' qualifier from pointer target type [-Wdiscarded-qualifiers]
.millivolts = core_millivolts, \
^
/home/user/build/src/tf300t-katkernel-cbde2a64b1f7244ed5a85b79dfcb4e56e79dbda5/arch/arm/mach-tegra/tegra3_dvfs.c:343:2: note: in expansion of macro 'CORE_DVFS'
CORE_DVFS("sbc5", -1, 1, KHZ, 36000, 52000, 60000, 60000, 60000, 100000, 100000, 100000, 100000),
^~~~~~~~~
/home/user/build/src/tf300t-katkernel-cbde2a64b1f7244ed5a85b79dfcb4e56e79dbda5/arch/arm/mach-tegra/tegra3_dvfs.c:239:17: warning: initialization discards 'const' qualifier from pointer target type [-Wdiscarded-qualifiers]
.millivolts = core_millivolts, \
^
/home/user/build/src/tf300t-katkernel-cbde2a64b1f7244ed5a85b79dfcb4e56e79dbda5/arch/arm/mach-tegra/tegra3_dvfs.c:344:2: note: in expansion of macro 'CORE_DVFS'
CORE_DVFS("sbc6", -1, 1, KHZ, 36000, 52000, 60000, 60000, 60000, 100000, 100000, 100000, 100000),
^~~~~~~~~
/home/user/build/src/tf300t-katkernel-cbde2a64b1f7244ed5a85b79dfcb4e56e79dbda5/arch/arm/mach-tegra/tegra3_dvfs.c:239:17: warning: initialization discards 'const' qualifier from pointer target type [-Wdiscarded-qualifiers]
.millivolts = core_millivolts, \
^
/home/user/build/src/tf300t-katkernel-cbde2a64b1f7244ed5a85b79dfcb4e56e79dbda5/arch/arm/mach-tegra/tegra3_dvfs.c:346:2: note: in expansion of macro 'CORE_DVFS'
CORE_DVFS("sata", -1, 1, KHZ, 1, 216000, 216000, 216000, 216000, 216000, 216000, 216000, 216000),
^~~~~~~~~
/home/user/build/src/tf300t-katkernel-cbde2a64b1f7244ed5a85b79dfcb4e56e79dbda5/arch/arm/mach-tegra/tegra3_dvfs.c:239:17: warning: initialization discards 'const' qualifier from pointer target type [-Wdiscarded-qualifiers]
.millivolts = core_millivolts, \
^
/home/user/build/src/tf300t-katkernel-cbde2a64b1f7244ed5a85b79dfcb4e56e79dbda5/arch/arm/mach-tegra/tegra3_dvfs.c:347:2: note: in expansion of macro 'CORE_DVFS'
CORE_DVFS("sata_oob", -1, 1, KHZ, 1, 216000, 216000, 216000, 216000, 216000, 216000, 216000, 216000),
^~~~~~~~~
/home/user/build/src/tf300t-katkernel-cbde2a64b1f7244ed5a85b79dfcb4e56e79dbda5/arch/arm/mach-tegra/tegra3_dvfs.c:239:17: warning: initialization discards 'const' qualifier from pointer target type [-Wdiscarded-qualifiers]
.millivolts = core_millivolts, \
^
/home/user/build/src/tf300t-katkernel-cbde2a64b1f7244ed5a85b79dfcb4e56e79dbda5/arch/arm/mach-tegra/tegra3_dvfs.c:349:2: note: in expansion of macro 'CORE_DVFS'
CORE_DVFS("tvo", -1, 1, KHZ, 1, 1, 297000, 297000, 297000, 297000, 297000, 297000, 297000),
^~~~~~~~~
/home/user/build/src/tf300t-katkernel-cbde2a64b1f7244ed5a85b79dfcb4e56e79dbda5/arch/arm/mach-tegra/tegra3_dvfs.c:239:17: warning: initialization discards 'const' qualifier from pointer target type [-Wdiscarded-qualifiers]
.millivolts = core_millivolts, \
^
/home/user/build/src/tf300t-katkernel-cbde2a64b1f7244ed5a85b79dfcb4e56e79dbda5/arch/arm/mach-tegra/tegra3_dvfs.c:350:2: note: in expansion of macro 'CORE_DVFS'
CORE_DVFS("cve", -1, 1, KHZ, 1, 1, 297000, 297000, 297000, 297000, 297000, 297000, 297000),
^~~~~~~~~
/home/user/build/src/tf300t-katkernel-cbde2a64b1f7244ed5a85b79dfcb4e56e79dbda5/arch/arm/mach-tegra/tegra3_dvfs.c:239:17: warning: initialization discards 'const' qualifier from pointer target type [-Wdiscarded-qualifiers]
.millivolts = core_millivolts, \
^
/home/user/build/src/tf300t-katkernel-cbde2a64b1f7244ed5a85b79dfcb4e56e79dbda5/arch/arm/mach-tegra/tegra3_dvfs.c:351:2: note: in expansion of macro 'CORE_DVFS'
CORE_DVFS("dsia", -1, 1, KHZ, 432500, 432500, 432500, 432500, 432500, 432500, 432500, 432500, 432500),
^~~~~~~~~
/home/user/build/src/tf300t-katkernel-cbde2a64b1f7244ed5a85b79dfcb4e56e79dbda5/arch/arm/mach-tegra/tegra3_dvfs.c:239:17: warning: initialization discards 'const' qualifier from pointer target type [-Wdiscarded-qualifiers]
.millivolts = core_millivolts, \
^
/home/user/build/src/tf300t-katkernel-cbde2a64b1f7244ed5a85b79dfcb4e56e79dbda5/arch/arm/mach-tegra/tegra3_dvfs.c:352:2: note: in expansion of macro 'CORE_DVFS'
CORE_DVFS("dsib", -1, 1, KHZ, 432500, 432500, 432500, 432500, 432500, 432500, 432500, 432500, 432500),
^~~~~~~~~
/home/user/build/src/tf300t-katkernel-cbde2a64b1f7244ed5a85b79dfcb4e56e79dbda5/arch/arm/mach-tegra/tegra3_dvfs.c:239:17: warning: initialization discards 'const' qualifier from pointer target type [-Wdiscarded-qualifiers]
.millivolts = core_millivolts, \
^
/home/user/build/src/tf300t-katkernel-cbde2a64b1f7244ed5a85b79dfcb4e56e79dbda5/arch/arm/mach-tegra/tegra3_dvfs.c:360:2: note: in expansion of macro 'CORE_DVFS'
CORE_DVFS("disp1", 0, 0, KHZ, 1, 120000, 120000, 120000, 120000, 190000, 190000, 190000, 190000),
^~~~~~~~~
/home/user/build/src/tf300t-katkernel-cbde2a64b1f7244ed5a85b79dfcb4e56e79dbda5/arch/arm/mach-tegra/tegra3_dvfs.c:239:17: warning: initialization discards 'const' qualifier from pointer target type [-Wdiscarded-qualifiers]
.millivolts = core_millivolts, \
^
/home/user/build/src/tf300t-katkernel-cbde2a64b1f7244ed5a85b79dfcb4e56e79dbda5/arch/arm/mach-tegra/tegra3_dvfs.c:361:2: note: in expansion of macro 'CORE_DVFS'
CORE_DVFS("disp1", 1, 0, KHZ, 155000, 155000, 268000, 268000, 268000, 268000, 268000, 268000, 268000),
^~~~~~~~~
/home/user/build/src/tf300t-katkernel-cbde2a64b1f7244ed5a85b79dfcb4e56e79dbda5/arch/arm/mach-tegra/tegra3_dvfs.c:239:17: warning: initialization discards 'const' qualifier from pointer target type [-Wdiscarded-qualifiers]
.millivolts = core_millivolts, \
^
/home/user/build/src/tf300t-katkernel-cbde2a64b1f7244ed5a85b79dfcb4e56e79dbda5/arch/arm/mach-tegra/tegra3_dvfs.c:362:2: note: in expansion of macro 'CORE_DVFS'
CORE_DVFS("disp1", 2, 0, KHZ, 155000, 155000, 268000, 268000, 268000, 268000, 268000, 268000, 268000),
^~~~~~~~~
/home/user/build/src/tf300t-katkernel-cbde2a64b1f7244ed5a85b79dfcb4e56e79dbda5/arch/arm/mach-tegra/tegra3_dvfs.c:239:17: warning: initialization discards 'const' qualifier from pointer target type [-Wdiscarded-qualifiers]
.millivolts = core_millivolts, \
^
/home/user/build/src/tf300t-katkernel-cbde2a64b1f7244ed5a85b79dfcb4e56e79dbda5/arch/arm/mach-tegra/tegra3_dvfs.c:363:2: note: in expansion of macro 'CORE_DVFS'
CORE_DVFS("disp1", 3, 0, KHZ, 1, 120000, 120000, 120000, 120000, 190000, 190000, 190000, 190000),
^~~~~~~~~
/home/user/build/src/tf300t-katkernel-cbde2a64b1f7244ed5a85b79dfcb4e56e79dbda5/arch/arm/mach-tegra/tegra3_dvfs.c:239:17: warning: initialization discards 'const' qualifier from pointer target type [-Wdiscarded-qualifiers]
.millivolts = core_millivolts, \
^
/home/user/build/src/tf300t-katkernel-cbde2a64b1f7244ed5a85b79dfcb4e56e79dbda5/arch/arm/mach-tegra/tegra3_dvfs.c:365:2: note: in expansion of macro 'CORE_DVFS'
CORE_DVFS("disp2", 0, 0, KHZ, 1, 120000, 120000, 120000, 120000, 190000, 190000, 190000, 190000),
^~~~~~~~~
/home/user/build/src/tf300t-katkernel-cbde2a64b1f7244ed5a85b79dfcb4e56e79dbda5/arch/arm/mach-tegra/tegra3_dvfs.c:239:17: warning: initialization discards 'const' qualifier from pointer target type [-Wdiscarded-qualifiers]
.millivolts = core_millivolts, \
^
/home/user/build/src/tf300t-katkernel-cbde2a64b1f7244ed5a85b79dfcb4e56e79dbda5/arch/arm/mach-tegra/tegra3_dvfs.c:366:2: note: in expansion of macro 'CORE_DVFS'
CORE_DVFS("disp2", 1, 0, KHZ, 155000, 155000, 268000, 268000, 268000, 268000, 268000, 268000, 268000),
^~~~~~~~~
/home/user/build/src/tf300t-katkernel-cbde2a64b1f7244ed5a85b79dfcb4e56e79dbda5/arch/arm/mach-tegra/tegra3_dvfs.c:239:17: warning: initialization discards 'const' qualifier from pointer target type [-Wdiscarded-qualifiers]
.millivolts = core_millivolts, \
^
/home/user/build/src/tf300t-katkernel-cbde2a64b1f7244ed5a85b79dfcb4e56e79dbda5/arch/arm/mach-tegra/tegra3_dvfs.c:367:2: note: in expansion of macro 'CORE_DVFS'
CORE_DVFS("disp2", 2, 0, KHZ, 155000, 155000, 268000, 268000, 268000, 268000, 268000, 268000, 268000),
^~~~~~~~~
/home/user/build/src/tf300t-katkernel-cbde2a64b1f7244ed5a85b79dfcb4e56e79dbda5/arch/arm/mach-tegra/tegra3_dvfs.c:239:17: warning: initialization discards 'const' qualifier from pointer target type [-Wdiscarded-qualifiers]
.millivolts = core_millivolts, \
^
/home/user/build/src/tf300t-katkernel-cbde2a64b1f7244ed5a85b79dfcb4e56e79dbda5/arch/arm/mach-tegra/tegra3_dvfs.c:368:2: note: in expansion of macro 'CORE_DVFS'
CORE_DVFS("disp2", 3, 0, KHZ, 1, 120000, 120000, 120000, 120000, 190000, 190000, 190000, 190000),
^~~~~~~~~
/home/user/build/src/tf300t-katkernel-cbde2a64b1f7244ed5a85b79dfcb4e56e79dbda5/arch/arm/mach-tegra/tegra3_dvfs.c:239:17: warning: initialization discards 'const' qualifier from pointer target type [-Wdiscarded-qualifiers]
.millivolts = core_millivolts, \
^
/home/user/build/src/tf300t-katkernel-cbde2a64b1f7244ed5a85b79dfcb4e56e79dbda5/arch/arm/mach-tegra/tegra3_dvfs.c:370:2: note: in expansion of macro 'CORE_DVFS'
CORE_DVFS("pwm", -1, 1, KHZ, 204000, 408000, 408000, 408000, 408000, 408000, 408000, 408000, 408000),
^~~~~~~~~
/home/user/build/src/tf300t-katkernel-cbde2a64b1f7244ed5a85b79dfcb4e56e79dbda5/arch/arm/mach-tegra/tegra3_dvfs.c: In function 'init_target_info_sysfs':
/home/user/build/src/tf300t-katkernel-cbde2a64b1f7244ed5a85b79dfcb4e56e79dbda5/arch/arm/mach-tegra/tegra3_dvfs.c:1164:2: warning: ISO C90 forbids mixed declarations and code [-Wdeclaration-after-statement]
char info[1024];
^~~~
CC arch/arm/mach-tegra/latency_allowance.o
CC kernel/rcupdate.o
CC arch/arm/mach-tegra/edp.o
CC arch/arm/mach-tegra/tegra3_speedo.o
CC kernel/extable.o
CC arch/arm/mach-tegra/tegra3_actmon.o
CC kernel/params.o
CC arch/arm/mach-tegra/tegra3_emc.o
CC kernel/posix-timers.o
CC kernel/kthread.o
CC arch/arm/mach-tegra/wakeups-t3.o
CC arch/arm/mach-tegra/wakeups.o
CC kernel/wait.o
CC kernel/kfifo.o
CC arch/arm/mach-tegra/pm-t3.o
CC arch/arm/mach-tegra/pinmux-t3-tables.o
CC kernel/sys_ni.o
CC kernel/posix-cpu-timers.o
CC kernel/mutex.o
CC arch/arm/mach-tegra/localtimer.o
CC kernel/hrtimer.o
CC arch/arm/mach-tegra/platsmp.o
CC kernel/rwsem.o
CC kernel/nsproxy.o
CC arch/arm/mach-tegra/hotplug.o
CC kernel/srcu.o
AS arch/arm/mach-tegra/headsmp.o
CC arch/arm/mach-tegra/reset.o
CC arch/arm/mach-tegra/dma.o
CC kernel/semaphore.o
CC kernel/notifier.o
CC arch/arm/mach-tegra/cpu-tegra.o
CC arch/arm/mach-tegra/cpu-tegra3.o
CC kernel/ksysfs.o
CC kernel/pm_qos_params.o
/home/user/build/src/tf300t-katkernel-cbde2a64b1f7244ed5a85b79dfcb4e56e79dbda5/arch/arm/mach-tegra/cpu-tegra.c: In function 'Asus_camera_enable_set_emc_rate':
/home/user/build/src/tf300t-katkernel-cbde2a64b1f7244ed5a85b79dfcb4e56e79dbda5/arch/arm/mach-tegra/cpu-tegra.c:112:51: warning: format '%d' expects argument of type 'int', but argument 3 has type 'long unsigned int' [-Wformat=]
printk("%s : camera enable emc_clk->min_rate to %d\n",
^
/home/user/build/src/tf300t-katkernel-cbde2a64b1f7244ed5a85b79dfcb4e56e79dbda5/arch/arm/mach-tegra/cpu-tegra.c: In function 'Asus_camera_disable_set_emc_rate':
/home/user/build/src/tf300t-katkernel-cbde2a64b1f7244ed5a85b79dfcb4e56e79dbda5/arch/arm/mach-tegra/cpu-tegra.c:154:52: warning: format '%d' expects argument of type 'int', but argument 3 has type 'long unsigned int' [-Wformat=]
printk("%s : camera disable emc_clk->min_rate to %d\n", __func__, camera_enable_cpu_emc_mini_rate);
^
/home/user/build/src/tf300t-katkernel-cbde2a64b1f7244ed5a85b79dfcb4e56e79dbda5/arch/arm/mach-tegra/cpu-tegra.c:155:46: warning: format '%d' expects argument of type 'int', but argument 3 has type 'long unsigned int' [-Wformat=]
printk("%s : camera disable c->min_rate to %d\n", __func__, camera_enable_emc_mini_rate);
^
/home/user/build/src/tf300t-katkernel-cbde2a64b1f7244ed5a85b79dfcb4e56e79dbda5/arch/arm/mach-tegra/cpu-tegra.c: In function 'tegra_target':
/home/user/build/src/tf300t-katkernel-cbde2a64b1f7244ed5a85b79dfcb4e56e79dbda5/arch/arm/mach-tegra/cpu-tegra.c:852:6: warning: unused variable 'cpu' [-Wunused-variable]
int cpu = 0;
^~~
/home/user/build/src/tf300t-katkernel-cbde2a64b1f7244ed5a85b79dfcb4e56e79dbda5/arch/arm/mach-tegra/cpu-tegra.c: At top level:
/home/user/build/src/tf300t-katkernel-cbde2a64b1f7244ed5a85b79dfcb4e56e79dbda5/arch/arm/mach-tegra/cpu-tegra.c:877:12: warning: function declaration isn't a prototype [-Wstrict-prototypes]
static int tegra_cpu_get_oc_default()
^~~~~~~~~~~~~~~~~~~~~~~~
/home/user/build/src/tf300t-katkernel-cbde2a64b1f7244ed5a85b79dfcb4e56e79dbda5/arch/arm/mach-tegra/cpu-tegra.c: In function 'tegra_cpufreq_init':
/home/user/build/src/tf300t-katkernel-cbde2a64b1f7244ed5a85b79dfcb4e56e79dbda5/arch/arm/mach-tegra/cpu-tegra.c:1043:6: warning: unused variable 'i' [-Wunused-variable]
int i = 0;
^
CC arch/arm/mach-tegra/pcie.o
CC arch/arm/mach-tegra/cpuidle.o
CC kernel/sched_clock.o
CC kernel/cred.o
CC kernel/async.o
CC arch/arm/mach-tegra/cpuidle-t3.o
CC arch/arm/mach-tegra/tegra3_throttle.o
CC kernel/range.o
CC kernel/groups.o
CC kernel/freezer.o
CC arch/arm/mach-tegra/tegra3_thermal.o
CC arch/arm/mach-tegra/iovmm.o
CC kernel/profile.o
CC arch/arm/mach-tegra/iovmm-smmu.o
CC kernel/stacktrace.o
CC arch/arm/mach-tegra/sysfs-cluster.o
CC kernel/events/core.o
CC kernel/irq/irqdesc.o
CC kernel/irq/handle.o
CC arch/arm/mach-tegra/tegra3_tsensor.o
CC kernel/irq/manage.o
CC kernel/irq/spurious.o
CC arch/arm/mach-tegra/powerdetect.o
CC kernel/events/ring_buffer.o
CC kernel/irq/resend.o
CC kernel/irq/chip.o
CC arch/arm/mach-tegra/board-cardhu.o
CC kernel/irq/dummychip.o
CC kernel/events/hw_breakpoint.o
CC kernel/irq/devres.o
CC kernel/irq/autoprobe.o
CC kernel/power/main.o
LD kernel/events/built-in.o
/home/user/build/src/tf300t-katkernel-cbde2a64b1f7244ed5a85b79dfcb4e56e79dbda5/arch/arm/mach-tegra/board-cardhu.c: In function 'tegra_usb3_utmip_host_register':
/home/user/build/src/tf300t-katkernel-cbde2a64b1f7244ed5a85b79dfcb4e56e79dbda5/arch/arm/mach-tegra/board-cardhu.c:1609:8: warning: unused variable 'platform_data' [-Wunused-variable]
void *platform_data;
^~~~~~~~~~~~~
/home/user/build/src/tf300t-katkernel-cbde2a64b1f7244ed5a85b79dfcb4e56e79dbda5/arch/arm/mach-tegra/board-cardhu.c: In function 'cardhu_audio_init':
/home/user/build/src/tf300t-katkernel-cbde2a64b1f7244ed5a85b79dfcb4e56e79dbda5/arch/arm/mach-tegra/board-cardhu.c:1711:20: warning: unused variable 'board_info' [-Wunused-variable]
struct board_info board_info;
^~~~~~~~~~
At top level:
/home/user/build/src/tf300t-katkernel-cbde2a64b1f7244ed5a85b79dfcb4e56e79dbda5/arch/arm/mach-tegra/board-cardhu.c:1128:47: warning: 'spi_clk_init_table' defined but not used [-Wunused-variable]
static __initdata struct tegra_clk_init_table spi_clk_init_table[] = {
^~~~~~~~~~~~~~~~~~
/home/user/build/src/tf300t-katkernel-cbde2a64b1f7244ed5a85b79dfcb4e56e79dbda5/arch/arm/mach-tegra/board-cardhu.c:952:31: warning: 'cardhu_audio_aic326x_device' defined but not used [-Wunused-variable]
static struct platform_device cardhu_audio_aic326x_device = {
^~~~~~~~~~~~~~~~~~~~~~~~~~~
/home/user/build/src/tf300t-katkernel-cbde2a64b1f7244ed5a85b79dfcb4e56e79dbda5/arch/arm/mach-tegra/board-cardhu.c:923:31: warning: 'cardhu_audio_max98095_device' defined but not used [-Wunused-variable]
static struct platform_device cardhu_audio_max98095_device = {
^~~~~~~~~~~~~~~~~~~~~~~~~~~~
/home/user/build/src/tf300t-katkernel-cbde2a64b1f7244ed5a85b79dfcb4e56e79dbda5/arch/arm/mach-tegra/board-cardhu.c:915:31: warning: 'cardhu_audio_wm8903_device' defined but not used [-Wunused-variable]
static struct platform_device cardhu_audio_wm8903_device = {
^~~~~~~~~~~~~~~~~~~~~~~~~~
/home/user/build/src/tf300t-katkernel-cbde2a64b1f7244ed5a85b79dfcb4e56e79dbda5/arch/arm/mach-tegra/board-cardhu.c:524:41: warning: 'cardhu_codec_max98095_info' defined but not used [-Wunused-variable]
static struct i2c_board_info __initdata cardhu_codec_max98095_info = {
^~~~~~~~~~~~~~~~~~~~~~~~~~
/home/user/build/src/tf300t-katkernel-cbde2a64b1f7244ed5a85b79dfcb4e56e79dbda5/arch/arm/mach-tegra/board-cardhu.c:519:41: warning: 'cardhu_codec_aic326x_info' defined but not used [-Wunused-variable]
static struct i2c_board_info __initdata cardhu_codec_aic326x_info = {
^~~~~~~~~~~~~~~~~~~~~~~~~
/home/user/build/src/tf300t-katkernel-cbde2a64b1f7244ed5a85b79dfcb4e56e79dbda5/arch/arm/mach-tegra/board-cardhu.c:513:41: warning: 'cardhu_codec_wm8903_info' defined but not used [-Wunused-variable]
static struct i2c_board_info __initdata cardhu_codec_wm8903_info = {
^~~~~~~~~~~~~~~~~~~~~~~~
CC kernel/power/console.o
CC arch/arm/mach-tegra/board-cardhu-kbc.o
CC kernel/irq/proc.o
CC kernel/power/process.o
CC kernel/irq/pm.o
CC arch/arm/mach-tegra/board-cardhu-irda.o
CC kernel/power/suspend.o
LD kernel/irq/built-in.o
CC kernel/time/timekeeping.o
CC kernel/power/wakelock.o
CC arch/arm/mach-tegra/board-cardhu-panel.o
CC kernel/power/userwakelock.o
CC kernel/time/ntp.o
CC kernel/power/earlysuspend.o
/home/user/build/src/tf300t-katkernel-cbde2a64b1f7244ed5a85b79dfcb4e56e79dbda5/arch/arm/mach-tegra/board-cardhu-panel.c:975:29: warning: 'cardhu_hdmi_fb_data_800_1280' defined but not used [-Wunused-variable]
static struct tegra_fb_data cardhu_hdmi_fb_data_800_1280 = {
^~~~~~~~~~~~~~~~~~~~~~~~~~~~
CC arch/arm/mach-tegra/board-cardhu-pinmux.o
CC kernel/time/clocksource.o
CC kernel/power/fbearlysuspend.o
CC kernel/time/jiffies.o
/home/user/build/src/tf300t-katkernel-cbde2a64b1f7244ed5a85b79dfcb4e56e79dbda5/arch/arm/mach-tegra/board-cardhu-pinmux.c:1022:34: warning: 'cardhu_unused_gpio_pins_e1506' defined but not used [-Wunused-variable]
static struct gpio_init_pin_info cardhu_unused_gpio_pins_e1506[] = {
^~~~~~~~~~~~~~~~~~~~~~~~~~~~~
/home/user/build/src/tf300t-katkernel-cbde2a64b1f7244ed5a85b79dfcb4e56e79dbda5/arch/arm/mach-tegra/board-cardhu-pinmux.c: In function 'cardhu_pinmux_init':
/home/user/build/src/tf300t-katkernel-cbde2a64b1f7244ed5a85b79dfcb4e56e79dbda5/arch/arm/mach-tegra/board-cardhu-pinmux.c:811:29: warning: 'pins_info' may be used uninitialized in this function [-Wmaybe-uninitialized]
struct gpio_init_pin_info *pins_info;
^~~~~~~~~
/home/user/build/src/tf300t-katkernel-cbde2a64b1f7244ed5a85b79dfcb4e56e79dbda5/arch/arm/mach-tegra/board-cardhu-pinmux.c:809:6: warning: 'len' may be used uninitialized in this function [-Wmaybe-uninitialized]
int len;
^~~
CC kernel/power/suspend_time.o
CC arch/arm/mach-tegra/board-cardhu-power.o
CC kernel/power/poweroff.o
CC kernel/time/timer_list.o
CC kernel/power/wakeup_reason.o
CC kernel/time/timecompare.o
CC kernel/time/timeconv.o
CC kernel/time/posix-clock.o
/home/user/build/src/tf300t-katkernel-cbde2a64b1f7244ed5a85b79dfcb4e56e79dbda5/arch/arm/mach-tegra/board-cardhu-power.c:719:32: warning: 'fixed_reg_en_vddio_vid_oc_pm269_dev' defined but not used [-Wunused-variable]
static struct platform_device fixed_reg_##_var##_dev = { \
^
/home/user/build/src/tf300t-katkernel-cbde2a64b1f7244ed5a85b79dfcb4e56e79dbda5/arch/arm/mach-tegra/board-cardhu-power.c:779:1: note: in expansion of macro 'FIXED_REG_OD'
FIXED_REG_OD(17, en_vddio_vid_oc_pm269, en_vddio_vid_oc, FIXED_SUPPLY(dis_5v_switch), 0, 0, TEGRA_GPIO_PP2, true, 0, 5000, true);
^~~~~~~~~~~~
/home/user/build/src/tf300t-katkernel-cbde2a64b1f7244ed5a85b79dfcb4e56e79dbda5/arch/arm/mach-tegra/board-cardhu-power.c:626:41: warning: 'fixed_reg_cam2_ldo_en_supply' defined but not used [-Wunused-variable]
static struct regulator_consumer_supply fixed_reg_cam2_ldo_en_supply[] = {
^~~~~~~~~~~~~~~~~~~~~~~~~~~~
LD kernel/power/built-in.o
CC arch/arm/mach-tegra/board-cardhu-pm298-power-rails.o
CC kernel/trace/trace_clock.o
CC kernel/time/clockevents.o
CC kernel/time/tick-common.o
CC kernel/time/tick-broadcast.o
CC kernel/trace/ring_buffer.o
CC arch/arm/mach-tegra/board-cardhu-pm299-power-rails.o
CC kernel/time/tick-oneshot.o
CC kernel/time/tick-sched.o
CC kernel/trace/trace.o
CC arch/arm/mach-tegra/board-cardhu-sdhci.o
CC kernel/futex.o
CC kernel/time/timer_stats.o
LD kernel/time/built-in.o
CC arch/arm/mach-tegra/board-cardhu-sensors.o
CC arch/arm/mach-tegra/board-cardhu-memory.o
CC kernel/trace/trace_output.o
CC kernel/rtmutex.o
CC kernel/smp.o
CC kernel/trace/trace_stat.o
CC kernel/spinlock.o
CC kernel/trace/trace_printk.o
CC kernel/uid16.o
/home/user/build/src/tf300t-katkernel-cbde2a64b1f7244ed5a85b79dfcb4e56e79dbda5/arch/arm/mach-tegra/board-cardhu-sensors.c: In function 'kxtj9_init':
/home/user/build/src/tf300t-katkernel-cbde2a64b1f7244ed5a85b79dfcb4e56e79dbda5/arch/arm/mach-tegra/board-cardhu-sensors.c:1696:2: warning: ISO C90 forbids mixed declarations and code [-Wdeclaration-after-statement]
int ret = 0;
^~~
/home/user/build/src/tf300t-katkernel-cbde2a64b1f7244ed5a85b79dfcb4e56e79dbda5/arch/arm/mach-tegra/board-cardhu-sensors.c: In function 'cardhu_sensors_init':
/home/user/build/src/tf300t-katkernel-cbde2a64b1f7244ed5a85b79dfcb4e56e79dbda5/arch/arm/mach-tegra/board-cardhu-sensors.c:1734:29: error: 'cardhu_i2c3_board_info' undeclared (first use in this function)
i2c_register_board_info(2, cardhu_i2c3_board_info,
^~~~~~~~~~~~~~~~~~~~~~
/home/user/build/src/tf300t-katkernel-cbde2a64b1f7244ed5a85b79dfcb4e56e79dbda5/arch/arm/mach-tegra/board-cardhu-sensors.c:1734:29: note: each undeclared identifier is reported only once for each function it appears in
In file included from /home/user/build/src/tf300t-katkernel-cbde2a64b1f7244ed5a85b79dfcb4e56e79dbda5/include/linux/cache.h:4:0,
from /home/user/build/src/tf300t-katkernel-cbde2a64b1f7244ed5a85b79dfcb4e56e79dbda5/include/linux/time.h:7,
from /home/user/build/src/tf300t-katkernel-cbde2a64b1f7244ed5a85b79dfcb4e56e79dbda5/include/linux/stat.h:60,
from /home/user/build/src/tf300t-katkernel-cbde2a64b1f7244ed5a85b79dfcb4e56e79dbda5/include/linux/module.h:10,
from /home/user/build/src/tf300t-katkernel-cbde2a64b1f7244ed5a85b79dfcb4e56e79dbda5/include/linux/i2c.h:31,
from /home/user/build/src/tf300t-katkernel-cbde2a64b1f7244ed5a85b79dfcb4e56e79dbda5/arch/arm/mach-tegra/board-cardhu-sensors.c:34:
/home/user/build/src/tf300t-katkernel-cbde2a64b1f7244ed5a85b79dfcb4e56e79dbda5/include/linux/kernel.h:672:45: error: bit-field '<anonymous>' width not an integer constant
#define BUILD_BUG_ON_ZERO(e) (sizeof(struct { int:-!!(e); }))
^
/home/user/build/src/tf300t-katkernel-cbde2a64b1f7244ed5a85b79dfcb4e56e79dbda5/include/linux/compiler-gcc.h:64:28: note: in expansion of macro 'BUILD_BUG_ON_ZERO'
#define __must_be_array(a) BUILD_BUG_ON_ZERO(__same_type((a), &(a)[0]))
^~~~~~~~~~~~~~~~~
/home/user/build/src/tf300t-katkernel-cbde2a64b1f7244ed5a85b79dfcb4e56e79dbda5/include/linux/kernel.h:45:59: note: in expansion of macro '__must_be_array'
#define ARRAY_SIZE(arr) (sizeof(arr) / sizeof((arr)[0]) + __must_be_array(arr))
^~~~~~~~~~~~~~~
/home/user/build/src/tf300t-katkernel-cbde2a64b1f7244ed5a85b79dfcb4e56e79dbda5/arch/arm/mach-tegra/board-cardhu-sensors.c:1735:3: note: in expansion of macro 'ARRAY_SIZE'
ARRAY_SIZE(cardhu_i2c3_board_info));
^~~~~~~~~~
/home/user/build/src/tf300t-katkernel-cbde2a64b1f7244ed5a85b79dfcb4e56e79dbda5/arch/arm/mach-tegra/board-cardhu-sensors.c:1737:29: error: 'cardhu_i2c_board_info_tps61050' undeclared (first use in this function)
i2c_register_board_info(2, cardhu_i2c_board_info_tps61050,
^~~~~~~~~~~~~~~~~~~~~~~~~~~~~~
In file included from /home/user/build/src/tf300t-katkernel-cbde2a64b1f7244ed5a85b79dfcb4e56e79dbda5/include/linux/cache.h:4:0,
from /home/user/build/src/tf300t-katkernel-cbde2a64b1f7244ed5a85b79dfcb4e56e79dbda5/include/linux/time.h:7,
from /home/user/build/src/tf300t-katkernel-cbde2a64b1f7244ed5a85b79dfcb4e56e79dbda5/include/linux/stat.h:60,
from /home/user/build/src/tf300t-katkernel-cbde2a64b1f7244ed5a85b79dfcb4e56e79dbda5/include/linux/module.h:10,
from /home/user/build/src/tf300t-katkernel-cbde2a64b1f7244ed5a85b79dfcb4e56e79dbda5/include/linux/i2c.h:31,
from /home/user/build/src/tf300t-katkernel-cbde2a64b1f7244ed5a85b79dfcb4e56e79dbda5/arch/arm/mach-tegra/board-cardhu-sensors.c:34:
/home/user/build/src/tf300t-katkernel-cbde2a64b1f7244ed5a85b79dfcb4e56e79dbda5/include/linux/kernel.h:672:45: error: bit-field '<anonymous>' width not an integer constant
#define BUILD_BUG_ON_ZERO(e) (sizeof(struct { int:-!!(e); }))
^
/home/user/build/src/tf300t-katkernel-cbde2a64b1f7244ed5a85b79dfcb4e56e79dbda5/include/linux/compiler-gcc.h:64:28: note: in expansion of macro 'BUILD_BUG_ON_ZERO'
#define __must_be_array(a) BUILD_BUG_ON_ZERO(__same_type((a), &(a)[0]))
^~~~~~~~~~~~~~~~~
/home/user/build/src/tf300t-katkernel-cbde2a64b1f7244ed5a85b79dfcb4e56e79dbda5/include/linux/kernel.h:45:59: note: in expansion of macro '__must_be_array'
#define ARRAY_SIZE(arr) (sizeof(arr) / sizeof((arr)[0]) + __must_be_array(arr))
^~~~~~~~~~~~~~~
/home/user/build/src/tf300t-katkernel-cbde2a64b1f7244ed5a85b79dfcb4e56e79dbda5/arch/arm/mach-tegra/board-cardhu-sensors.c:1738:3: note: in expansion of macro 'ARRAY_SIZE'
ARRAY_SIZE(cardhu_i2c_board_info_tps61050));
^~~~~~~~~~
/home/user/build/src/tf300t-katkernel-cbde2a64b1f7244ed5a85b79dfcb4e56e79dbda5/arch/arm/mach-tegra/board-cardhu-sensors.c:1746:29: error: 'cardhu_i2c_board_info_e1214' undeclared (first use in this function)
i2c_register_board_info(2, cardhu_i2c_board_info_e1214,
^~~~~~~~~~~~~~~~~~~~~~~~~~~
In file included from /home/user/build/src/tf300t-katkernel-cbde2a64b1f7244ed5a85b79dfcb4e56e79dbda5/include/linux/cache.h:4:0,
from /home/user/build/src/tf300t-katkernel-cbde2a64b1f7244ed5a85b79dfcb4e56e79dbda5/include/linux/time.h:7,
from /home/user/build/src/tf300t-katkernel-cbde2a64b1f7244ed5a85b79dfcb4e56e79dbda5/include/linux/stat.h:60,
from /home/user/build/src/tf300t-katkernel-cbde2a64b1f7244ed5a85b79dfcb4e56e79dbda5/include/linux/module.h:10,
from /home/user/build/src/tf300t-katkernel-cbde2a64b1f7244ed5a85b79dfcb4e56e79dbda5/include/linux/i2c.h:31,
from /home/user/build/src/tf300t-katkernel-cbde2a64b1f7244ed5a85b79dfcb4e56e79dbda5/arch/arm/mach-tegra/board-cardhu-sensors.c:34:
/home/user/build/src/tf300t-katkernel-cbde2a64b1f7244ed5a85b79dfcb4e56e79dbda5/include/linux/kernel.h:672:45: error: bit-field '<anonymous>' width not an integer constant
#define BUILD_BUG_ON_ZERO(e) (sizeof(struct { int:-!!(e); }))
^
/home/user/build/src/tf300t-katkernel-cbde2a64b1f7244ed5a85b79dfcb4e56e79dbda5/include/linux/compiler-gcc.h:64:28: note: in expansion of macro 'BUILD_BUG_ON_ZERO'
#define __must_be_array(a) BUILD_BUG_ON_ZERO(__same_type((a), &(a)[0]))
^~~~~~~~~~~~~~~~~
/home/user/build/src/tf300t-katkernel-cbde2a64b1f7244ed5a85b79dfcb4e56e79dbda5/include/linux/kernel.h:45:59: note: in expansion of macro '__must_be_array'
#define ARRAY_SIZE(arr) (sizeof(arr) / sizeof((arr)[0]) + __must_be_array(arr))
^~~~~~~~~~~~~~~
/home/user/build/src/tf300t-katkernel-cbde2a64b1f7244ed5a85b79dfcb4e56e79dbda5/arch/arm/mach-tegra/board-cardhu-sensors.c:1747:3: note: in expansion of macro 'ARRAY_SIZE'
ARRAY_SIZE(cardhu_i2c_board_info_e1214));
^~~~~~~~~~
/home/user/build/src/tf300t-katkernel-cbde2a64b1f7244ed5a85b79dfcb4e56e79dbda5/arch/arm/mach-tegra/board-cardhu-sensors.c:1753:6: error: 'cardhu_i2c6_board_info' undeclared (first use in this function)
cardhu_i2c6_board_info,
^~~~~~~~~~~~~~~~~~~~~~
In file included from /home/user/build/src/tf300t-katkernel-cbde2a64b1f7244ed5a85b79dfcb4e56e79dbda5/include/linux/cache.h:4:0,
from /home/user/build/src/tf300t-katkernel-cbde2a64b1f7244ed5a85b79dfcb4e56e79dbda5/include/linux/time.h:7,
from /home/user/build/src/tf300t-katkernel-cbde2a64b1f7244ed5a85b79dfcb4e56e79dbda5/include/linux/stat.h:60,
from /home/user/build/src/tf300t-katkernel-cbde2a64b1f7244ed5a85b79dfcb4e56e79dbda5/include/linux/module.h:10,
from /home/user/build/src/tf300t-katkernel-cbde2a64b1f7244ed5a85b79dfcb4e56e79dbda5/include/linux/i2c.h:31,
from /home/user/build/src/tf300t-katkernel-cbde2a64b1f7244ed5a85b79dfcb4e56e79dbda5/arch/arm/mach-tegra/board-cardhu-sensors.c:34:
/home/user/build/src/tf300t-katkernel-cbde2a64b1f7244ed5a85b79dfcb4e56e79dbda5/include/linux/kernel.h:672:45: error: bit-field '<anonymous>' width not an integer constant
#define BUILD_BUG_ON_ZERO(e) (sizeof(struct { int:-!!(e); }))
^
/home/user/build/src/tf300t-katkernel-cbde2a64b1f7244ed5a85b79dfcb4e56e79dbda5/include/linux/compiler-gcc.h:64:28: note: in expansion of macro 'BUILD_BUG_ON_ZERO'
#define __must_be_array(a) BUILD_BUG_ON_ZERO(__same_type((a), &(a)[0]))
^~~~~~~~~~~~~~~~~
/home/user/build/src/tf300t-katkernel-cbde2a64b1f7244ed5a85b79dfcb4e56e79dbda5/include/linux/kernel.h:45:59: note: in expansion of macro '__must_be_array'
#define ARRAY_SIZE(arr) (sizeof(arr) / sizeof((arr)[0]) + __must_be_array(arr))
^~~~~~~~~~~~~~~
/home/user/build/src/tf300t-katkernel-cbde2a64b1f7244ed5a85b79dfcb4e56e79dbda5/arch/arm/mach-tegra/board-cardhu-sensors.c:1754:6: note: in expansion of macro 'ARRAY_SIZE'
ARRAY_SIZE(cardhu_i2c6_board_info));
^~~~~~~~~~
/home/user/build/src/tf300t-katkernel-cbde2a64b1f7244ed5a85b79dfcb4e56e79dbda5/arch/arm/mach-tegra/board-cardhu-sensors.c:1757:6: error: 'cardhu_i2c7_board_info' undeclared (first use in this function)
cardhu_i2c7_board_info,
^~~~~~~~~~~~~~~~~~~~~~
In file included from /home/user/build/src/tf300t-katkernel-cbde2a64b1f7244ed5a85b79dfcb4e56e79dbda5/include/linux/cache.h:4:0,
from /home/user/build/src/tf300t-katkernel-cbde2a64b1f7244ed5a85b79dfcb4e56e79dbda5/include/linux/time.h:7,
from /home/user/build/src/tf300t-katkernel-cbde2a64b1f7244ed5a85b79dfcb4e56e79dbda5/include/linux/stat.h:60,
from /home/user/build/src/tf300t-katkernel-cbde2a64b1f7244ed5a85b79dfcb4e56e79dbda5/include/linux/module.h:10,
from /home/user/build/src/tf300t-katkernel-cbde2a64b1f7244ed5a85b79dfcb4e56e79dbda5/include/linux/i2c.h:31,
from /home/user/build/src/tf300t-katkernel-cbde2a64b1f7244ed5a85b79dfcb4e56e79dbda5/arch/arm/mach-tegra/board-cardhu-sensors.c:34:
/home/user/build/src/tf300t-katkernel-cbde2a64b1f7244ed5a85b79dfcb4e56e79dbda5/include/linux/kernel.h:672:45: error: bit-field '<anonymous>' width not an integer constant
#define BUILD_BUG_ON_ZERO(e) (sizeof(struct { int:-!!(e); }))
^
/home/user/build/src/tf300t-katkernel-cbde2a64b1f7244ed5a85b79dfcb4e56e79dbda5/include/linux/compiler-gcc.h:64:28: note: in expansion of macro 'BUILD_BUG_ON_ZERO'
#define __must_be_array(a) BUILD_BUG_ON_ZERO(__same_type((a), &(a)[0]))
^~~~~~~~~~~~~~~~~
/home/user/build/src/tf300t-katkernel-cbde2a64b1f7244ed5a85b79dfcb4e56e79dbda5/include/linux/kernel.h:45:59: note: in expansion of macro '__must_be_array'
#define ARRAY_SIZE(arr) (sizeof(arr) / sizeof((arr)[0]) + __must_be_array(arr))
^~~~~~~~~~~~~~~
/home/user/build/src/tf300t-katkernel-cbde2a64b1f7244ed5a85b79dfcb4e56e79dbda5/arch/arm/mach-tegra/board-cardhu-sensors.c:1758:6: note: in expansion of macro 'ARRAY_SIZE'
ARRAY_SIZE(cardhu_i2c7_board_info));
^~~~~~~~~~
/home/user/build/src/tf300t-katkernel-cbde2a64b1f7244ed5a85b79dfcb4e56e79dbda5/arch/arm/mach-tegra/board-cardhu-sensors.c:1761:6: error: 'pm269_i2c6_board_info' undeclared (first use in this function)
pm269_i2c6_board_info,
^~~~~~~~~~~~~~~~~~~~~
In file included from /home/user/build/src/tf300t-katkernel-cbde2a64b1f7244ed5a85b79dfcb4e56e79dbda5/include/linux/cache.h:4:0,
from /home/user/build/src/tf300t-katkernel-cbde2a64b1f7244ed5a85b79dfcb4e56e79dbda5/include/linux/time.h:7,
from /home/user/build/src/tf300t-katkernel-cbde2a64b1f7244ed5a85b79dfcb4e56e79dbda5/include/linux/stat.h:60,
from /home/user/build/src/tf300t-katkernel-cbde2a64b1f7244ed5a85b79dfcb4e56e79dbda5/include/linux/module.h:10,
from /home/user/build/src/tf300t-katkernel-cbde2a64b1f7244ed5a85b79dfcb4e56e79dbda5/include/linux/i2c.h:31,
from /home/user/build/src/tf300t-katkernel-cbde2a64b1f7244ed5a85b79dfcb4e56e79dbda5/arch/arm/mach-tegra/board-cardhu-sensors.c:34:
/home/user/build/src/tf300t-katkernel-cbde2a64b1f7244ed5a85b79dfcb4e56e79dbda5/include/linux/kernel.h:672:45: error: bit-field '<anonymous>' width not an integer constant
#define BUILD_BUG_ON_ZERO(e) (sizeof(struct { int:-!!(e); }))
^
/home/user/build/src/tf300t-katkernel-cbde2a64b1f7244ed5a85b79dfcb4e56e79dbda5/include/linux/compiler-gcc.h:64:28: note: in expansion of macro 'BUILD_BUG_ON_ZERO'
#define __must_be_array(a) BUILD_BUG_ON_ZERO(__same_type((a), &(a)[0]))
^~~~~~~~~~~~~~~~~
/home/user/build/src/tf300t-katkernel-cbde2a64b1f7244ed5a85b79dfcb4e56e79dbda5/include/linux/kernel.h:45:59: note: in expansion of macro '__must_be_array'
#define ARRAY_SIZE(arr) (sizeof(arr) / sizeof((arr)[0]) + __must_be_array(arr))
^~~~~~~~~~~~~~~
/home/user/build/src/tf300t-katkernel-cbde2a64b1f7244ed5a85b79dfcb4e56e79dbda5/arch/arm/mach-tegra/board-cardhu-sensors.c:1762:6: note: in expansion of macro 'ARRAY_SIZE'
ARRAY_SIZE(pm269_i2c6_board_info));
^~~~~~~~~~
/home/user/build/src/tf300t-katkernel-cbde2a64b1f7244ed5a85b79dfcb4e56e79dbda5/arch/arm/mach-tegra/board-cardhu-sensors.c:1765:6: error: 'pm269_i2c7_board_info' undeclared (first use in this function)
pm269_i2c7_board_info,
^~~~~~~~~~~~~~~~~~~~~
In file included from /home/user/build/src/tf300t-katkernel-cbde2a64b1f7244ed5a85b79dfcb4e56e79dbda5/include/linux/cache.h:4:0,
from /home/user/build/src/tf300t-katkernel-cbde2a64b1f7244ed5a85b79dfcb4e56e79dbda5/include/linux/time.h:7,
from /home/user/build/src/tf300t-katkernel-cbde2a64b1f7244ed5a85b79dfcb4e56e79dbda5/include/linux/stat.h:60,
from /home/user/build/src/tf300t-katkernel-cbde2a64b1f7244ed5a85b79dfcb4e56e79dbda5/include/linux/module.h:10,
from /home/user/build/src/tf300t-katkernel-cbde2a64b1f7244ed5a85b79dfcb4e56e79dbda5/include/linux/i2c.h:31,
from /home/user/build/src/tf300t-katkernel-cbde2a64b1f7244ed5a85b79dfcb4e56e79dbda5/arch/arm/mach-tegra/board-cardhu-sensors.c:34:
/home/user/build/src/tf300t-katkernel-cbde2a64b1f7244ed5a85b79dfcb4e56e79dbda5/include/linux/kernel.h:672:45: error: bit-field '<anonymous>' width not an integer constant
#define BUILD_BUG_ON_ZERO(e) (sizeof(struct { int:-!!(e); }))
^
/home/user/build/src/tf300t-katkernel-cbde2a64b1f7244ed5a85b79dfcb4e56e79dbda5/include/linux/compiler-gcc.h:64:28: note: in expansion of macro 'BUILD_BUG_ON_ZERO'
#define __must_be_array(a) BUILD_BUG_ON_ZERO(__same_type((a), &(a)[0]))
^~~~~~~~~~~~~~~~~
/home/user/build/src/tf300t-katkernel-cbde2a64b1f7244ed5a85b79dfcb4e56e79dbda5/include/linux/kernel.h:45:59: note: in expansion of macro '__must_be_array'
#define ARRAY_SIZE(arr) (sizeof(arr) / sizeof((arr)[0]) + __must_be_array(arr))
^~~~~~~~~~~~~~~
/home/user/build/src/tf300t-katkernel-cbde2a64b1f7244ed5a85b79dfcb4e56e79dbda5/arch/arm/mach-tegra/board-cardhu-sensors.c:1766:6: note: in expansion of macro 'ARRAY_SIZE'
ARRAY_SIZE(pm269_i2c7_board_info));
^~~~~~~~~~
/home/user/build/src/tf300t-katkernel-cbde2a64b1f7244ed5a85b79dfcb4e56e79dbda5/arch/arm/mach-tegra/board-cardhu-sensors.c:1768:44: error: 'cardhu_i2c8_board_info' undeclared (first use in this function)
i2c_register_board_info(PCA954x_I2C_BUS2, cardhu_i2c8_board_info,
^~~~~~~~~~~~~~~~~~~~~~
In file included from /home/user/build/src/tf300t-katkernel-cbde2a64b1f7244ed5a85b79dfcb4e56e79dbda5/include/linux/cache.h:4:0,
from /home/user/build/src/tf300t-katkernel-cbde2a64b1f7244ed5a85b79dfcb4e56e79dbda5/include/linux/time.h:7,
from /home/user/build/src/tf300t-katkernel-cbde2a64b1f7244ed5a85b79dfcb4e56e79dbda5/include/linux/stat.h:60,
from /home/user/build/src/tf300t-katkernel-cbde2a64b1f7244ed5a85b79dfcb4e56e79dbda5/include/linux/module.h:10,
from /home/user/build/src/tf300t-katkernel-cbde2a64b1f7244ed5a85b79dfcb4e56e79dbda5/include/linux/i2c.h:31,
from /home/user/build/src/tf300t-katkernel-cbde2a64b1f7244ed5a85b79dfcb4e56e79dbda5/arch/arm/mach-tegra/board-cardhu-sensors.c:34:
/home/user/build/src/tf300t-katkernel-cbde2a64b1f7244ed5a85b79dfcb4e56e79dbda5/include/linux/kernel.h:672:45: error: bit-field '<anonymous>' width not an integer constant
#define BUILD_BUG_ON_ZERO(e) (sizeof(struct { int:-!!(e); }))
^
/home/user/build/src/tf300t-katkernel-cbde2a64b1f7244ed5a85b79dfcb4e56e79dbda5/include/linux/compiler-gcc.h:64:28: note: in expansion of macro 'BUILD_BUG_ON_ZERO'
#define __must_be_array(a) BUILD_BUG_ON_ZERO(__same_type((a), &(a)[0]))
^~~~~~~~~~~~~~~~~
/home/user/build/src/tf300t-katkernel-cbde2a64b1f7244ed5a85b79dfcb4e56e79dbda5/include/linux/kernel.h:45:59: note: in expansion of macro '__must_be_array'
#define ARRAY_SIZE(arr) (sizeof(arr) / sizeof((arr)[0]) + __must_be_array(arr))
^~~~~~~~~~~~~~~
/home/user/build/src/tf300t-katkernel-cbde2a64b1f7244ed5a85b79dfcb4e56e79dbda5/arch/arm/mach-tegra/board-cardhu-sensors.c:1769:3: note: in expansion of macro 'ARRAY_SIZE'
ARRAY_SIZE(cardhu_i2c8_board_info));
^~~~~~~~~~
At top level:
/home/user/build/src/tf300t-katkernel-cbde2a64b1f7244ed5a85b79dfcb4e56e79dbda5/arch/arm/mach-tegra/board-cardhu-sensors.c:108:37: warning: 'cardhu_pca954x_data' defined but not used [-Wunused-variable]
static struct pca954x_platform_data cardhu_pca954x_data = {
^~~~~~~~~~~~~~~~~~~
/home/user/build/src/tf300t-katkernel-cbde2a64b1f7244ed5a85b79dfcb4e56e79dbda5/arch/arm/mach-tegra/board-cardhu-sensors.c:98:13: warning: 'camera_busy' defined but not used [-Wunused-variable]
static bool camera_busy = false;
^~~~~~~~~~~
/home/user/build/src/tf300t-katkernel-cbde2a64b1f7244ed5a85b79dfcb4e56e79dbda5/arch/arm/mach-tegra/board-cardhu-sensors.c:97:26: warning: 'reg_cardhu_vddio_cam' defined but not used [-Wunused-variable]
static struct regulator *reg_cardhu_vddio_cam; /* LDO5 It's only for ME301T */
^~~~~~~~~~~~~~~~~~~~
/home/user/build/src/tf300t-katkernel-cbde2a64b1f7244ed5a85b79dfcb4e56e79dbda5/arch/arm/mach-tegra/board-cardhu-sensors.c:96:26: warning: 'reg_cardhu_vdda_en' defined but not used [-Wunused-variable]
static struct regulator *reg_cardhu_vdda_en; /* ICATCH7002A_VDDA_EN_GPIO GPIO_PR6*/
^~~~~~~~~~~~~~~~~~
/home/user/build/src/tf300t-katkernel-cbde2a64b1f7244ed5a85b79dfcb4e56e79dbda5/arch/arm/mach-tegra/board-cardhu-sensors.c:95:26: warning: 'reg_cardhu_af_pwr_en' defined but not used [-Wunused-variable]
static struct regulator *reg_cardhu_af_pwr_en; /* ICATCH7002A_AF_PWR_EN_GPIO PS0 */
^~~~~~~~~~~~~~~~~~~~
/home/user/build/src/tf300t-katkernel-cbde2a64b1f7244ed5a85b79dfcb4e56e79dbda5/arch/arm/mach-tegra/board-cardhu-sensors.c:94:26: warning: 'reg_cardhu_1v2_cam' defined but not used [-Wunused-variable]
static struct regulator *reg_cardhu_1v2_cam; /* VDDIO_CAM 1.2V PS0 */
^~~~~~~~~~~~~~~~~~
/home/user/build/src/tf300t-katkernel-cbde2a64b1f7244ed5a85b79dfcb4e56e79dbda5/arch/arm/mach-tegra/board-cardhu-sensors.c:93:26: warning: 'reg_cardhu_2v85_cam' defined but not used [-Wunused-variable]
static struct regulator *reg_cardhu_2v85_cam; /* Front Camera 2.85V power */
^~~~~~~~~~~~~~~~~~~
/home/user/build/src/tf300t-katkernel-cbde2a64b1f7244ed5a85b79dfcb4e56e79dbda5/arch/arm/mach-tegra/board-cardhu-sensors.c:92:26: warning: 'reg_cardhu_1v8_cam' defined but not used [-Wunused-variable]
static struct regulator *reg_cardhu_1v8_cam; /* VDDIO_CAM 1.8V PBB4 */
^~~~~~~~~~~~~~~~~~
/home/user/build/src/tf300t-katkernel-cbde2a64b1f7244ed5a85b79dfcb4e56e79dbda5/arch/arm/mach-tegra/board-cardhu-sensors.c:91:26: warning: 'reg_cardhu_cam' defined but not used [-Wunused-variable]
static struct regulator *reg_cardhu_cam; /* LDO6 */
^~~~~~~~~~~~~~
make[3]: *** [/home/user/build/src/tf300t-katkernel-cbde2a64b1f7244ed5a85b79dfcb4e56e79dbda5/scripts/Makefile.build:305: arch/arm/mach-tegra/board-cardhu-sensors.o] Error 1
make[3]: *** Waiting for unfinished jobs....
CC kernel/kallsyms.o
CC kernel/trace/trace_sched_switch.o
/home/user/build/src/tf300t-katkernel-cbde2a64b1f7244ed5a85b79dfcb4e56e79dbda5/arch/arm/mach-tegra/board-cardhu-memory.c:4949:37: warning: 'cardhu_emc_tables_edb8132b2ma' defined but not used [-Wunused-const-variable=]
static const struct tegra_emc_table cardhu_emc_tables_edb8132b2ma[] = {
^~~~~~~~~~~~~~~~~~~~~~~~~~~~~
/home/user/build/src/tf300t-katkernel-cbde2a64b1f7244ed5a85b79dfcb4e56e79dbda5/arch/arm/mach-tegra/board-cardhu-memory.c:3986:37: warning: 'cardhu_emc_tables_k4p8g304eb' defined but not used [-Wunused-const-variable=]
static const struct tegra_emc_table cardhu_emc_tables_k4p8g304eb[] = {
^~~~~~~~~~~~~~~~~~~~~~~~~~~~
make[2]: *** [/home/user/build/src/tf300t-katkernel-cbde2a64b1f7244ed5a85b79dfcb4e56e79dbda5/Makefile:948: arch/arm/mach-tegra] Error 2
CC kernel/trace/trace_nop.o
CC kernel/cgroup.o
CC kernel/cgroup_freezer.o
CC kernel/trace/blktrace.o
CC kernel/trace/trace_events.o
GZIP kernel/config_data.gz
CC kernel/res_counter.o
CC kernel/stop_machine.o
CC kernel/trace/trace_export.o
CC kernel/audit.o
CC kernel/trace/trace_event_perf.o
CC kernel/auditfilter.o
CC kernel/trace/trace_events_filter.o
CC kernel/trace/power-traces.o
CC kernel/watchdog.o
CC kernel/rcutree.o
CC kernel/utsname_sysctl.o
LD kernel/trace/built-in.o
CC kernel/elfcore.o
CC kernel/tracepoint.o
CC kernel/sched_cpupri.o
CC kernel/irq_work.o
BC kernel/timeconst.h
CHK kernel/config_data.h
CC kernel/time.o
UPD kernel/config_data.h
CC kernel/configs.o
LD kernel/built-in.o
make[1]: *** [Makefile:130: sub-make] Error 2
make: *** [Makefile:26: all] Error 2
>>> ERROR: linux-asus-tf700t: all failed
(020512) [21:23:42] ^^^^^^^^^^^^^^^^^^^^^^^^^^^^^^^^^^^^^^^^^^^^^^^^^^^^^^^^^^^^^^^^^^^^^^
(020512) [21:23:42] NOTE: The failed command's output is above the ^^^ line in the logfile: /home/jja2000/.local/var/pmbootstrap/log.txt
(020512) [21:23:42] ERROR: Command failed: (native) % cd /home/user/build && su user -c 'CROSS_COMPILE=armv6-alpine-linux-muslgnueabihf- CC=armv6-alpine-linux-muslgnueabihf-gcc CARCH=armhf abuild -d'
(020512) [21:23:42] Run 'pmbootstrap log' for details.
(020512) [21:23:42] See also: <https://postmarketos.org/troubleshooting>
(020512) [21:23:42] Traceback (most recent call last):
File "/home/jja2000/gitzooi/pmbootstrap/pmb/helpers/run.py", line 45, in core
stderr=args.logfd)
File "/usr/lib/python3.5/subprocess.py", line 271, in check_call
raise CalledProcessError(retcode, cmd)
subprocess.CalledProcessError: Command '['sudo', '/bin/sh', '-c', 'env -i CHARSET=UTF-8 PATH=/usr/lib/ccache/bin:/usr/local/sbin:/usr/local/bin:/usr/sbin:/usr/bin:/sbin:/bin SHELL=/bin/ash HISTFILE=~/.ash_history /usr/sbin/chroot /home/jja2000/.local/var/pmbootstrap/chroot_native sh -c \'cd /home/user/build;su user -c \'"\'"\'CROSS_COMPILE=armv6-alpine-linux-muslgnueabihf- CC=armv6-alpine-linux-muslgnueabihf-gcc CARCH=armhf abuild -d\'"\'"\'\'']' returned non-zero exit status 1
The above exception was the direct cause of the following exception:
Traceback (most recent call last):
File "/home/jja2000/gitzooi/pmbootstrap/pmb/__init__.py", line 53, in main
getattr(frontend, args.action)(args)
File "/home/jja2000/gitzooi/pmbootstrap/pmb/helpers/frontend.py", line 84, in build
args.buildinfo)
File "/home/jja2000/gitzooi/pmbootstrap/pmb/build/package.py", line 106, in package
pmb.chroot.user(args, cmd, suffix, "/home/user/build")
File "/home/jja2000/gitzooi/pmbootstrap/pmb/chroot/user.py", line 32, in user
auto_init, return_stdout, check)
File "/home/jja2000/gitzooi/pmbootstrap/pmb/chroot/root.py", line 86, in root
return_stdout, check)
File "/home/jja2000/gitzooi/pmbootstrap/pmb/helpers/run.py", line 58, in core
raise RuntimeError("Command failed: " + log_message) from exc
RuntimeError: Command failed: (native) % cd /home/user/build && su user -c 'CROSS_COMPILE=armv6-alpine-linux-muslgnueabihf- CC=armv6-alpine-linux-muslgnueabihf-gcc CARCH=armhf abuild -d'
Sign up for free to join this conversation on GitHub. Already have an account? Sign in to comment
You can’t perform that action at this time.