public
anonymous / stdin.txt
Created

stdin

  • Download Gist
stdin.txt
1 2 3 4 5 6 7 8 9 10 11 12 13 14 15 16 17 18 19 20 21 22 23 24 25 26 27 28 29 30 31 32 33 34 35 36 37 38 39 40 41 42 43 44 45 46 47 48 49 50 51 52 53 54 55 56 57 58 59 60 61 62 63 64 65 66 67 68 69 70 71 72 73 74 75 76 77 78 79 80 81 82 83 84 85 86 87 88 89 90 91 92 93 94 95 96 97 98 99 100 101 102 103 104 105 106 107 108 109 110 111 112 113 114 115 116 117 118 119 120 121 122 123 124 125 126 127 128 129 130 131 132 133 134 135 136 137 138 139 140 141 142 143 144 145 146 147 148 149 150 151 152 153 154 155 156 157 158 159 160 161 162 163
==> Starting build()...
-- The C compiler identification is GNU 4.7.2
-- The CXX compiler identification is GNU 4.7.2
-- Check for working C compiler: /usr/lib/ccache/bin/cc
-- Check for working C compiler: /usr/lib/ccache/bin/cc -- works
-- Detecting C compiler ABI info
-- Detecting C compiler ABI info - done
-- Check for working CXX compiler: /usr/lib/ccache/bin/c++
-- Check for working CXX compiler: /usr/lib/ccache/bin/c++ -- works
-- Detecting CXX compiler ABI info
-- Detecting CXX compiler ABI info - done
-- Looking for Q_WS_X11
-- Looking for Q_WS_X11 - found
-- Looking for Q_WS_WIN
-- Looking for Q_WS_WIN - not found
-- Looking for Q_WS_QWS
-- Looking for Q_WS_QWS - not found
-- Looking for Q_WS_MAC
-- Looking for Q_WS_MAC - not found
-- Found Qt-Version 4.8.4 (using /usr/bin/qmake)
-- Looking for XOpenDisplay in /usr/lib/libX11.so;/usr/lib/libXext.so;/usr/lib/libXft.so;/usr/lib/libXau.so;/usr/lib/libXdmcp.so;/usr/lib/libXpm.so
-- Looking for XOpenDisplay in /usr/lib/libX11.so;/usr/lib/libXext.so;/usr/lib/libXft.so;/usr/lib/libXau.so;/usr/lib/libXdmcp.so;/usr/lib/libXpm.so - found
-- Looking for gethostbyname
-- Looking for gethostbyname - found
-- Looking for connect
-- Looking for connect - found
-- Looking for remove
-- Looking for remove - found
-- Looking for shmat
-- Looking for shmat - found
-- Looking for IceConnectionNumber in ICE
-- Looking for IceConnectionNumber in ICE - found
-- Found X11: /usr/lib/libX11.so
-- Looking for include file pthread.h
-- Looking for include file pthread.h - found
-- Looking for pthread_create
-- Looking for pthread_create - not found
-- Looking for pthread_create in pthreads
-- Looking for pthread_create in pthreads - not found
-- Looking for pthread_create in pthread
-- Looking for pthread_create in pthread - found
-- Found Threads: TRUE
-- Found OpenSSL: /usr/lib/libssl.so
-- Looking for _POSIX_TIMERS
-- Looking for _POSIX_TIMERS - found
-- Found Automoc4: /usr/bin/automoc4
-- Found Perl: /usr/bin/perl (found version "5.16.2")
-- Found Phonon: /usr/include
-- Performing Test _OFFT_IS_64BIT
-- Performing Test _OFFT_IS_64BIT - Success
-- Performing Test HAVE_FPIE_SUPPORT
-- Performing Test HAVE_FPIE_SUPPORT - Success
-- Performing Test __KDE_HAVE_W_OVERLOADED_VIRTUAL
-- Performing Test __KDE_HAVE_W_OVERLOADED_VIRTUAL - Success
-- Performing Test __KDE_HAVE_GCC_VISIBILITY
-- Performing Test __KDE_HAVE_GCC_VISIBILITY - Success
-- Found KDE 4.9 include dir: /usr/include
-- Found KDE 4.9 library dir: /usr/lib
-- Found the KDE4 kconfig_compiler preprocessor: /usr/bin/kconfig_compiler
-- Found automoc4: /usr/bin/automoc4
-- Found OpenGL: /usr/lib/libGL.so
-- Found Sqlite: /usr/include
-- Found SharedMimeInfo: /usr/bin/update-mime-database (found version "1.0", required is "0.18")
-- Configuring done
-- Generating done
-- Build files have been written to: /tmp/yaourt-tmp-dm/aur-konstruktor/src/konstruktor-0.9-beta1/build
Scanning dependencies of target libldr
[ 1%] Building CXX object src/libldr/CMakeFiles/libldr.dir/bfc.o
[ 2%] Building CXX object src/libldr/CMakeFiles/libldr.dir/color.o
[ 3%] Building CXX object src/libldr/CMakeFiles/libldr.dir/elements.o
[ 5%] Building CXX object src/libldr/CMakeFiles/libldr.dir/math.o
[ 6%] Building CXX object src/libldr/CMakeFiles/libldr.dir/metrics.o
[ 7%] Building CXX object src/libldr/CMakeFiles/libldr.dir/model.o
[ 9%] Building CXX object src/libldr/CMakeFiles/libldr.dir/part_library.o
[ 10%] Building CXX object src/libldr/CMakeFiles/libldr.dir/reader.o
[ 11%] Building CXX object src/libldr/CMakeFiles/libldr.dir/utils.o
[ 12%] Building CXX object src/libldr/CMakeFiles/libldr.dir/writer.o
Linking CXX shared library ../../lib/libldraw.so
[ 12%] Built target libldr
Scanning dependencies of target libldrawrenderer
[ 14%] Building CXX object src/renderer/CMakeFiles/libldrawrenderer.dir/mouse_rotation.o
[ 15%] Building CXX object src/renderer/CMakeFiles/libldrawrenderer.dir/normal_extension.o
[ 16%] Building CXX object src/renderer/CMakeFiles/libldrawrenderer.dir/opengl_extension.o
[ 18%] Building CXX object src/renderer/CMakeFiles/libldrawrenderer.dir/opengl_extension_vbo.o
[ 19%] Building CXX object src/renderer/CMakeFiles/libldrawrenderer.dir/opengl_extension_shader.o
[ 20%] Building CXX object src/renderer/CMakeFiles/libldrawrenderer.dir/parameters.o
[ 22%] Building CXX object src/renderer/CMakeFiles/libldrawrenderer.dir/renderer.o
[ 23%] Building CXX object src/renderer/CMakeFiles/libldrawrenderer.dir/renderer_opengl.o
[ 24%] Building CXX object src/renderer/CMakeFiles/libldrawrenderer.dir/renderer_opengl_immediate.o
/tmp/yaourt-tmp-dm/aur-konstruktor/src/konstruktor-0.9-beta1/src/renderer/renderer_opengl_immediate.cpp: 在成员函数‘void ldraw_renderer::renderer_opengl_immediate::draw_model_full(const ldraw::model_multipart*, ldraw::model*, int, const ldraw_renderer::render_filter*)’中:
/tmp/yaourt-tmp-dm/aur-konstruktor/src/konstruktor-0.9-beta1/src/renderer/renderer_opengl_immediate.cpp:62:7: 警告:variable ‘cullenabled’ set but not used [-Wunused-but-set-variable]
[ 25%] Building CXX object src/renderer/CMakeFiles/libldrawrenderer.dir/renderer_opengl_retained.o
[ 27%] Building CXX object src/renderer/CMakeFiles/libldrawrenderer.dir/vbuffer_extension.o
Linking CXX shared library ../../lib/libldrawrenderer.so
[ 27%] Built target libldrawrenderer
Scanning dependencies of target konstruktor_automoc
Generating moc_scanlinewidget.cpp
Generating moc_renderwidget.cpp
Generating moc_application.cpp
Generating moc_dbmanager.cpp
Generating moc_partswidget.cpp
Generating moc_povrayrenderwidget.cpp
Generating moc_editor.cpp
Generating moc_document.cpp
Generating moc_partsmodel.cpp
Generating moc_colordialog.cpp
Generating moc_contentsmodel.cpp
Generating moc_mainwindow.cpp
Generating moc_contentsview.cpp
Generating moc_newsubmodeldialog.cpp
Generating moc_submodelwidget.cpp
Generating moc_newmodeldialog.cpp
[ 27%] Built target konstruktor_automoc
[ 28%] Generating ui_partswidget.h
[ 29%] Generating config.h, config.cpp
[ 31%] Generating ui_colordialog.h
/tmp/yaourt-tmp-dm/aur-konstruktor/src/konstruktor-0.9-beta1/src/app/colordialog.ui: Warning: The name 'layoutWidget' (QWidget) is already in use, defaulting to 'layoutWidget1'.
[ 32%] Generating ui_configdisplayform.h
[ 33%] Generating ui_configrenderform.h
[ 35%] Generating ui_newmodeldialog.h
[ 36%] Generating ui_newsubmodeldialog.h
Scanning dependencies of target konstruktor
[ 37%] Building CXX object src/app/CMakeFiles/konstruktor.dir/konstruktor_automoc.o
[ 38%] Building CXX object src/app/CMakeFiles/konstruktor.dir/application.o
[ 40%] Building CXX object src/app/CMakeFiles/konstruktor.dir/colordialog.o
/tmp/yaourt-tmp-dm/aur-konstruktor/src/konstruktor-0.9-beta1/src/app/colordialog.cpp: 在成员函数‘void Konstruktor::ColorDialog::moveCurrentItem(int)’中:
/tmp/yaourt-tmp-dm/aur-konstruktor/src/konstruktor-0.9-beta1/src/app/colordialog.cpp:170:6: 警告:未使用的变量‘cid’ [-Wunused-variable]
[ 41%] Building CXX object src/app/CMakeFiles/konstruktor.dir/colormanager.o
[ 42%] Building CXX object src/app/CMakeFiles/konstruktor.dir/commandbase.o
[ 44%] Building CXX object src/app/CMakeFiles/konstruktor.dir/commandcolor.o
[ 45%] Building CXX object src/app/CMakeFiles/konstruktor.dir/commandinsert.o
[ 46%] Building CXX object src/app/CMakeFiles/konstruktor.dir/commandpaste.o
[ 48%] Building CXX object src/app/CMakeFiles/konstruktor.dir/commandremove.o
[ 49%] Building CXX object src/app/CMakeFiles/konstruktor.dir/commandtransform.o
[ 50%] Building CXX object src/app/CMakeFiles/konstruktor.dir/configdialog.o
[ 51%] Building CXX object src/app/CMakeFiles/konstruktor.dir/contentsmodel.o
[ 53%] Building CXX object src/app/CMakeFiles/konstruktor.dir/contentsview.o
[ 54%] Building CXX object src/app/CMakeFiles/konstruktor.dir/dbmanager.o
[ 55%] Building CXX object src/app/CMakeFiles/konstruktor.dir/document.o
[ 57%] Building CXX object src/app/CMakeFiles/konstruktor.dir/editor.o
[ 58%] Building CXX object src/app/CMakeFiles/konstruktor.dir/mainwindow.o
[ 59%] Building CXX object src/app/CMakeFiles/konstruktor.dir/newmodeldialog.o
[ 61%] Building CXX object src/app/CMakeFiles/konstruktor.dir/newsubmodeldialog.o
[ 62%] Building CXX object src/app/CMakeFiles/konstruktor.dir/objectlist.o
[ 63%] Building CXX object src/app/CMakeFiles/konstruktor.dir/partitems.o
[ 64%] Building CXX object src/app/CMakeFiles/konstruktor.dir/partsiconwidget.o
[ 66%] Building CXX object src/app/CMakeFiles/konstruktor.dir/partsmodel.o
[ 67%] Building CXX object src/app/CMakeFiles/konstruktor.dir/partswidget.o
[ 68%] Building CXX object src/app/CMakeFiles/konstruktor.dir/povrayexporter.o
[ 70%] Building CXX object src/app/CMakeFiles/konstruktor.dir/povrayrenderparameters.o
[ 71%] Building CXX object src/app/CMakeFiles/konstruktor.dir/povrayrenderwidget.o
[ 72%] Building CXX object src/app/CMakeFiles/konstruktor.dir/pixmapextension.o
[ 74%] Building CXX object src/app/CMakeFiles/konstruktor.dir/pixmaprenderer.o
[ 75%] Building CXX object src/app/CMakeFiles/konstruktor.dir/refobject.o
[ 76%] Building CXX object src/app/CMakeFiles/konstruktor.dir/renderwidget.o
/tmp/yaourt-tmp-dm/aur-konstruktor/src/konstruktor-0.9-beta1/src/app/renderwidget.cpp: In member function 'void Konstruktor::RenderWidget::renderPointArray()':
/tmp/yaourt-tmp-dm/aur-konstruktor/src/konstruktor-0.9-beta1/src/app/renderwidget.cpp:398:7: error: redeclaration of 'int i'
/tmp/yaourt-tmp-dm/aur-konstruktor/src/konstruktor-0.9-beta1/src/app/renderwidget.cpp:392:11: error: 'int i' previously declared here
make[2]: *** [src/app/CMakeFiles/konstruktor.dir/renderwidget.o] Error 1
make[1]: *** [src/app/CMakeFiles/konstruktor.dir/all] Error 2
make: *** [all] Error 2
==> ERROR: A failure occurred in build().
Aborting...

Please sign in to comment on this gist.

Something went wrong with that request. Please try again.