secret
Created

  • Download Gist
gistfile1.txt
1 2 3 4 5 6 7 8 9 10 11 12 13 14 15 16 17 18 19 20 21 22 23 24 25 26 27 28 29 30 31 32 33 34 35 36 37 38 39 40 41 42 43 44 45 46 47 48 49 50 51 52 53 54 55 56 57 58 59 60 61 62 63 64 65 66 67 68 69 70 71 72 73 74 75 76 77 78 79 80 81 82 83 84 85 86 87 88 89 90 91 92 93 94 95 96 97 98 99 100 101 102 103 104 105 106 107 108 109 110 111 112 113 114 115 116 117 118 119 120 121 122 123 124 125 126 127 128 129 130 131 132 133 134 135 136 137 138 139 140 141 142 143 144 145 146 147 148 149 150 151 152 153 154 155 156 157 158 159 160 161 162 163 164 165 166 167 168 169 170 171 172 173 174 175 176 177 178 179 180 181 182 183 184 185 186 187 188 189 190 191 192 193 194 195 196 197 198 199 200 201 202 203 204 205 206 207 208 209 210 211 212 213 214 215 216 217 218 219 220 221 222 223 224 225 226 227 228 229 230 231 232 233 234 235 236 237 238 239 240 241 242 243 244 245 246 247 248 249 250 251 252 253 254 255 256 257 258 259 260 261 262 263 264 265 266 267 268 269 270 271 272 273 274 275 276 277 278 279 280 281 282 283 284 285 286 287 288 289 290 291 292 293 294 295 296 297 298 299 300 301 302 303 304 305 306 307 308 309 310 311 312 313 314 315 316 317 318 319 320 321 322 323 324 325 326 327 328 329 330 331 332 333 334 335 336 337 338 339 340 341 342 343 344 345 346 347 348 349 350 351 352 353 354 355 356 357 358 359 360 361 362 363 364 365 366 367 368 369 370 371 372 373 374 375 376 377 378 379 380 381 382 383 384 385 386 387 388 389 390 391 392 393 394 395 396 397 398 399 400 401 402 403 404 405 406 407 408 409 410 411 412 413 414 415 416 417 418 419 420 421 422 423 424 425 426 427 428 429 430 431 432 433 434 435 436 437 438 439 440 441 442 443 444 445 446 447 448 449 450 451 452 453 454
==>(B Connecting to SVN server....(B
svn: warning: cannot set LC_CTYPE locale
svn: warning: environment variable LANG is en_GB.UTF8
svn: warning: please check that your locale name is correct
Updating '.':
At revision 5576.
==>(B SVN checkout done or server timeout(B
svn: warning: cannot set LC_CTYPE locale
svn: warning: environment variable LANG is en_GB.UTF8
svn: warning: please check that your locale name is correct
==>(B Starting cmake and build...(B
-- The C compiler identification is GNU 4.8.0
-- The CXX compiler identification is GNU 4.8.0
-- Check for working C compiler: /usr/bin/cc
-- Check for working C compiler: /usr/bin/cc -- works
-- Detecting C compiler ABI info
-- Detecting C compiler ABI info - done
-- Check for working CXX compiler: /usr/bin/c++
-- Check for working CXX compiler: /usr/bin/c++ -- works
-- Detecting CXX compiler ABI info
-- Detecting CXX compiler ABI info - done
-- Disable the stripping by default in Debug build !!!
-- Disable the building of po files by default in Debug build !!!
-- Found Freetype: /usr/lib32/libfreetype.so (found version "2.4.11")
-- Found GTK2_GTK: /usr/lib32/libgtk-x11-2.0.so
-- Looking for XOpenDisplay in /usr/lib32/libX11.so;/usr/lib32/libXext.so
-- Looking for XOpenDisplay in /usr/lib32/libX11.so;/usr/lib32/libXext.so - found
-- Looking for gethostbyname
-- Looking for gethostbyname - found
-- Looking for connect
-- Looking for connect - found
-- Looking for remove
-- Looking for remove - found
-- Looking for shmat
-- Looking for shmat - found
-- Looking for IceConnectionNumber in ICE
-- Looking for IceConnectionNumber in ICE - found
-- Found X11: /usr/lib32/libX11.so
-- Found ALSA: /usr/lib32/libasound.so (found version "1.0.26")
-- Found BZip2: /usr/lib32/libbz2.so (found version "1.0.6")
-- Looking for BZ2_bzCompressInit in /usr/lib32/libbz2.so
-- Looking for BZ2_bzCompressInit in /usr/lib32/libbz2.so - found
-- Found Gettext: /usr/bin/msgmerge (found version "0.18.2")
-- Found JPEG: /usr/lib32/libjpeg.so
-- Found OpenGL: /usr/lib32/libGL.so
-- Looking for include file pthread.h
-- Looking for include file pthread.h - found
-- Looking for pthread_create
-- Looking for pthread_create - found
-- Found Threads: TRUE
-- Found SDL: /usr/lib32/libSDL.so (found version "1.2.15")
-- Found Subversion: /usr/bin/svn (found version "1.7.9")
-- Found wxWidgets: TRUE
-- Found ZLIB: /usr/lib32/libz.so (found version "1.2.7")
-- Found AIO: /usr/lib32/libaio.so
-- Found Cg: /usr/lib32/libCg.so;/usr/lib32/libCgGL.so
-- Found GLEW: /usr/lib32/libGLEW.so
-- Found Libc: /usr/lib32/librt.so;/usr/lib32/libdl.so;/usr/lib32/libm.so
-- Found PortAudio: /usr/lib32/libportaudio.so
-- Found SoundTouch: /usr/lib32/libSoundTouch.so
-- Found SparseHash: /usr/include
-- Found SparseHash_new: /usr/include
-- Don't build zerospu2. It is super-seeded by spu2x
-- Configuring done
-- Generating done
-- Build files have been written to: /home/alquez/build/linux/pcsx2-svn/src/pcsx2-build
Scanning dependencies of target translations_pcsx2_Iconized
Scanning dependencies of target translations_pcsx2_Main
[ 0%] Generating zh_TW__pcsx2_Main.gmo
[ 0%] Generating zh_TW__pcsx2_Iconized.gmo
Scanning dependencies of target x86emitter
[ 0%] Generating sv_SE__pcsx2_Iconized.gmo
[ 0%] Generating sv_SE__pcsx2_Main.gmo
[ 0%] Building CXX object common/src/x86emitter/CMakeFiles/x86emitter.dir/3dnow.cpp.o
[ 0%] Generating hu_HU__pcsx2_Iconized.gmo
[ 0%] Scanning dependencies of target CDVDnull
Scanning dependencies of target CDVDlinuz
Generating hu_HU__pcsx2_Main.gmo
Scanning dependencies of target dev9null-0.5.0
[ 0%] [ 0%] [ 1%] Generating ko_KR__pcsx2_Iconized.gmo
Building C object plugins/CDVDlinuz/Src/CMakeFiles/CDVDlinuz.dir/buffer.c.o
Building CXX object plugins/CDVDnull/CMakeFiles/CDVDnull.dir/CDVD.cpp.o
[ 2%] [ 3%] [ 4%] Generating ko_KR__pcsx2_Main.gmo
Generating es_ES__pcsx2_Iconized.gmo
Building CXX object plugins/dev9null/CMakeFiles/dev9null-0.5.0.dir/Config.cpp.o
[ 4%] [ 4%] Generating es_ES__pcsx2_Main.gmo
Generating th_TH__pcsx2_Iconized.gmo
[ 4%] Generating id_ID__pcsx2_Iconized.gmo
[ 4%] Generating th_TH__pcsx2_Main.gmo
Scanning dependencies of target CDVDiso
[ 4%] Generating ja_JP__pcsx2_Iconized.gmo
[ 4%] [ 4%] Generating id_ID__pcsx2_Main.gmo
Generating zh_CN__pcsx2_Iconized.gmo
[ 4%] Building CXX object plugins/CDVDiso/src/CMakeFiles/CDVDiso.dir/CDVDisop.cpp.o
[ 4%] [ 4%] Generating tr_TR__pcsx2_Iconized.gmo
Generating ja_JP__pcsx2_Main.gmo
[ 5%] Generating pt_BR__pcsx2_Iconized.gmo
[ 5%] Generating zh_CN__pcsx2_Main.gmo
[ 5%] Generating pl_PL__pcsx2_Iconized.gmo
[ 5%] Generating tr_TR__pcsx2_Main.gmo
[ 5%] Scanning dependencies of target Utilities
Generating ms_MY__pcsx2_Iconized.gmo
[ 5%] [ 6%] Generating cs_CZ__pcsx2_Iconized.gmo
Generating pt_BR__pcsx2_Main.gmo
[ 7%] Building CXX object common/src/Utilities/CMakeFiles/Utilities.dir/AlignedMalloc.cpp.o
[ 7%] Generating it_IT__pcsx2_Iconized.gmo
[ 7%] Generating pl_PL__pcsx2_Main.gmo
[ 7%] [ 7%] Building C object plugins/CDVDlinuz/Src/CMakeFiles/CDVDlinuz.dir/convert.c.o
Generating fi_FI__pcsx2_Iconized.gmo
[ 8%] Generating ru_RU__pcsx2_Iconized.gmo
[ 8%] Generating ms_MY__pcsx2_Main.gmo
[ 8%] Generating fr_FR__pcsx2_Iconized.gmo
[ 8%] [ 8%] Generating ar__pcsx2_Main.gmo
[ 8%] Generating de_DE__pcsx2_Iconized.gmo
Building C object plugins/CDVDlinuz/Src/CMakeFiles/CDVDlinuz.dir/ini.c.o
[ 8%] Built target translations_pcsx2_Iconized
[ 8%] Generating cs_CZ__pcsx2_Main.gmo
[ 8%] Generating it_IT__pcsx2_Main.gmo
[ 9%] Generating fi_FI__pcsx2_Main.gmo
[ 9%] Scanning dependencies of target FWnull-0.7.0
Generating ru_RU__pcsx2_Main.gmo
[ 9%] Building CXX object plugins/FWnull/CMakeFiles/FWnull-0.7.0.dir/Config.cpp.o
[ 9%] Generating fr_FR__pcsx2_Main.gmo
[ 9%] Generating de_DE__pcsx2_Main.gmo
[ 9%] Generating nb_NO__pcsx2_Main.gmo
[ 9%] Built target translations_pcsx2_Main
[ 9%] Building CXX object plugins/FWnull/CMakeFiles/FWnull-0.7.0.dir/FW.cpp.o
[ 10%] Building CXX object common/src/x86emitter/CMakeFiles/x86emitter.dir/cpudetect.cpp.o
In file included from /home/alquez/build/linux/pcsx2-svn/src/pcsx2-build/plugins/CDVDnull/CDVD.h:26:0,
from /home/alquez/build/linux/pcsx2-svn/src/pcsx2-build/plugins/CDVDnull/CDVD.cpp:18:
/home/alquez/build/linux/pcsx2-svn/src/pcsx2-build/common/include/PS2Eext.h: In member function 'int PluginConf::ReadInt(const string&, int)':
/home/alquez/build/linux/pcsx2-svn/src/pcsx2-build/common/include/PS2Eext.h:147:6: warning: variable 'err' set but not used [-Wunused-but-set-variable]
int err = 0;
^
[ 10%] /home/alquez/build/linux/pcsx2-svn/src/pcsx2-build/common/include/PS2Eext.h: In member function 'void PluginConf::WriteInt(std::string, int)':
/home/alquez/build/linux/pcsx2-svn/src/pcsx2-build/common/include/PS2Eext.h:157:6: warning: variable 'err' set but not used [-Wunused-but-set-variable]
int err = 0;
^
Building C object plugins/CDVDlinuz/Src/CMakeFiles/CDVDlinuz.dir/version.c.o
/home/alquez/build/linux/pcsx2-svn/src/pcsx2-build/plugins/CDVDiso/src/CDVDisop.cpp: In function 's32 CDVDgetTOC(void*)':
/home/alquez/build/linux/pcsx2-svn/src/pcsx2-build/plugins/CDVDiso/src/CDVDisop.cpp:325:8: warning: unused variable 'off' [-Wunused-variable]
int off = iso->blockofs;
^
/home/alquez/build/linux/pcsx2-svn/src/pcsx2-build/plugins/CDVDnull/CDVD.cpp: At global scope:
/home/alquez/build/linux/pcsx2-svn/src/pcsx2-build/plugins/CDVDnull/CDVD.cpp:23:13: warning: 'libraryName' defined but not used [-Wunused-variable]
static char libraryName[256];
^
[ 10%] Building C object plugins/CDVDlinuz/Src/CMakeFiles/CDVDlinuz.dir/Linux/aboutbox.c.o
Linking CXX shared library libCDVDnull.so
In file included from /home/alquez/build/linux/pcsx2-svn/src/pcsx2-build/plugins/dev9null/DEV9.h:26:0,
from /home/alquez/build/linux/pcsx2-svn/src/pcsx2-build/plugins/dev9null/Config.cpp:23:
/home/alquez/build/linux/pcsx2-svn/src/pcsx2-build/common/include/PS2Eext.h: In member function 'int PluginConf::ReadInt(const string&, int)':
/home/alquez/build/linux/pcsx2-svn/src/pcsx2-build/common/include/PS2Eext.h:147:6: warning: variable 'err' set but not used [-Wunused-but-set-variable]
int err = 0;
^
/home/alquez/build/linux/pcsx2-svn/src/pcsx2-build/common/include/PS2Eext.h: In member function 'void PluginConf::WriteInt(std::string, int)':
/home/alquez/build/linux/pcsx2-svn/src/pcsx2-build/common/include/PS2Eext.h:157:6: warning: variable 'err' set but not used [-Wunused-but-set-variable]
int err = 0;
^
[ 10%] Building CXX object common/src/Utilities/CMakeFiles/Utilities.dir/CheckedStaticBox.cpp.o
[ 10%] Built target CDVDnull
[ 10%] Building C object plugins/CDVDlinuz/Src/CMakeFiles/CDVDlinuz.dir/Linux/actualfile.c.o
/home/alquez/build/linux/pcsx2-svn/src/pcsx2-build/plugins/CDVDlinuz/Src/Linux/actualfile.c: In function 'ActualFileSeek':
/home/alquez/build/linux/pcsx2-svn/src/pcsx2-build/plugins/CDVDlinuz/Src/Linux/actualfile.c:231:11: warning: variable 'moved' set but not used [-Wunused-but-set-variable]
off64_t moved;
^
[ 10%] Building CXX object plugins/CDVDiso/src/CMakeFiles/CDVDiso.dir/libiso.cpp.o
[ 10%] Building CXX object plugins/CDVDiso/src/CMakeFiles/CDVDiso.dir/Linux/Config.cpp.o
[ 10%] Building CXX object plugins/dev9null/CMakeFiles/dev9null-0.5.0.dir/DEV9.cpp.o
/home/alquez/build/linux/pcsx2-svn/src/pcsx2-build/plugins/CDVDiso/src/libiso.cpp: In function 'int _isoReadZ2table(isoFile*)':
/home/alquez/build/linux/pcsx2-svn/src/pcsx2-build/plugins/CDVDiso/src/libiso.cpp:331:23: warning: comparison between signed and unsigned integer expressions [-Wsign-compare]
for (i = 0; i < iso->blocks; i++)
^
/home/alquez/build/linux/pcsx2-svn/src/pcsx2-build/plugins/CDVDiso/src/libiso.cpp: In function 'int _isoReadBZ2table(isoFile*)':
/home/alquez/build/linux/pcsx2-svn/src/pcsx2-build/plugins/CDVDiso/src/libiso.cpp:374:32: warning: comparison between signed and unsigned integer expressions [-Wsign-compare]
for (i = 0; i < iso->blocks / 16; i++)
^
/home/alquez/build/linux/pcsx2-svn/src/pcsx2-build/plugins/CDVDiso/src/libiso.cpp: In function 'int _isoReadBlock(isoFile*, u8*, int)':
/home/alquez/build/linux/pcsx2-svn/src/pcsx2-build/plugins/CDVDiso/src/libiso.cpp:710:17: warning: comparison between signed and unsigned integer expressions [-Wsign-compare]
if (ret < iso->blocksize)
^
/home/alquez/build/linux/pcsx2-svn/src/pcsx2-build/plugins/CDVDiso/src/libiso.cpp: In function 'int _isoReadBlockZ(isoFile*, u8*, int)':
/home/alquez/build/linux/pcsx2-svn/src/pcsx2-build/plugins/CDVDiso/src/libiso.cpp:732:12: warning: comparison between signed and unsigned integer expressions [-Wsign-compare]
if (ret < p)
^
/home/alquez/build/linux/pcsx2-svn/src/pcsx2-build/plugins/CDVDiso/src/libiso.cpp: In function 'int _isoReadBlockZ2(isoFile*, u8*, int)':
/home/alquez/build/linux/pcsx2-svn/src/pcsx2-build/plugins/CDVDiso/src/libiso.cpp:757:12: warning: comparison between signed and unsigned integer expressions [-Wsign-compare]
if (ret < p)
^
/home/alquez/build/linux/pcsx2-svn/src/pcsx2-build/plugins/CDVDiso/src/libiso.cpp: In function 'int _isoReadBlockBZ2(isoFile*, u8*, int)':
/home/alquez/build/linux/pcsx2-svn/src/pcsx2-build/plugins/CDVDiso/src/libiso.cpp:791:12: warning: comparison between signed and unsigned integer expressions [-Wsign-compare]
if (ret < p)
^
/home/alquez/build/linux/pcsx2-svn/src/pcsx2-build/plugins/CDVDiso/src/libiso.cpp: In function 'int _isoReadBlockD(isoFile*, u8*, int)':
/home/alquez/build/linux/pcsx2-svn/src/pcsx2-build/plugins/CDVDiso/src/libiso.cpp:822:25: warning: comparison between signed and unsigned integer expressions [-Wsign-compare]
if (iso->dtable[i] != lsn) continue;
^
/home/alquez/build/linux/pcsx2-svn/src/pcsx2-build/plugins/CDVDiso/src/libiso.cpp:826:18: warning: comparison between signed and unsigned integer expressions [-Wsign-compare]
if (ret < iso->blocksize) return -1;
^
/home/alquez/build/linux/pcsx2-svn/src/pcsx2-build/plugins/CDVDiso/src/libiso.cpp: In function 'int _isoReadBlockM(isoFile*, u8*, int)':
/home/alquez/build/linux/pcsx2-svn/src/pcsx2-build/plugins/CDVDiso/src/libiso.cpp:843:29: warning: comparison between signed and unsigned integer expressions [-Wsign-compare]
if (lsn >= iso->multih[i].slsn &&
^
/home/alquez/build/linux/pcsx2-svn/src/pcsx2-build/plugins/CDVDiso/src/libiso.cpp:844:33: warning: comparison between signed and unsigned integer expressions [-Wsign-compare]
lsn <= iso->multih[i].elsn)
^
/home/alquez/build/linux/pcsx2-svn/src/pcsx2-build/plugins/CDVDiso/src/libiso.cpp:857:17: warning: comparison between signed and unsigned integer expressions [-Wsign-compare]
if (ret < iso->blocksize)
^
/home/alquez/build/linux/pcsx2-svn/src/pcsx2-build/plugins/CDVDiso/src/libiso.cpp: In function 'int isoReadBlock(isoFile*, u8*, int)':
/home/alquez/build/linux/pcsx2-svn/src/pcsx2-build/plugins/CDVDiso/src/libiso.cpp:870:17: warning: comparison between signed and unsigned integer expressions [-Wsign-compare]
if (lsn > iso->blocks)
^
/home/alquez/build/linux/pcsx2-svn/src/pcsx2-build/plugins/CDVDiso/src/libiso.cpp: In function 'int _isoWriteBlock(isoFile*, u8*, int)':
/home/alquez/build/linux/pcsx2-svn/src/pcsx2-build/plugins/CDVDiso/src/libiso.cpp:910:17: warning: comparison between signed and unsigned integer expressions [-Wsign-compare]
if (ret < iso->blocksize) return -1;
^
/home/alquez/build/linux/pcsx2-svn/src/pcsx2-build/plugins/CDVDiso/src/libiso.cpp: In function 'int _isoWriteBlockZ(isoFile*, u8*, int)':
/home/alquez/build/linux/pcsx2-svn/src/pcsx2-build/plugins/CDVDiso/src/libiso.cpp:935:12: warning: comparison between signed and unsigned integer expressions [-Wsign-compare]
if (ret < size)
^
/home/alquez/build/linux/pcsx2-svn/src/pcsx2-build/plugins/CDVDiso/src/libiso.cpp: In function 'int _isoWriteBlockZ2(isoFile*, u8*, int)':
/home/alquez/build/linux/pcsx2-svn/src/pcsx2-build/plugins/CDVDiso/src/libiso.cpp:959:12: warning: comparison between signed and unsigned integer expressions [-Wsign-compare]
if (ret < size)
^
/home/alquez/build/linux/pcsx2-svn/src/pcsx2-build/plugins/CDVDiso/src/libiso.cpp: In function 'int _isoWriteBlockD(isoFile*, u8*, int)':
/home/alquez/build/linux/pcsx2-svn/src/pcsx2-build/plugins/CDVDiso/src/libiso.cpp:977:17: warning: comparison between signed and unsigned integer expressions [-Wsign-compare]
if (ret < iso->blocksize) return -1;
^
/home/alquez/build/linux/pcsx2-svn/src/pcsx2-build/plugins/CDVDiso/src/libiso.cpp: In function 'int _isoWriteBlockBZ2(isoFile*, u8*, int)':
/home/alquez/build/linux/pcsx2-svn/src/pcsx2-build/plugins/CDVDiso/src/libiso.cpp:991:29: warning: comparison between signed and unsigned integer expressions [-Wsign-compare]
if (lsn == (iso->blocks - 1))
^
/home/alquez/build/linux/pcsx2-svn/src/pcsx2-build/plugins/CDVDiso/src/libiso.cpp:1017:12: warning: comparison between signed and unsigned integer expressions [-Wsign-compare]
if (ret < size)
^
[ 11%] Building C object plugins/CDVDlinuz/Src/CMakeFiles/CDVDlinuz.dir/Linux/CD.c.o
/home/alquez/build/linux/pcsx2-svn/src/pcsx2-build/plugins/CDVDlinuz/Src/Linux/CD.c:77:25: warning: pointer targets in initialization differ in signedness [-Wpointer-sign]
u8 *playstationcdname = "PLAYSTATION\0";
^
/home/alquez/build/linux/pcsx2-svn/src/pcsx2-build/plugins/CDVDlinuz/Src/Linux/CD.c:79:15: warning: pointer targets in initialization differ in signedness [-Wpointer-sign]
u8 *ps1name = "CD-XA001\0";
^
/home/alquez/build/linux/pcsx2-svn/src/pcsx2-build/plugins/CDVDlinuz/Src/Linux/CD.c: In function 'CDreadTrack':
/home/alquez/build/linux/pcsx2-svn/src/pcsx2-build/plugins/CDVDlinuz/Src/Linux/CD.c:151:3: warning: pointer targets in passing argument 2 of 'LBAtoMSF' differ in signedness [-Wpointer-sign]
LBAtoMSF(lsn, buffer);
^
In file included from /home/alquez/build/linux/pcsx2-svn/src/pcsx2-build/plugins/CDVDlinuz/Src/Linux/CD.c:63:0:
/home/alquez/build/linux/pcsx2-svn/src/pcsx2-build/plugins/CDVDlinuz/Src/Linux/../convert.h:93:13: note: expected 'char *' but argument is of type 'u8 *'
extern void LBAtoMSF(unsigned long lsn, char *buffer);
^
/home/alquez/build/linux/pcsx2-svn/src/pcsx2-build/plugins/CDVDlinuz/Src/Linux/CD.c: In function 'CDgetDiskType':
/home/alquez/build/linux/pcsx2-svn/src/pcsx2-build/plugins/CDVDlinuz/Src/Linux/CD.c:649:3: warning: pointer targets in passing argument 2 of 'LBAtoMSF' differ in signedness [-Wpointer-sign]
LBAtoMSF(cdtrack.cdte_addr.lba, &tocbuffer[27]);
^
In file included from /home/alquez/build/linux/pcsx2-svn/src/pcsx2-build/plugins/CDVDlinuz/Src/Linux/CD.c:63:0:
/home/alquez/build/linux/pcsx2-svn/src/pcsx2-build/plugins/CDVDlinuz/Src/Linux/../convert.h:93:13: note: expected 'char *' but argument is of type 'u8 *'
extern void LBAtoMSF(unsigned long lsn, char *buffer);
^
/home/alquez/build/linux/pcsx2-svn/src/pcsx2-build/plugins/CDVDlinuz/Src/Linux/CD.c:693:7: warning: pointer targets in passing argument 2 of 'LBAtoMSF' differ in signedness [-Wpointer-sign]
LBAtoMSF(cdtrack.cdte_addr.lba, &tocbuffer[j*10 + 37]);
^
In file included from /home/alquez/build/linux/pcsx2-svn/src/pcsx2-build/plugins/CDVDlinuz/Src/Linux/CD.c:63:0:
/home/alquez/build/linux/pcsx2-svn/src/pcsx2-build/plugins/CDVDlinuz/Src/Linux/../convert.h:93:13: note: expected 'char *' but argument is of type 'u8 *'
extern void LBAtoMSF(unsigned long lsn, char *buffer);
^
In file included from /home/alquez/build/linux/pcsx2-svn/src/pcsx2-build/plugins/FWnull/FW.h:23:0,
from /home/alquez/build/linux/pcsx2-svn/src/pcsx2-build/plugins/FWnull/Config.cpp:19:
/home/alquez/build/linux/pcsx2-svn/src/pcsx2-build/common/include/PS2Eext.h: In member function 'int PluginConf::ReadInt(const string&, int)':
/home/alquez/build/linux/pcsx2-svn/src/pcsx2-build/common/include/PS2Eext.h:147:6: warning: variable 'err' set but not used [-Wunused-but-set-variable]
int err = 0;
^
/home/alquez/build/linux/pcsx2-svn/src/pcsx2-build/common/include/PS2Eext.h: In member function 'void PluginConf::WriteInt(std::string, int)':
/home/alquez/build/linux/pcsx2-svn/src/pcsx2-build/common/include/PS2Eext.h:157:6: warning: variable 'err' set but not used [-Wunused-but-set-variable]
int err = 0;
^
[ 11%] Building C object plugins/CDVDlinuz/Src/CMakeFiles/CDVDlinuz.dir/Linux/CDVDlinuz.c.o
In file included from /home/alquez/build/linux/pcsx2-svn/src/pcsx2-build/plugins/FWnull/FW.h:23:0,
from /home/alquez/build/linux/pcsx2-svn/src/pcsx2-build/plugins/FWnull/FW.cpp:23:
/home/alquez/build/linux/pcsx2-svn/src/pcsx2-build/common/include/PS2Eext.h: In member function 'int PluginConf::ReadInt(const string&, int)':
/home/alquez/build/linux/pcsx2-svn/src/pcsx2-build/common/include/PS2Eext.h:147:6: warning: variable 'err' set but not used [-Wunused-but-set-variable]
int err = 0;
^
/home/alquez/build/linux/pcsx2-svn/src/pcsx2-build/common/include/PS2Eext.h: In member function 'void PluginConf::WriteInt(std::string, int)':
/home/alquez/build/linux/pcsx2-svn/src/pcsx2-build/common/include/PS2Eext.h:157:6: warning: variable 'err' set but not used [-Wunused-but-set-variable]
int err = 0;
^
/home/alquez/build/linux/pcsx2-svn/src/pcsx2-build/plugins/FWnull/FW.cpp: In function 'void PHYRead()':
/home/alquez/build/linux/pcsx2-svn/src/pcsx2-build/plugins/FWnull/FW.cpp:134:5: warning: unused variable 'data' [-Wunused-variable]
u8 data = (PHYACC >> 16) & 0xff;
^
[ 11%] [ 11%] Building C object plugins/CDVDlinuz/Src/CMakeFiles/CDVDlinuz.dir/Linux/conf.c.o
Building C object plugins/CDVDiso/src/CMakeFiles/CDVDiso.dir/Linux/interface.c.o
[ 11%] Building CXX object common/src/x86emitter/CMakeFiles/x86emitter.dir/fpu.cpp.o
/home/alquez/build/linux/pcsx2-svn/src/pcsx2-build/plugins/FWnull/FW.cpp: At global scope:
/home/alquez/build/linux/pcsx2-svn/src/pcsx2-build/plugins/FWnull/FW.cpp:32:13: warning: 'libraryName' defined but not used [-Wunused-variable]
static char libraryName[256];
^
/home/alquez/build/linux/pcsx2-svn/src/pcsx2-build/plugins/CDVDlinuz/Src/Linux/conf.c: In function 'LoadConf':
/home/alquez/build/linux/pcsx2-svn/src/pcsx2-build/plugins/CDVDlinuz/Src/Linux/conf.c:169:3: warning: pointer targets in passing argument 4 of 'INILoadString' differ in signedness [-Wpointer-sign]
retval = INILoadString(conffilename, "Settings", "Device", conf.devicename);
^
In file included from /home/alquez/build/linux/pcsx2-svn/src/pcsx2-build/plugins/CDVDlinuz/Src/Linux/conf.c:33:0:
/home/alquez/build/linux/pcsx2-svn/src/pcsx2-build/plugins/CDVDlinuz/Src/Linux/../ini.h:109:12: note: expected 'char *' but argument is of type 'u8 *'
extern int INILoadString(char *file, char *section, char *keyword, char *buffer);
^
/home/alquez/build/linux/pcsx2-svn/src/pcsx2-build/plugins/CDVDlinuz/Src/Linux/conf.c:171:5: warning: pointer targets in passing argument 1 of 'sprintf' differ in signedness [-Wpointer-sign]
sprintf(conf.devicename, "/dev/dvd");
^
In file included from /home/alquez/build/linux/pcsx2-svn/src/pcsx2-build/plugins/CDVDlinuz/Src/Linux/conf.c:23:0:
/usr/include/stdio.h:364:12: note: expected 'char * __restrict__' but argument is of type 'u8 *'
extern int sprintf (char *__restrict __s,
^
/home/alquez/build/linux/pcsx2-svn/src/pcsx2-build/plugins/CDVDlinuz/Src/Linux/conf.c: In function 'SaveConf':
/home/alquez/build/linux/pcsx2-svn/src/pcsx2-build/plugins/CDVDlinuz/Src/Linux/conf.c:183:3: warning: pointer targets in passing argument 4 of 'INISaveString' differ in signedness [-Wpointer-sign]
INISaveString(conffilename, "Settings", "Device", conf.devicename);
^
In file included from /home/alquez/build/linux/pcsx2-svn/src/pcsx2-build/plugins/CDVDlinuz/Src/Linux/conf.c:33:0:
/home/alquez/build/linux/pcsx2-svn/src/pcsx2-build/plugins/CDVDlinuz/Src/Linux/../ini.h:107:12: note: expected 'char *' but argument is of type 'u8 *'
extern int INISaveString(char *file, char *section, char *keyword, char *value);
^
[ 11%] Building C object plugins/CDVDlinuz/Src/CMakeFiles/CDVDlinuz.dir/Linux/device.c.o
Linking CXX shared library libFWnull-0.7.0.so
[ 11%] Building CXX object common/src/Utilities/CMakeFiles/Utilities.dir/Console.cpp.o
/home/alquez/build/linux/pcsx2-svn/src/pcsx2-build/plugins/CDVDlinuz/Src/Linux/device.c: In function 'DeviceOpen':
/home/alquez/build/linux/pcsx2-svn/src/pcsx2-build/plugins/CDVDlinuz/Src/Linux/device.c:133:3: warning: pointer targets in passing argument 1 of 'open' differ in signedness [-Wpointer-sign]
devicehandle = open(conf.devicename, O_RDONLY | O_NONBLOCK);
^
In file included from /usr/include/features.h:375:0,
from /usr/include/errno.h:28,
from /home/alquez/build/linux/pcsx2-svn/src/pcsx2-build/plugins/CDVDlinuz/Src/Linux/device.c:21:
/usr/include/fcntl.h:166:12: note: expected 'const char *' but argument is of type 'u8 *'
extern int __REDIRECT (open, (const char *__file, int __oflag, ...), open64)
^
[ 11%] [ 11%] Building C object plugins/CDVDlinuz/Src/CMakeFiles/CDVDlinuz.dir/Linux/DVD.c.o
Built target FWnull-0.7.0
[ 11%] Building C object plugins/CDVDlinuz/Src/CMakeFiles/CDVDlinuz.dir/Linux/interface.c.o
In file included from /home/alquez/build/linux/pcsx2-svn/src/pcsx2-build/plugins/dev9null/DEV9.h:26:0,
from /home/alquez/build/linux/pcsx2-svn/src/pcsx2-build/plugins/dev9null/DEV9.cpp:33:
/home/alquez/build/linux/pcsx2-svn/src/pcsx2-build/common/include/PS2Eext.h: In member function 'int PluginConf::ReadInt(const string&, int)':
/home/alquez/build/linux/pcsx2-svn/src/pcsx2-build/common/include/PS2Eext.h:147:6: warning: variable 'err' set but not used [-Wunused-but-set-variable]
int err = 0;
^
/home/alquez/build/linux/pcsx2-svn/src/pcsx2-build/common/include/PS2Eext.h: In member function 'void PluginConf::WriteInt(std::string, int)':
/home/alquez/build/linux/pcsx2-svn/src/pcsx2-build/common/include/PS2Eext.h:157:6: warning: variable 'err' set but not used [-Wunused-but-set-variable]
int err = 0;
^
/home/alquez/build/linux/pcsx2-svn/src/pcsx2-build/plugins/CDVDlinuz/Src/Linux/DVD.c:41:23: warning: pointer targets in initialization differ in signedness [-Wpointer-sign]
u8 *playstationname = "PLAYSTATION\0";
^
[ 12%] Building C object plugins/CDVDlinuz/Src/CMakeFiles/CDVDlinuz.dir/Linux/logfile.c.o
[ 12%] Building CXX object common/src/Utilities/CMakeFiles/Utilities.dir/EventSource.cpp.o
/home/alquez/build/linux/pcsx2-svn/src/pcsx2-build/plugins/dev9null/DEV9.cpp: At global scope:
/home/alquez/build/linux/pcsx2-svn/src/pcsx2-build/plugins/dev9null/DEV9.cpp:42:13: warning: 'libraryName' defined but not used [-Wunused-variable]
static char libraryName[256];
^
Linking CXX shared library libdev9null-0.5.0.so
[ 12%] Building CXX object common/src/Utilities/CMakeFiles/Utilities.dir/Exceptions.cpp.o
[ 12%] Building CXX object plugins/CDVDiso/src/CMakeFiles/CDVDiso.dir/Linux/Linux.cpp.o
[ 12%] Building C object plugins/CDVDlinuz/Src/CMakeFiles/CDVDlinuz.dir/Linux/mainbox.c.o
[ 12%] Built target dev9null-0.5.0
[ 12%] Building C object plugins/CDVDiso/src/CMakeFiles/CDVDiso.dir/Linux/support.c.o
[ 12%] Building CXX object common/src/x86emitter/CMakeFiles/x86emitter.dir/groups.cpp.o
/home/alquez/build/linux/pcsx2-svn/src/pcsx2-build/plugins/CDVDlinuz/Src/Linux/mainbox.c: In function 'MainBoxOKEvent':
/home/alquez/build/linux/pcsx2-svn/src/pcsx2-build/plugins/CDVDlinuz/Src/Linux/mainbox.c:219:3: warning: pointer targets in passing argument 1 of 'strcpy' differ in signedness [-Wpointer-sign]
strcpy(conf.devicename, tempdevice); // Temporarily put in new device name
^
In file included from /home/alquez/build/linux/pcsx2-svn/src/pcsx2-build/plugins/CDVDlinuz/Src/Linux/mainbox.c:47:0:
/usr/include/string.h:125:14: note: expected 'char * __restrict__' but argument is of type 'u8 *'
extern char *strcpy (char *__restrict __dest, const char *__restrict __src)
^
/home/alquez/build/linux/pcsx2-svn/src/pcsx2-build/plugins/CDVDlinuz/Src/Linux/mainbox.c: In function 'MainBoxDisplay':
/home/alquez/build/linux/pcsx2-svn/src/pcsx2-build/plugins/CDVDlinuz/Src/Linux/mainbox.c:371:3: warning: pointer targets in passing argument 2 of 'gtk_entry_set_text' differ in signedness [-Wpointer-sign]
gtk_entry_set_text(GTK_ENTRY(mainbox.device), conf.devicename);
^
In file included from /home/alquez/build/linux/pcsx2-svn/src/pcsx2-build/plugins/CDVDlinuz/Src/Linux/mainbox.c:61:0:
/usr/include/gtk-2.0/gtk/gtkentry.h:213:12: note: expected 'const gchar *' but argument is of type 'u8 *'
void gtk_entry_set_text (GtkEntry *entry,
^
Linking C shared library libCDVDlinuz.so
[ 12%] Built target CDVDlinuz
[ 12%] [ 12%] Building CXX object common/src/x86emitter/CMakeFiles/x86emitter.dir/jmp.cpp.o
Building CXX object common/src/Utilities/CMakeFiles/Utilities.dir/FastFormatString.cpp.o
[ 13%] Building CXX object common/src/Utilities/CMakeFiles/Utilities.dir/HashTools.cpp.o
/home/alquez/build/linux/pcsx2-svn/src/pcsx2-build/plugins/CDVDiso/src/Linux/Linux.cpp:39:3: warning: anonymous type with no linkage used to declare variable '<anonymous union> cr' with linkage [enabled by default]
} cr;
^
Linking CXX shared library libCDVDiso.so
Scanning dependencies of target GSdx-0.1.16
[ 13%] Building CXX object plugins/GSdx/CMakeFiles/GSdx-0.1.16.dir/GPU.cpp.o
[ 13%] Built target CDVDiso
[ 13%] [ 13%] Building CXX object common/src/Utilities/CMakeFiles/Utilities.dir/IniInterface.cpp.o
Building CXX object common/src/x86emitter/CMakeFiles/x86emitter.dir/legacy.cpp.o
[ 13%] Building CXX object common/src/Utilities/CMakeFiles/Utilities.dir/Linux/LnxHostSys.cpp.o
[ 13%] Building CXX object common/src/Utilities/CMakeFiles/Utilities.dir/Linux/LnxMisc.cpp.o
[ 13%] Building CXX object common/src/x86emitter/CMakeFiles/x86emitter.dir/legacy_sse.cpp.o
[ 14%] Building CXX object common/src/x86emitter/CMakeFiles/x86emitter.dir/LnxCpuDetect.cpp.o
[ 14%] Building CXX object common/src/x86emitter/CMakeFiles/x86emitter.dir/movs.cpp.o
[ 14%] Building CXX object common/src/x86emitter/CMakeFiles/x86emitter.dir/PrecompiledHeader.cpp.o
In file included from /home/alquez/build/linux/pcsx2-svn/src/pcsx2-build/plugins/GSdx/GPU.cpp:22:0:
/home/alquez/build/linux/pcsx2-svn/src/pcsx2-build/plugins/GSdx/stdafx.h: In function 'long long unsigned int __rdtsc()':
/home/alquez/build/linux/pcsx2-svn/src/pcsx2-build/plugins/GSdx/stdafx.h:437:35: error: 'long long unsigned int __rdtsc()' redeclared inline without 'gnu_inline' attribute
__forceinline unsigned long long __rdtsc()
^
In file included from /usr/lib/gcc/x86_64-unknown-linux-gnu/4.8.0/include/x86intrin.h:27:0,
from /usr/include/c++/4.8.0/bits/opt_random.h:33,
from /usr/include/c++/4.8.0/random:51,
from /usr/include/c++/4.8.0/bits/stl_algo.h:65,
from /usr/include/c++/4.8.0/algorithm:62,
from /home/alquez/build/linux/pcsx2-svn/src/pcsx2-build/plugins/GSdx/stdafx.h:102,
from /home/alquez/build/linux/pcsx2-svn/src/pcsx2-build/plugins/GSdx/GPU.cpp:22:
/usr/lib/gcc/x86_64-unknown-linux-gnu/4.8.0/include/ia32intrin.h:95:1: error: 'long long unsigned int __rdtsc()' previously defined here
__rdtsc (void)
^
[ 14%] Building CXX object common/src/x86emitter/CMakeFiles/x86emitter.dir/simd.cpp.o
[ 14%] Building CXX object common/src/Utilities/CMakeFiles/Utilities.dir/Linux/LnxThreads.cpp.o
[ 14%] Building CXX object common/src/Utilities/CMakeFiles/Utilities.dir/Mutex.cpp.o
In file included from /home/alquez/build/linux/pcsx2-svn/src/pcsx2-build/plugins/GSdx/GSUtil.h:24:0,
from /home/alquez/build/linux/pcsx2-svn/src/pcsx2-build/plugins/GSdx/GPU.cpp:24:
/home/alquez/build/linux/pcsx2-svn/src/pcsx2-build/plugins/GSdx/GS.h: In member function 'bool GIFRegTEX0::IsRepeating() const':
/home/alquez/build/linux/pcsx2-svn/src/pcsx2-build/plugins/GSdx/GS.h:810:32: warning: comparison between signed and unsigned integer expressions [-Wsign-compare]
return (TBW << 6) < (1u << TW);
^
[ 15%] Building CXX object common/src/Utilities/CMakeFiles/Utilities.dir/PathUtils.cpp.o
[ 15%] make[2]: *** [plugins/GSdx/CMakeFiles/GSdx-0.1.16.dir/GPU.cpp.o] Error 1
make[1]: *** [plugins/GSdx/CMakeFiles/GSdx-0.1.16.dir/all] Error 2
make[1]: *** Waiting for unfinished jobs....
Building CXX object common/src/x86emitter/CMakeFiles/x86emitter.dir/x86emitter.cpp.o
[ 15%] Building CXX object common/src/Utilities/CMakeFiles/Utilities.dir/PrecompiledHeader.cpp.o
[ 15%] Building CXX object common/src/Utilities/CMakeFiles/Utilities.dir/pxCheckBox.cpp.o
[ 15%] Building CXX object common/src/Utilities/CMakeFiles/Utilities.dir/pxRadioPanel.cpp.o
[ 15%] Building CXX object common/src/Utilities/CMakeFiles/Utilities.dir/pxStaticText.cpp.o
[ 15%] Building CXX object common/src/Utilities/CMakeFiles/Utilities.dir/pxStreams.cpp.o
[ 15%] Building CXX object common/src/Utilities/CMakeFiles/Utilities.dir/pxTranslate.cpp.o
[ 16%] Building CXX object common/src/Utilities/CMakeFiles/Utilities.dir/pxWindowTextWriter.cpp.o
[ 16%] Building CXX object common/src/Utilities/CMakeFiles/Utilities.dir/Semaphore.cpp.o
[ 16%] Building CXX object common/src/Utilities/CMakeFiles/Utilities.dir/StringHelpers.cpp.o
[ 16%] Building CXX object common/src/Utilities/CMakeFiles/Utilities.dir/ThreadingDialogs.cpp.o
[ 16%] Building CXX object common/src/Utilities/CMakeFiles/Utilities.dir/ThreadTools.cpp.o
Linking CXX static library libx86emitter.a
[ 16%] Building CXX object common/src/Utilities/CMakeFiles/Utilities.dir/vssprintf.cpp.o
[ 16%] Built target x86emitter
[ 17%] [ 17%] Building CXX object common/src/Utilities/CMakeFiles/Utilities.dir/wxAppWithHelpers.cpp.o
Building CXX object common/src/Utilities/CMakeFiles/Utilities.dir/VirtualMemory.cpp.o
[ 17%] Building CXX object common/src/Utilities/CMakeFiles/Utilities.dir/wxGuiTools.cpp.o
[ 17%] Building CXX object common/src/Utilities/CMakeFiles/Utilities.dir/wxHelpers.cpp.o
[ 17%] Building CXX object common/src/Utilities/CMakeFiles/Utilities.dir/x86/MemcpyVibes.cpp.o
[ 17%] Building CXX object common/src/Utilities/CMakeFiles/Utilities.dir/x86/MemcpyFast.S.o
Linking CXX static library libUtilities.a
[ 17%] Built target Utilities
make: *** [all] Error 2
==> ERROR:(B A failure occurred in build().(B
 Aborting...(B

Please sign in to comment on this gist.

Something went wrong with that request. Please try again.