Skip to content

Instantly share code, notes, and snippets.

/Eror Secret

Created Aug 19, 2016
Embed
What would you like to do?
f4920062ecede041335445734b439cb7
6d39cb5cd0863b9c40cb623807c7e4a1
1fd5db167926450e40dcdd6a40aa9f2b
5cb12cf11288f7bc15f7c2fc01344945
f19baf32499802ff03bc3228dc275ba0
0fb7fdc689dce5ecc937168006467445
568fd5b7a46102c0dba5affb358bb55b
f236db452bdccdf0efc14c6bb1a96727
35b313e8030ca0bc5e36a14a0663e84a
67d482e7bad8af76f1f0aa1496b4776c
cd3bbf6c7419d5dc5fcae703911b7519
3cdeec00a3634b0d0a1013b2d56ccc74
41a352d4bfa68e1dd91cc827cbd2c650
74e04a454a191806eae4ffb57a388482
735bcae5a36c1be15644c7f73ad4411e
d1dd9933fd94c42b01a8200969d2d409
278dd48379f05b8966689e8db258b2e5
41a63e084610177077c6a64bf98e1b61
38555284c52fe5dc9fb211fd7bba5047
a1926b37a8029a577c76ddff2c83e7ea
46a9dc6ad565f9847fa5026efcb2591b
77bb4207ab47a5540c52bd0bc5375658
6e38bce2e23b5f21a9f632a679848235
139f9b546a7bf10470edf0b17a0f51e2
c1014ea1e7bf64c4d3cd81f4b98f90a6
6b1204a554d40f8776391cadcabb360b
d1580f11067a2dbc91f2672f61aa9118
afaf33f933f82600c9056bd70b1c90e6
29fc0758d7caba4feeaad950c37b3597
04b4872f131cfd39ad0c96d1de13e4de
f7074727e01e0f7451fe1885ab8abcc1
79e1d3fc98669a10ce48deed5202fa04
7e90afb0899df31449c48cb4bdc3cdc5
0e743e6568931283e7d559a221dc7898
5ef968ba027afb6ed65dd4e52b2f194a
e46920c3a1870930d81752a154c58ef5
d91fc5ef3285fa923a6cf147075608d7
4b58bc0f6aacc079f3d0e93880fdf6c2
c9e2ed8598182d4b3ae5c680f3c7d382
54dc7cf58981e6f2ac37c0c0af122b31
e2a96f581f86fd1aed2b8040c16f40ef
Executing task ':fixMcSources' (up-to-date check took 0.043 secs) due to:
Output file D:\Dropbox\Dropbox\Mod\Mc\Pizza-mod\.gradle\minecraft\forge-1.10.2-12.18.1.2066-PROJECT(Pizza-mod)-decompFixed.jar has changed.
Output file D:\Dropbox\Dropbox\Mod\Mc\Pizza-mod\.gradle\minecraft\forge-1.10.2-12.18.1.2066-PROJECT(Pizza-mod)-decompFixed.jar has been removed.
:fixMcSources (Thread[main,5,main]) completed. Took 14.384 secs.
:applySourcePatches (Thread[main,5,main]) started.
:applySourcePatches
Skipping task ':applySourcePatches' as task onlyIf is false.
:applySourcePatches SKIPPED
:applySourcePatches (Thread[main,5,main]) completed. Took 0.56 secs.
:remapMcSources (Thread[main,5,main]) started.
:remapMcSources
Skipping task ':remapMcSources' as task onlyIf is false.
:remapMcSources SKIPPED
:remapMcSources (Thread[main,5,main]) completed. Took 0.585 secs.
:recompileMc (Thread[main,5,main]) started.
:recompileMc
No output file found.
Executing task ':recompileMc' (up-to-date check took 0.002 secs) due to:
No history is available.
[ant:javac] Compiling 2545 source files to D:\Dropbox\Dropbox\Mod\Mc\Pizza-mod\build\tmp\recompileMc\compiled
[ant:javac] warning: [options] bootstrap class path not set in conjunction with -source 1.6
[ant:javac] D:\Dropbox\Dropbox\Mod\Mc\Pizza-mod\build\tmp\recompileMc\sources\net\minecraft\world\biome\Biome.java:390: error: variable biome is already defined in method getBiomeFromBiomeList(int,Biome)
[ant:javac] Biome biome = func_185357_a(biomeId);
[ant:javac] ^
[ant:javac] D:\Dropbox\Dropbox\Mod\Mc\Pizza-mod\build\tmp\recompileMc\sources\net\minecraft\client\audio\SoundManager.java:391: error: variable sound is already defined in method playSound(ISound)
[ant:javac] Sound sound = sound.func_184364_b();
[ant:javac] ^
[ant:javac] D:\Dropbox\Dropbox\Mod\Mc\Pizza-mod\build\tmp\recompileMc\sources\net\minecraft\client\audio\SoundManager.java:391: error: cannot find symbol
[ant:javac] Sound sound = sound.func_184364_b();
[ant:javac] ^
[ant:javac] symbol: method func_184364_b()
[ant:javac] location: variable sound of type Sound
[ant:javac] D:\Dropbox\Dropbox\Mod\Mc\Pizza-mod\build\tmp\recompileMc\sources\net\minecraft\client\audio\SoundManager.java:402: error: cannot find symbol
[ant:javac] float f3 = sound.getVolume();
[ant:javac] ^
[ant:javac] symbol: method getVolume()
[ant:javac] location: variable sound of type Sound
[ant:javac] D:\Dropbox\Dropbox\Mod\Mc\Pizza-mod\build\tmp\recompileMc\sources\net\minecraft\client\audio\SoundManager.java:410: error: cannot find symbol
[ant:javac] SoundCategory soundcategory = sound.func_184365_d();
[ant:javac] ^
[ant:javac] symbol: method func_184365_d()
[ant:javac] location: variable sound of type Sound
[ant:javac] D:\Dropbox\Dropbox\Mod\Mc\Pizza-mod\build\tmp\recompileMc\sources\net\minecraft\client\audio\SoundManager.java:411: error: incompatible types: Sound cannot be converted to ISound
[ant:javac] float f1 = this.func_188770_e(sound);
[ant:javac] ^
[ant:javac] D:\Dropbox\Dropbox\Mod\Mc\Pizza-mod\build\tmp\recompileMc\sources\net\minecraft\client\audio\SoundManager.java:412: error: incompatible types: Sound cannot be converted to ISound
[ant:javac] float f2 = this.func_188772_d(sound);
[ant:javac] ^
[ant:javac] D:\Dropbox\Dropbox\Mod\Mc\Pizza-mod\build\tmp\recompileMc\sources\net\minecraft\client\audio\SoundManager.java:420: error: cannot find symbol
[ant:javac] boolean flag = sound.canRepeat() && sound.getRepeatDelay() == 0;
[ant:javac] ^
[ant:javac] symbol: method canRepeat()
[ant:javac] location: variable sound of type Sound
[ant:javac] D:\Dropbox\Dropbox\Mod\Mc\Pizza-mod\build\tmp\recompileMc\sources\net\minecraft\client\audio\SoundManager.java:420: error: cannot find symbol
[ant:javac] boolean flag = sound.canRepeat() && sound.getRepeatDelay() == 0;
[ant:javac] ^
[ant:javac] symbol: method getRepeatDelay()
[ant:javac] location: variable sound of type Sound
[ant:javac] D:\Dropbox\Dropbox\Mod\Mc\Pizza-mod\build\tmp\recompileMc\sources\net\minecraft\client\audio\SoundManager.java:426: error: cannot find symbol
[ant:javac] this.sndSystem.newStreamingSource(false, s, getURLForSoundResource(resourcelocation1), resourcelocation1.toString(), flag, sound.getXPosF(), sound.getYPosF(), sound.getZPosF(), sound.getAttenuationType().getTypeInt(), f);
[ant:javac] ^
[ant:javac] symbol: method getXPosF()
[ant:javac] location: variable sound of type Sound
[ant:javac] D:\Dropbox\Dropbox\Mod\Mc\Pizza-mod\build\tmp\recompileMc\sources\net\minecraft\client\audio\SoundManager.java:426: error: cannot find symbol
[ant:javac] this.sndSystem.newStreamingSource(false, s, getURLForSoundResource(resourcelocation1), resourcelocation1.toString(), flag, sound.getXPosF(), sound.getYPosF(), sound.getZPosF(), sound.getAttenuationType().getTypeInt(), f);
[ant:javac] ^
[ant:javac] symbol: method getYPosF()
[ant:javac] location: variable sound of type Sound
[ant:javac] D:\Dropbox\Dropbox\Mod\Mc\Pizza-mod\build\tmp\recompileMc\sources\net\minecraft\client\audio\SoundManager.java:426: error: cannot find symbol
[ant:javac] this.sndSystem.newStreamingSource(false, s, getURLForSoundResource(resourcelocation1), resourcelocation1.toString(), flag, sound.getXPosF(), sound.getYPosF(), sound.getZPosF(), sound.getAttenuationType().getTypeInt(), f);
[ant:javac] ^
[ant:javac] symbol: method getZPosF()
[ant:javac] location: variable sound of type Sound
[ant:javac] D:\Dropbox\Dropbox\Mod\Mc\Pizza-mod\build\tmp\recompileMc\sources\net\minecraft\client\audio\SoundManager.java:426: error: cannot find symbol
[ant:javac] this.sndSystem.newStreamingSource(false, s, getURLForSoundResource(resourcelocation1), resourcelocation1.toString(), flag, sound.getXPosF(), sound.getYPosF(), sound.getZPosF(), sound.getAttenuationType().getTypeInt(), f);
[ant:javac] ^
[ant:javac] symbol: method getAttenuationType()
[ant:javac] location: variable sound of type Sound
[ant:javac] D:\Dropbox\Dropbox\Mod\Mc\Pizza-mod\build\tmp\recompileMc\sources\net\minecraft\client\audio\SoundManager.java:427: error: incompatible types: Sound cannot be converted to ISound
[ant:javac] net.minecraftforge.common.MinecraftForge.EVENT_BUS.post(new net.minecraftforge.client.event.sound.PlayStreamingSourceEvent(this, sound, s));
[ant:javac] ^
[ant:javac] D:\Dropbox\Dropbox\Mod\Mc\Pizza-mod\build\tmp\recompileMc\sources\net\minecraft\client\audio\SoundManager.java:431: error: cannot find symbol
[ant:javac] this.sndSystem.newSource(false, s, getURLForSoundResource(resourcelocation1), resourcelocation1.toString(), flag, sound.getXPosF(), sound.getYPosF(), sound.getZPosF(), sound.getAttenuationType().getTypeInt(), f);
[ant:javac] ^
[ant:javac] symbol: method getXPosF()
[ant:javac] location: variable sound of type Sound
[ant:javac] D:\Dropbox\Dropbox\Mod\Mc\Pizza-mod\build\tmp\recompileMc\sources\net\minecraft\client\audio\SoundManager.java:431: error: cannot find symbol
[ant:javac] this.sndSystem.newSource(false, s, getURLForSoundResource(resourcelocation1), resourcelocation1.toString(), flag, sound.getXPosF(), sound.getYPosF(), sound.getZPosF(), sound.getAttenuationType().getTypeInt(), f);
[ant:javac] ^
[ant:javac] symbol: method getYPosF()
[ant:javac] location: variable sound of type Sound
[ant:javac] D:\Dropbox\Dropbox\Mod\Mc\Pizza-mod\build\tmp\recompileMc\sources\net\minecraft\client\audio\SoundManager.java:431: error: cannot find symbol
[ant:javac] this.sndSystem.newSource(false, s, getURLForSoundResource(resourcelocation1), resourcelocation1.toString(), flag, sound.getXPosF(), sound.getYPosF(), sound.getZPosF(), sound.getAttenuationType().getTypeInt(), f);
[ant:javac] ^
[ant:javac] symbol: method getZPosF()
[ant:javac] location: variable sound of type Sound
[ant:javac] D:\Dropbox\Dropbox\Mod\Mc\Pizza-mod\build\tmp\recompileMc\sources\net\minecraft\client\audio\SoundManager.java:431: error: cannot find symbol
[ant:javac] this.sndSystem.newSource(false, s, getURLForSoundResource(resourcelocation1), resourcelocation1.toString(), flag, sound.getXPosF(), sound.getYPosF(), sound.getZPosF(), sound.getAttenuationType().getTypeInt(), f);
[ant:javac] ^
[ant:javac] symbol: method getAttenuationType()
[ant:javac] location: variable sound of type Sound
[ant:javac] D:\Dropbox\Dropbox\Mod\Mc\Pizza-mod\build\tmp\recompileMc\sources\net\minecraft\client\audio\SoundManager.java:432: error: incompatible types: Sound cannot be converted to ISound
[ant:javac] net.minecraftforge.common.MinecraftForge.EVENT_BUS.post(new net.minecraftforge.client.event.sound.PlaySoundSourceEvent(this, sound, s));
[ant:javac] ^
[ant:javac] D:\Dropbox\Dropbox\Mod\Mc\Pizza-mod\build\tmp\recompileMc\sources\net\minecraft\client\audio\SoundManager.java:440: error: incompatible types: Sound cannot be converted to ISound
[ant:javac] this.playingSounds.put(s, sound);
[ant:javac] ^
[ant:javac] D:\Dropbox\Dropbox\Mod\Mc\Pizza-mod\build\tmp\recompileMc\sources\net\minecraft\item\ItemShears.java:42: error: variable block is already defined in method getStrVsBlock(ItemStack,IBlockState)
[ant:javac] Block block = block.getBlock();
[ant:javac] ^
[ant:javac] D:\Dropbox\Dropbox\Mod\Mc\Pizza-mod\build\tmp\recompileMc\sources\net\minecraft\item\ItemShears.java:42: error: cannot find symbol
[ant:javac] Block block = block.getBlock();
[ant:javac] ^
[ant:javac] symbol: method getBlock()
[ant:javac] location: variable block of type Block
[ant:javac] D:\Dropbox\Dropbox\Mod\Mc\Pizza-mod\build\tmp\recompileMc\sources\net\minecraft\item\ItemShears.java:43: error: cannot find symbol
[ant:javac] return block != Blocks.web && block.func_185904_a() != Material.leaves ? (block == Blocks.wool ? 5.0F : super.getStrVsBlock(stack, block)) : 15.0F;
[ant:javac] ^
[ant:javac] symbol: method func_185904_a()
[ant:javac] location: variable block of type Block
[ant:javac] D:\Dropbox\Dropbox\Mod\Mc\Pizza-mod\build\tmp\recompileMc\sources\net\minecraft\item\ItemShears.java:43: error: incompatible types: Block cannot be converted to IBlockState
[ant:javac] return block != Blocks.web && block.func_185904_a() != Material.leaves ? (block == Blocks.wool ? 5.0F : super.getStrVsBlock(stack, block)) : 15.0F;
[ant:javac] ^
[ant:javac] D:\Dropbox\Dropbox\Mod\Mc\Pizza-mod\build\tmp\recompileMc\sources\net\minecraft\item\ItemSword.java:42: error: variable block is already defined in method getStrVsBlock(ItemStack,IBlockState)
[ant:javac] Block block = block.getBlock();
[ant:javac] ^
[ant:javac] D:\Dropbox\Dropbox\Mod\Mc\Pizza-mod\build\tmp\recompileMc\sources\net\minecraft\item\ItemSword.java:42: error: cannot find symbol
[ant:javac] Block block = block.getBlock();
[ant:javac] ^
[ant:javac] symbol: method getBlock()
[ant:javac] location: variable block of type Block
[ant:javac] D:\Dropbox\Dropbox\Mod\Mc\Pizza-mod\build\tmp\recompileMc\sources\net\minecraft\item\ItemSword.java:50: error: cannot find symbol
[ant:javac] Material material = block.func_185904_a();
[ant:javac] ^
[ant:javac] symbol: method func_185904_a()
[ant:javac] location: variable block of type Block
[ant:javac] Note: Some input files use or override a deprecated API.
[ant:javac] Note: Recompile with -Xlint:deprecation for details.
[ant:javac] Note: Some input files use unchecked or unsafe operations.
[ant:javac] Note: Recompile with -Xlint:unchecked for details.
[ant:javac] Note: Some messages have been simplified; recompile with -Xdiags:verbose to get full output
[ant:javac] 27 errors
[ant:javac] 1 warning
:recompileMc FAILED
:recompileMc (Thread[main,5,main]) completed. Took 18.499 secs.
FAILURE: Build failed with an exception.
* What went wrong:
Execution failed for task ':recompileMc'.
> Compile failed; see the compiler error output for details.
* Try:
Run with --debug option to get more log output.
* Exception is:
org.gradle.api.tasks.TaskExecutionException: Execution failed for task ':recompileMc'.
at org.gradle.api.internal.tasks.execution.ExecuteActionsTaskExecuter.executeActions(ExecuteActionsTaskExecuter.java:69)
at org.gradle.api.internal.tasks.execution.ExecuteActionsTaskExecuter.execute(ExecuteActionsTaskExecuter.java:46)
at org.gradle.api.internal.tasks.execution.PostExecutionAnalysisTaskExecuter.execute(PostExecutionAnalysisTaskExecuter.java:35)
at org.gradle.api.internal.tasks.execution.SkipUpToDateTaskExecuter.execute(SkipUpToDateTaskExecuter.java:64)
at org.gradle.api.internal.tasks.execution.ValidatingTaskExecuter.execute(ValidatingTaskExecuter.java:58)
at org.gradle.api.internal.tasks.execution.SkipEmptySourceFilesTaskExecuter.execute(SkipEmptySourceFilesTaskExecuter.java:52)
at org.gradle.api.internal.tasks.execution.SkipTaskWithNoActionsExecuter.execute(SkipTaskWithNoActionsExecuter.java:52)
at org.gradle.api.internal.tasks.execution.SkipOnlyIfTaskExecuter.execute(SkipOnlyIfTaskExecuter.java:53)
at org.gradle.api.internal.tasks.execution.ExecuteAtMostOnceTaskExecuter.execute(ExecuteAtMostOnceTaskExecuter.java:43)
at org.gradle.execution.taskgraph.DefaultTaskGraphExecuter$EventFiringTaskWorker.execute(DefaultTaskGraphExecuter.java:203)
at org.gradle.execution.taskgraph.DefaultTaskGraphExecuter$EventFiringTaskWorker.execute(DefaultTaskGraphExecuter.java:185)
at org.gradle.execution.taskgraph.AbstractTaskPlanExecutor$TaskExecutorWorker.processTask(AbstractTaskPlanExecutor.java:62)
at org.gradle.execution.taskgraph.AbstractTaskPlanExecutor$TaskExecutorWorker.run(AbstractTaskPlanExecutor.java:50)
at org.gradle.execution.taskgraph.DefaultTaskPlanExecutor.process(DefaultTaskPlanExecutor.java:25)
at org.gradle.execution.taskgraph.DefaultTaskGraphExecuter.execute(DefaultTaskGraphExecuter.java:110)
at org.gradle.execution.SelectedTaskExecutionAction.execute(SelectedTaskExecutionAction.java:37)
at org.gradle.execution.DefaultBuildExecuter.execute(DefaultBuildExecuter.java:37)
at org.gradle.execution.DefaultBuildExecuter.access$000(DefaultBuildExecuter.java:23)
at org.gradle.execution.DefaultBuildExecuter$1.proceed(DefaultBuildExecuter.java:43)
at org.gradle.execution.DryRunBuildExecutionAction.execute(DryRunBuildExecutionAction.java:32)
at org.gradle.execution.DefaultBuildExecuter.execute(DefaultBuildExecuter.java:37)
at org.gradle.execution.DefaultBuildExecuter.execute(DefaultBuildExecuter.java:30)
at org.gradle.initialization.DefaultGradleLauncher$4.run(DefaultGradleLauncher.java:155)
at org.gradle.internal.Factories$1.create(Factories.java:22)
at org.gradle.internal.progress.DefaultBuildOperationExecutor.run(DefaultBuildOperationExecutor.java:90)
at org.gradle.internal.progress.DefaultBuildOperationExecutor.run(DefaultBuildOperationExecutor.java:52)
at org.gradle.initialization.DefaultGradleLauncher.doBuildStages(DefaultGradleLauncher.java:152)
at org.gradle.initialization.DefaultGradleLauncher.access$200(DefaultGradleLauncher.java:33)
at org.gradle.initialization.DefaultGradleLauncher$1.create(DefaultGradleLauncher.java:100)
at org.gradle.initialization.DefaultGradleLauncher$1.create(DefaultGradleLauncher.java:94)
at org.gradle.internal.progress.DefaultBuildOperationExecutor.run(DefaultBuildOperationExecutor.java:90)
at org.gradle.internal.progress.DefaultBuildOperationExecutor.run(DefaultBuildOperationExecutor.java:62)
at org.gradle.initialization.DefaultGradleLauncher.doBuild(DefaultGradleLauncher.java:94)
at org.gradle.initialization.DefaultGradleLauncher.run(DefaultGradleLauncher.java:83)
at org.gradle.launcher.exec.InProcessBuildActionExecuter$DefaultBuildController.run(InProcessBuildActionExecuter.java:94)
at org.gradle.tooling.internal.provider.ExecuteBuildActionRunner.run(ExecuteBuildActionRunner.java:28)
at org.gradle.launcher.exec.ChainingBuildActionRunner.run(ChainingBuildActionRunner.java:35)
at org.gradle.launcher.exec.InProcessBuildActionExecuter.execute(InProcessBuildActionExecuter.java:43)
at org.gradle.launcher.exec.InProcessBuildActionExecuter.execute(InProcessBuildActionExecuter.java:28)
at org.gradle.launcher.exec.ContinuousBuildActionExecuter.execute(ContinuousBuildActionExecuter.java:77)
at org.gradle.launcher.exec.ContinuousBuildActionExecuter.execute(ContinuousBuildActionExecuter.java:47)
at org.gradle.launcher.exec.DaemonUsageSuggestingBuildActionExecuter.execute(DaemonUsageSuggestingBuildActionExecuter.java:51)
at org.gradle.launcher.exec.DaemonUsageSuggestingBuildActionExecuter.execute(DaemonUsageSuggestingBuildActionExecuter.java:28)
at org.gradle.launcher.cli.RunBuildAction.run(RunBuildAction.java:43)
at org.gradle.internal.Actions$RunnableActionAdapter.execute(Actions.java:170)
at org.gradle.launcher.cli.CommandLineActionFactory$ParseAndBuildAction.execute(CommandLineActionFactory.java:237)
at org.gradle.launcher.cli.CommandLineActionFactory$ParseAndBuildAction.execute(CommandLineActionFactory.java:210)
at org.gradle.launcher.cli.JavaRuntimeValidationAction.execute(JavaRuntimeValidationAction.java:35)
at org.gradle.launcher.cli.JavaRuntimeValidationAction.execute(JavaRuntimeValidationAction.java:24)
at org.gradle.launcher.cli.CommandLineActionFactory$WithLogging.execute(CommandLineActionFactory.java:206)
at org.gradle.launcher.cli.CommandLineActionFactory$WithLogging.execute(CommandLineActionFactory.java:169)
at org.gradle.launcher.cli.ExceptionReportingAction.execute(ExceptionReportingAction.java:33)
at org.gradle.launcher.cli.ExceptionReportingAction.execute(ExceptionReportingAction.java:22)
at org.gradle.launcher.Main.doAction(Main.java:33)
at org.gradle.launcher.bootstrap.EntryPoint.run(EntryPoint.java:45)
at org.gradle.launcher.bootstrap.ProcessBootstrap.runNoExit(ProcessBootstrap.java:54)
at org.gradle.launcher.bootstrap.ProcessBootstrap.run(ProcessBootstrap.java:35)
at org.gradle.launcher.GradleMain.main(GradleMain.java:23)
at org.gradle.wrapper.BootstrapMainStarter.start(BootstrapMainStarter.java:30)
at org.gradle.wrapper.WrapperExecutor.execute(WrapperExecutor.java:127)
at org.gradle.wrapper.GradleWrapperMain.main(GradleWrapperMain.java:61)
Caused by: : Compile failed; see the compiler error output for details.
at org.apache.tools.ant.taskdefs.Javac.compile(Javac.java:1174)
at org.apache.tools.ant.taskdefs.Javac.execute(Javac.java:930)
at org.apache.tools.ant.UnknownElement.execute(UnknownElement.java:292)
at org.apache.tools.ant.dispatch.DispatchUtils.execute(DispatchUtils.java:106)
at org.gradle.api.internal.project.ant.BasicAntBuilder.nodeCompleted(BasicAntBuilder.java:77)
at org.gradle.api.internal.project.ant.BasicAntBuilder.doInvokeMethod(BasicAntBuilder.java:92)
at net.minecraftforge.gradle.user.TaskRecompileMc.doStuff(TaskRecompileMc.java:93)
at org.gradle.internal.reflect.JavaMethod.invoke(JavaMethod.java:75)
at org.gradle.api.internal.project.taskfactory.AnnotationProcessingTaskFactory$StandardTaskAction.doExecute(AnnotationProcessingTaskFactory.java:226)
at org.gradle.api.internal.project.taskfactory.AnnotationProcessingTaskFactory$StandardTaskAction.execute(AnnotationProcessingTaskFactory.java:219)
at org.gradle.api.internal.project.taskfactory.AnnotationProcessingTaskFactory$StandardTaskAction.execute(AnnotationProcessingTaskFactory.java:208)
at org.gradle.api.internal.AbstractTask$TaskActionWrapper.execute(AbstractTask.java:585)
at org.gradle.api.internal.AbstractTask$TaskActionWrapper.execute(AbstractTask.java:568)
at org.gradle.api.internal.tasks.execution.ExecuteActionsTaskExecuter.executeAction(ExecuteActionsTaskExecuter.java:80)
at org.gradle.api.internal.tasks.execution.ExecuteActionsTaskExecuter.executeActions(ExecuteActionsTaskExecuter.java:61)
... 60 more
BUILD FAILED
Total time: 46.019 secs
Stopped 0 compiler daemon(s).
D:\Dropbox\Dropbox\Mod\Mc\Pizza-mod>
D:\Dropbox\Dropbox\Mod\Mc\Pizza-mod>
D:\Dropbox\Dropbox\Mod\Mc\Pizza-mod>
D:\Dropbox\Dropbox\Mod\Mc\Pizza-mod>
Sign up for free to join this conversation on GitHub. Already have an account? Sign in to comment