Skip to content

Instantly share code, notes, and snippets.

Created Jul 10, 2014
Embed
What would you like to do?
gradle stacktrace log for sftp authentication failure
:buildSrc:compileJava UP-TO-DATE
:buildSrc:compileGroovy UP-TO-DATE
:buildSrc:processResources UP-TO-DATE
:buildSrc:classes UP-TO-DATE
:buildSrc:jar UP-TO-DATE
:buildSrc:assemble UP-TO-DATE
:buildSrc:compileTestJava UP-TO-DATE
:buildSrc:compileTestGroovy UP-TO-DATE
:buildSrc:processTestResources UP-TO-DATE
:buildSrc:testClasses UP-TO-DATE
:buildSrc:test UP-TO-DATE
:buildSrc:check UP-TO-DATE
:buildSrc:build UP-TO-DATE
FAILURE: Build failed with an exception.
* Where:
Build file '/home/user/workspace/product2/build.gradle' line: 219
* What went wrong:
A problem occurred evaluating root project 'product2'.
> Could not resolve all dependencies for configuration ':testPrepare'.
> Could not resolve com.example:product1:20.1.4.0.1.
Required by:
example:product2:2.7-SNAPSHOT
> Could not connect to SFTP server at sftp://example.com:22
> Could not connect to SFTP server at sftp://example.com:22
* Try:
Run with --info or --debug option to get more log output.
* Exception is:
org.gradle.api.GradleScriptException: A problem occurred evaluating root project 'product2'.
at org.gradle.groovy.scripts.internal.DefaultScriptRunnerFactory$ScriptRunnerImpl.run(DefaultScriptRunnerFactory.java:54)
at org.gradle.configuration.DefaultScriptPluginFactory$ScriptPluginImpl.apply(DefaultScriptPluginFactory.java:187)
at org.gradle.configuration.project.BuildScriptProcessor.execute(BuildScriptProcessor.java:39)
at org.gradle.configuration.project.BuildScriptProcessor.execute(BuildScriptProcessor.java:26)
at org.gradle.configuration.project.ConfigureActionsProjectEvaluator.evaluate(ConfigureActionsProjectEvaluator.java:34)
at org.gradle.configuration.project.LifecycleProjectEvaluator.evaluate(LifecycleProjectEvaluator.java:55)
at org.gradle.api.internal.project.AbstractProject.evaluate(AbstractProject.java:470)
at org.gradle.api.internal.project.AbstractProject.evaluate(AbstractProject.java:79)
at org.gradle.configuration.DefaultBuildConfigurer.configure(DefaultBuildConfigurer.java:31)
at org.gradle.initialization.DefaultGradleLauncher.doBuildStages(DefaultGradleLauncher.java:128)
at org.gradle.initialization.DefaultGradleLauncher.doBuild(DefaultGradleLauncher.java:105)
at org.gradle.initialization.DefaultGradleLauncher.run(DefaultGradleLauncher.java:85)
at org.gradle.launcher.exec.InProcessBuildActionExecuter$DefaultBuildController.run(InProcessBuildActionExecuter.java:81)
at org.gradle.launcher.cli.ExecuteBuildAction.run(ExecuteBuildAction.java:33)
at org.gradle.launcher.cli.ExecuteBuildAction.run(ExecuteBuildAction.java:24)
at org.gradle.launcher.exec.InProcessBuildActionExecuter.execute(InProcessBuildActionExecuter.java:39)
at org.gradle.launcher.exec.InProcessBuildActionExecuter.execute(InProcessBuildActionExecuter.java:29)
at org.gradle.launcher.cli.RunBuildAction.run(RunBuildAction.java:50)
at org.gradle.internal.Actions$RunnableActionAdapter.execute(Actions.java:171)
at org.gradle.launcher.cli.CommandLineActionFactory$ParseAndBuildAction.execute(CommandLineActionFactory.java:237)
at org.gradle.launcher.cli.CommandLineActionFactory$ParseAndBuildAction.execute(CommandLineActionFactory.java:210)
at org.gradle.launcher.cli.JavaRuntimeValidationAction.execute(JavaRuntimeValidationAction.java:35)
at org.gradle.launcher.cli.JavaRuntimeValidationAction.execute(JavaRuntimeValidationAction.java:24)
at org.gradle.launcher.cli.CommandLineActionFactory$WithLogging.execute(CommandLineActionFactory.java:206)
at org.gradle.launcher.cli.CommandLineActionFactory$WithLogging.execute(CommandLineActionFactory.java:169)
at org.gradle.launcher.cli.ExceptionReportingAction.execute(ExceptionReportingAction.java:33)
at org.gradle.launcher.cli.ExceptionReportingAction.execute(ExceptionReportingAction.java:22)
at org.gradle.launcher.Main.doAction(Main.java:33)
at org.gradle.launcher.bootstrap.EntryPoint.run(EntryPoint.java:45)
at org.gradle.launcher.bootstrap.ProcessBootstrap.runNoExit(ProcessBootstrap.java:54)
at org.gradle.launcher.bootstrap.ProcessBootstrap.run(ProcessBootstrap.java:35)
at org.gradle.launcher.GradleMain.main(GradleMain.java:23)
at org.gradle.wrapper.BootstrapMainStarter.start(BootstrapMainStarter.java:30)
at org.gradle.wrapper.WrapperExecutor.execute(WrapperExecutor.java:127)
at org.gradle.wrapper.GradleWrapperMain.main(GradleWrapperMain.java:55)
Caused by: org.gradle.api.artifacts.ResolveException: Could not resolve all dependencies for configuration ':testPrepare'.
at org.gradle.api.internal.artifacts.ivyservice.DefaultLenientConfiguration.rethrowFailure(DefaultLenientConfiguration.java:52)
at org.gradle.api.internal.artifacts.ivyservice.DefaultResolvedConfiguration.rethrowFailure(DefaultResolvedConfiguration.java:36)
at org.gradle.api.internal.artifacts.ivyservice.SelfResolvingDependencyResolver$FilesAggregatingResolvedConfiguration.rethrowFailure(SelfResolvingDependencyResolver.java:110)
at org.gradle.api.internal.artifacts.ivyservice.ErrorHandlingArtifactDependencyResolver$ErrorHandlingResolvedConfiguration.rethrowFailure(ErrorHandlingArtifactDependencyResolver.java:180)
at org.gradle.api.internal.artifacts.configurations.DefaultConfiguration$ConfigurationFileCollection.getFiles(DefaultConfiguration.java:428)
at org.gradle.api.internal.artifacts.configurations.DefaultConfiguration.getFiles(DefaultConfiguration.java:202)
at org.gradle.api.internal.artifacts.configurations.DefaultConfiguration_Decorated.getFiles(Unknown Source)
at org.gradle.api.internal.BeanDynamicObject$MetaClassAdapter.getProperty(BeanDynamicObject.java:153)
at org.gradle.api.internal.BeanDynamicObject.getProperty(BeanDynamicObject.java:107)
at org.gradle.api.internal.CompositeDynamicObject.getProperty(CompositeDynamicObject.java:78)
at org.gradle.api.internal.artifacts.configurations.DefaultConfiguration_Decorated.getProperty(Unknown Source)
at build_7f607fegn17unvbje93i1sb60h$_run_closure15.doCall(/home/user/workspace/product2/build.gradle:219)
at org.gradle.api.internal.ClosureBackedAction.execute(ClosureBackedAction.java:59)
at org.gradle.util.ConfigureUtil.configure(ConfigureUtil.java:130)
at org.gradle.util.ConfigureUtil.configure(ConfigureUtil.java:110)
at org.gradle.api.internal.AbstractTask.configure(AbstractTask.java:473)
at org.gradle.api.internal.project.AbstractProject.task(AbstractProject.java:840)
at org.gradle.api.internal.BeanDynamicObject$MetaClassAdapter.invokeMethod(BeanDynamicObject.java:225)
at org.gradle.api.internal.BeanDynamicObject.invokeMethod(BeanDynamicObject.java:129)
at org.gradle.api.internal.CompositeDynamicObject.invokeMethod(CompositeDynamicObject.java:147)
at org.gradle.groovy.scripts.BasicScript.methodMissing(BasicScript.java:79)
at build_7f607fegn17unvbje93i1sb60h.run(/home/user/workspace/product2/build.gradle:218)
at org.gradle.groovy.scripts.internal.DefaultScriptRunnerFactory$ScriptRunnerImpl.run(DefaultScriptRunnerFactory.java:52)
... 34 more
Caused by: org.gradle.api.internal.artifacts.ivyservice.ModuleVersionResolveException: Could not resolve com.example:product1:20.1.4.0.1.
Required by:
example:product2:2.7-SNAPSHOT
at org.gradle.api.internal.artifacts.ivyservice.ivyresolve.RepositoryChainDependencyResolver.resolve(RepositoryChainDependencyResolver.java:77)
at org.gradle.api.internal.artifacts.ivyservice.clientmodule.ClientModuleResolver.resolve(ClientModuleResolver.java:45)
at org.gradle.api.internal.artifacts.ivyservice.projectmodule.ProjectDependencyResolver.resolve(ProjectDependencyResolver.java:49)
at org.gradle.api.internal.artifacts.ivyservice.ivyresolve.LazyDependencyToModuleResolver$AbstractVersionResolveResult.resolve(LazyDependencyToModuleResolver.java:69)
at org.gradle.api.internal.artifacts.ivyservice.resolveengine.graph.DependencyGraphBuilder$ModuleVersionResolveState.resolve(DependencyGraphBuilder.java:543)
at org.gradle.api.internal.artifacts.ivyservice.resolveengine.graph.DependencyGraphBuilder$ModuleVersionResolveState.getMetaData(DependencyGraphBuilder.java:554)
at org.gradle.api.internal.artifacts.ivyservice.resolveengine.graph.DependencyGraphBuilder$DependencyEdge.calculateTargetConfigurations(DependencyGraphBuilder.java:255)
at org.gradle.api.internal.artifacts.ivyservice.resolveengine.graph.DependencyGraphBuilder$DependencyEdge.attachToTargetConfigurations(DependencyGraphBuilder.java:229)
at org.gradle.api.internal.artifacts.ivyservice.resolveengine.graph.DependencyGraphBuilder.traverseGraph(DependencyGraphBuilder.java:142)
at org.gradle.api.internal.artifacts.ivyservice.resolveengine.graph.DependencyGraphBuilder.resolveDependencyGraph(DependencyGraphBuilder.java:82)
at org.gradle.api.internal.artifacts.ivyservice.resolveengine.graph.DependencyGraphBuilder.resolve(DependencyGraphBuilder.java:74)
at org.gradle.api.internal.artifacts.ivyservice.resolveengine.DefaultDependencyResolver$1.execute(DefaultDependencyResolver.java:120)
at org.gradle.api.internal.artifacts.ivyservice.resolveengine.DefaultDependencyResolver$1.execute(DefaultDependencyResolver.java:86)
at org.gradle.internal.Transformers$3.transform(Transformers.java:131)
at org.gradle.api.internal.artifacts.ivyservice.DefaultIvyContextManager.withIvy(DefaultIvyContextManager.java:61)
at org.gradle.api.internal.artifacts.ivyservice.DefaultIvyContextManager.withIvy(DefaultIvyContextManager.java:39)
at org.gradle.api.internal.artifacts.ivyservice.resolveengine.DefaultDependencyResolver.resolve(DefaultDependencyResolver.java:86)
at org.gradle.api.internal.artifacts.ivyservice.CacheLockingArtifactDependencyResolver$1.run(CacheLockingArtifactDependencyResolver.java:42)
at org.gradle.internal.Factories$1.create(Factories.java:22)
at org.gradle.cache.internal.DefaultCacheAccess.useCache(DefaultCacheAccess.java:187)
at org.gradle.cache.internal.DefaultCacheAccess.useCache(DefaultCacheAccess.java:175)
at org.gradle.cache.internal.DefaultPersistentDirectoryStore.useCache(DefaultPersistentDirectoryStore.java:106)
at org.gradle.cache.internal.DefaultCacheFactory$ReferenceTrackingCache.useCache(DefaultCacheFactory.java:187)
at org.gradle.api.internal.artifacts.ivyservice.DefaultCacheLockingManager.useCache(DefaultCacheLockingManager.java:63)
at org.gradle.api.internal.artifacts.ivyservice.CacheLockingArtifactDependencyResolver.resolve(CacheLockingArtifactDependencyResolver.java:40)
at org.gradle.api.internal.artifacts.ivyservice.SelfResolvingDependencyResolver.resolve(SelfResolvingDependencyResolver.java:45)
at org.gradle.api.internal.artifacts.ivyservice.ShortcircuitEmptyConfigsArtifactDependencyResolver.resolve(ShortcircuitEmptyConfigsArtifactDependencyResolver.java:55)
at org.gradle.api.internal.artifacts.ivyservice.ErrorHandlingArtifactDependencyResolver.resolve(ErrorHandlingArtifactDependencyResolver.java:47)
at org.gradle.api.internal.artifacts.ivyservice.DefaultConfigurationResolver.resolve(DefaultConfigurationResolver.java:46)
at org.gradle.api.internal.artifacts.configurations.DefaultConfiguration.resolveNow(DefaultConfiguration.java:240)
at org.gradle.api.internal.artifacts.configurations.DefaultConfiguration.getResolvedConfiguration(DefaultConfiguration.java:230)
at org.gradle.api.internal.artifacts.configurations.DefaultConfiguration_Decorated.getResolvedConfiguration(Unknown Source)
at org.gradle.api.internal.artifacts.configurations.DefaultConfiguration$ConfigurationFileCollection.getFiles(DefaultConfiguration.java:426)
... 52 more
Caused by: org.gradle.internal.resource.transport.sftp.SftpException: Could not connect to SFTP server at sftp://example.com:22
at org.gradle.internal.resource.transport.sftp.SftpClientFactory$SftpClientCreator.createNewClient(SftpClientFactory.java:71)
at org.gradle.internal.resource.transport.sftp.SftpClientFactory.acquireClient(SftpClientFactory.java:45)
at org.gradle.internal.resource.transport.sftp.SftpClientFactory.createSftpClient(SftpClientFactory.java:40)
at org.gradle.internal.resource.transport.sftp.SftpResourceAccessor.getMetaData(SftpResourceAccessor.java:42)
at org.gradle.internal.resource.transfer.ProgressLoggingExternalResourceAccessor.getMetaData(ProgressLoggingExternalResourceAccessor.java:54)
at org.gradle.internal.resource.transfer.DefaultCacheAwareExternalResourceAccessor.getResource(DefaultCacheAwareExternalResourceAccessor.java:81)
at org.gradle.api.internal.artifacts.repositories.resolver.DefaultExternalResourceArtifactResolver.downloadStaticResource(DefaultExternalResourceArtifactResolver.java:91)
at org.gradle.api.internal.artifacts.repositories.resolver.DefaultExternalResourceArtifactResolver.resolveMetaDataArtifact(DefaultExternalResourceArtifactResolver.java:57)
at org.gradle.api.internal.artifacts.repositories.resolver.ExternalResourceResolver.parseMetaDataFromArtifact(ExternalResourceResolver.java:164)
at org.gradle.api.internal.artifacts.repositories.resolver.ExternalResourceResolver.resolveStaticDependency(ExternalResourceResolver.java:144)
at org.gradle.api.internal.artifacts.repositories.resolver.ExternalResourceResolver.doResolveComponentMetaData(ExternalResourceResolver.java:140)
at org.gradle.api.internal.artifacts.repositories.resolver.ExternalResourceResolver$RemoteRepositoryAccess.resolveComponentMetaData(ExternalResourceResolver.java:396)
at org.gradle.api.internal.artifacts.ivyservice.ivyresolve.CacheLockReleasingModuleComponentsRepository$LockReleasingRepositoryAccess$2.run(CacheLockReleasingModuleComponentsRepository.java:63)
at org.gradle.internal.Factories$1.create(Factories.java:22)
at org.gradle.cache.internal.DefaultCacheAccess.longRunningOperation(DefaultCacheAccess.java:237)
at org.gradle.cache.internal.DefaultCacheAccess.longRunningOperation(DefaultCacheAccess.java:308)
at org.gradle.cache.internal.DefaultPersistentDirectoryStore.longRunningOperation(DefaultPersistentDirectoryStore.java:114)
at org.gradle.cache.internal.DefaultCacheFactory$ReferenceTrackingCache.longRunningOperation(DefaultCacheFactory.java:179)
at org.gradle.api.internal.artifacts.ivyservice.DefaultCacheLockingManager.longRunningOperation(DefaultCacheLockingManager.java:55)
at org.gradle.api.internal.artifacts.ivyservice.ivyresolve.CacheLockReleasingModuleComponentsRepository$LockReleasingRepositoryAccess.resolveComponentMetaData(CacheLockReleasingModuleComponentsRepository.java:61)
at org.gradle.api.internal.artifacts.ivyservice.ivyresolve.CachingModuleComponentRepository$ResolveAndCacheRepositoryAccess.resolveComponentMetaData(CachingModuleComponentRepository.java:282)
at org.gradle.api.internal.artifacts.ivyservice.ivyresolve.BaseModuleComponentRepositoryAccess.resolveComponentMetaData(BaseModuleComponentRepositoryAccess.java:37)
at org.gradle.api.internal.artifacts.ivyservice.ivyresolve.memcache.InMemoryCachedModuleComponentRepository$CachedAccess.resolveComponentMetaData(InMemoryCachedModuleComponentRepository.java:67)
at org.gradle.api.internal.artifacts.ivyservice.ivyresolve.RepositoryChainDependencyResolver$StaticVersionRepositoryResolveState.process(RepositoryChainDependencyResolver.java:205)
at org.gradle.api.internal.artifacts.ivyservice.ivyresolve.RepositoryChainDependencyResolver$RepositoryResolveState.resolve(RepositoryChainDependencyResolver.java:180)
at org.gradle.api.internal.artifacts.ivyservice.ivyresolve.RepositoryChainDependencyResolver.findLatestModule(RepositoryChainDependencyResolver.java:121)
at org.gradle.api.internal.artifacts.ivyservice.ivyresolve.RepositoryChainDependencyResolver.findLatestModule(RepositoryChainDependencyResolver.java:97)
at org.gradle.api.internal.artifacts.ivyservice.ivyresolve.RepositoryChainDependencyResolver.resolve(RepositoryChainDependencyResolver.java:66)
... 84 more
Caused by: com.jcraft.jsch.JSchException: Auth cancel
at com.jcraft.jsch.Session.connect(Session.java:511)
at com.jcraft.jsch.Session.connect(Session.java:183)
at org.gradle.internal.resource.transport.sftp.SftpClientFactory$SftpClientCreator.createNewClient(SftpClientFactory.java:63)
... 111 more
BUILD FAILED
Total time: 12.714 secs
Sign up for free to join this conversation on GitHub. Already have an account? Sign in to comment