Skip to content

Embed URL

HTTPS clone URL

Subversion checkout URL

You can clone with
or
.
Download ZIP
/tmp/yaourt-tmp-nuklea/aur-qutim-stable/src/qutim-0.3.1/build/CMakeFiles/CMakeError.log
Determining if the Q_WS_WIN exist failed with the following output:
Change Dir: /tmp/yaourt-tmp-nuklea/aur-qutim-stable/src/qutim-0.3.1/build/CMakeFiles/CMakeTmp
Run Build Command:/usr/bin/make "cmTryCompileExec1493332302/fast"
/usr/bin/make -f CMakeFiles/cmTryCompileExec1493332302.dir/build.make CMakeFiles/cmTryCompileExec1493332302.dir/build
make[1]: Entering directory '/tmp/yaourt-tmp-nuklea/aur-qutim-stable/src/qutim-0.3.1/build/CMakeFiles/CMakeTmp'
/usr/bin/cmake -E cmake_progress_report /tmp/yaourt-tmp-nuklea/aur-qutim-stable/src/qutim-0.3.1/build/CMakeFiles/CMakeTmp/CMakeFiles 1
Building CXX object CMakeFiles/cmTryCompileExec1493332302.dir/CheckSymbolExists.cxx.o
/usr/bin/c++ -march=x86-64 -mtune=generic -O2 -pipe -fstack-protector --param=ssp-buffer-size=4 -I/usr/include/qt4 -o CMakeFiles/cmTryCompileExec1493332302.dir/CheckSymbolExists.cxx.o -c /tmp/yaourt-tmp-nuklea/aur-qutim-stable/src/qutim-0.3.1/build/CMakeFiles/CMakeTmp/CheckSymbolExists.cxx
/tmp/yaourt-tmp-nuklea/aur-qutim-stable/src/qutim-0.3.1/build/CMakeFiles/CMakeTmp/CheckSymbolExists.cxx: In function 'int main(int, char**)':
/tmp/yaourt-tmp-nuklea/aur-qutim-stable/src/qutim-0.3.1/build/CMakeFiles/CMakeTmp/CheckSymbolExists.cxx:8:19: error: 'Q_WS_WIN' was not declared in this scope
return ((int*)(&Q_WS_WIN))[argc];
^
CMakeFiles/cmTryCompileExec1493332302.dir/build.make:60: recipe for target 'CMakeFiles/cmTryCompileExec1493332302.dir/CheckSymbolExists.cxx.o' failed
make[1]: Leaving directory '/tmp/yaourt-tmp-nuklea/aur-qutim-stable/src/qutim-0.3.1/build/CMakeFiles/CMakeTmp'
make[1]: *** [CMakeFiles/cmTryCompileExec1493332302.dir/CheckSymbolExists.cxx.o] Error 1
Makefile:117: recipe for target 'cmTryCompileExec1493332302/fast' failed
make: *** [cmTryCompileExec1493332302/fast] Error 2
File /tmp/yaourt-tmp-nuklea/aur-qutim-stable/src/qutim-0.3.1/build/CMakeFiles/CMakeTmp/CheckSymbolExists.cxx:
/* */
#include <QtCore/qglobal.h>
int main(int argc, char** argv)
{
(void)argv;
#ifndef Q_WS_WIN
return ((int*)(&Q_WS_WIN))[argc];
#else
(void)argc;
return 0;
#endif
}
Determining if the Q_WS_QWS exist failed with the following output:
Change Dir: /tmp/yaourt-tmp-nuklea/aur-qutim-stable/src/qutim-0.3.1/build/CMakeFiles/CMakeTmp
Run Build Command:/usr/bin/make "cmTryCompileExec1028783722/fast"
/usr/bin/make -f CMakeFiles/cmTryCompileExec1028783722.dir/build.make CMakeFiles/cmTryCompileExec1028783722.dir/build
make[1]: Entering directory '/tmp/yaourt-tmp-nuklea/aur-qutim-stable/src/qutim-0.3.1/build/CMakeFiles/CMakeTmp'
/usr/bin/cmake -E cmake_progress_report /tmp/yaourt-tmp-nuklea/aur-qutim-stable/src/qutim-0.3.1/build/CMakeFiles/CMakeTmp/CMakeFiles 1
Building CXX object CMakeFiles/cmTryCompileExec1028783722.dir/CheckSymbolExists.cxx.o
/usr/bin/c++ -march=x86-64 -mtune=generic -O2 -pipe -fstack-protector --param=ssp-buffer-size=4 -I/usr/include/qt4 -o CMakeFiles/cmTryCompileExec1028783722.dir/CheckSymbolExists.cxx.o -c /tmp/yaourt-tmp-nuklea/aur-qutim-stable/src/qutim-0.3.1/build/CMakeFiles/CMakeTmp/CheckSymbolExists.cxx
/tmp/yaourt-tmp-nuklea/aur-qutim-stable/src/qutim-0.3.1/build/CMakeFiles/CMakeTmp/CheckSymbolExists.cxx: In function 'int main(int, char**)':
/tmp/yaourt-tmp-nuklea/aur-qutim-stable/src/qutim-0.3.1/build/CMakeFiles/CMakeTmp/CheckSymbolExists.cxx:8:19: error: 'Q_WS_QWS' was not declared in this scope
return ((int*)(&Q_WS_QWS))[argc];
^
CMakeFiles/cmTryCompileExec1028783722.dir/build.make:60: recipe for target 'CMakeFiles/cmTryCompileExec1028783722.dir/CheckSymbolExists.cxx.o' failed
make[1]: *** [CMakeFiles/cmTryCompileExec1028783722.dir/CheckSymbolExists.cxx.o] Error 1
make[1]: Leaving directory '/tmp/yaourt-tmp-nuklea/aur-qutim-stable/src/qutim-0.3.1/build/CMakeFiles/CMakeTmp'
Makefile:117: recipe for target 'cmTryCompileExec1028783722/fast' failed
make: *** [cmTryCompileExec1028783722/fast] Error 2
File /tmp/yaourt-tmp-nuklea/aur-qutim-stable/src/qutim-0.3.1/build/CMakeFiles/CMakeTmp/CheckSymbolExists.cxx:
/* */
#include <QtCore/qglobal.h>
int main(int argc, char** argv)
{
(void)argv;
#ifndef Q_WS_QWS
return ((int*)(&Q_WS_QWS))[argc];
#else
(void)argc;
return 0;
#endif
}
Determining if the Q_WS_MAC exist failed with the following output:
Change Dir: /tmp/yaourt-tmp-nuklea/aur-qutim-stable/src/qutim-0.3.1/build/CMakeFiles/CMakeTmp
Run Build Command:/usr/bin/make "cmTryCompileExec180162359/fast"
/usr/bin/make -f CMakeFiles/cmTryCompileExec180162359.dir/build.make CMakeFiles/cmTryCompileExec180162359.dir/build
make[1]: Entering directory '/tmp/yaourt-tmp-nuklea/aur-qutim-stable/src/qutim-0.3.1/build/CMakeFiles/CMakeTmp'
/usr/bin/cmake -E cmake_progress_report /tmp/yaourt-tmp-nuklea/aur-qutim-stable/src/qutim-0.3.1/build/CMakeFiles/CMakeTmp/CMakeFiles 1
Building CXX object CMakeFiles/cmTryCompileExec180162359.dir/CheckSymbolExists.cxx.o
/usr/bin/c++ -march=x86-64 -mtune=generic -O2 -pipe -fstack-protector --param=ssp-buffer-size=4 -I/usr/include/qt4 -o CMakeFiles/cmTryCompileExec180162359.dir/CheckSymbolExists.cxx.o -c /tmp/yaourt-tmp-nuklea/aur-qutim-stable/src/qutim-0.3.1/build/CMakeFiles/CMakeTmp/CheckSymbolExists.cxx
/tmp/yaourt-tmp-nuklea/aur-qutim-stable/src/qutim-0.3.1/build/CMakeFiles/CMakeTmp/CheckSymbolExists.cxx: In function 'int main(int, char**)':
/tmp/yaourt-tmp-nuklea/aur-qutim-stable/src/qutim-0.3.1/build/CMakeFiles/CMakeTmp/CheckSymbolExists.cxx:8:19: error: 'Q_WS_MAC' was not declared in this scope
return ((int*)(&Q_WS_MAC))[argc];
^
CMakeFiles/cmTryCompileExec180162359.dir/build.make:60: recipe for target 'CMakeFiles/cmTryCompileExec180162359.dir/CheckSymbolExists.cxx.o' failed
make[1]: Leaving directory '/tmp/yaourt-tmp-nuklea/aur-qutim-stable/src/qutim-0.3.1/build/CMakeFiles/CMakeTmp'
make[1]: *** [CMakeFiles/cmTryCompileExec180162359.dir/CheckSymbolExists.cxx.o] Error 1
Makefile:117: recipe for target 'cmTryCompileExec180162359/fast' failed
make: *** [cmTryCompileExec180162359/fast] Error 2
File /tmp/yaourt-tmp-nuklea/aur-qutim-stable/src/qutim-0.3.1/build/CMakeFiles/CMakeTmp/CheckSymbolExists.cxx:
/* */
#include <QtCore/qglobal.h>
int main(int argc, char** argv)
{
(void)argv;
#ifndef Q_WS_MAC
return ((int*)(&Q_WS_MAC))[argc];
#else
(void)argc;
return 0;
#endif
}
Determining if the pthread_create exist failed with the following output:
Change Dir: /tmp/yaourt-tmp-nuklea/aur-qutim-stable/src/qutim-0.3.1/build/CMakeFiles/CMakeTmp
Run Build Command:/usr/bin/make "cmTryCompileExec1775770661/fast"
/usr/bin/make -f CMakeFiles/cmTryCompileExec1775770661.dir/build.make CMakeFiles/cmTryCompileExec1775770661.dir/build
make[1]: Entering directory '/tmp/yaourt-tmp-nuklea/aur-qutim-stable/src/qutim-0.3.1/build/CMakeFiles/CMakeTmp'
/usr/bin/cmake -E cmake_progress_report /tmp/yaourt-tmp-nuklea/aur-qutim-stable/src/qutim-0.3.1/build/CMakeFiles/CMakeTmp/CMakeFiles 1
Building C object CMakeFiles/cmTryCompileExec1775770661.dir/CheckSymbolExists.c.o
/usr/bin/cc -march=x86-64 -mtune=generic -O2 -pipe -fstack-protector --param=ssp-buffer-size=4 -o CMakeFiles/cmTryCompileExec1775770661.dir/CheckSymbolExists.c.o -c /tmp/yaourt-tmp-nuklea/aur-qutim-stable/src/qutim-0.3.1/build/CMakeFiles/CMakeTmp/CheckSymbolExists.c
Linking C executable cmTryCompileExec1775770661
/usr/bin/cmake -E cmake_link_script CMakeFiles/cmTryCompileExec1775770661.dir/link.txt --verbose=1
/usr/bin/cc -march=x86-64 -mtune=generic -O2 -pipe -fstack-protector --param=ssp-buffer-size=4 CMakeFiles/cmTryCompileExec1775770661.dir/CheckSymbolExists.c.o -o cmTryCompileExec1775770661 -rdynamic
CMakeFiles/cmTryCompileExec1775770661.dir/CheckSymbolExists.c.o: In function `main':
CheckSymbolExists.c:(.text.startup+0x6): undefined reference to `pthread_create'
collect2: error: ld returned 1 exit status
CMakeFiles/cmTryCompileExec1775770661.dir/build.make:91: recipe for target 'cmTryCompileExec1775770661' failed
make[1]: Leaving directory '/tmp/yaourt-tmp-nuklea/aur-qutim-stable/src/qutim-0.3.1/build/CMakeFiles/CMakeTmp'
make[1]: *** [cmTryCompileExec1775770661] Error 1
Makefile:117: recipe for target 'cmTryCompileExec1775770661/fast' failed
make: *** [cmTryCompileExec1775770661/fast] Error 2
File /tmp/yaourt-tmp-nuklea/aur-qutim-stable/src/qutim-0.3.1/build/CMakeFiles/CMakeTmp/CheckSymbolExists.c:
/* */
#include <pthread.h>
int main(int argc, char** argv)
{
(void)argv;
#ifndef pthread_create
return ((int*)(&pthread_create))[argc];
#else
(void)argc;
return 0;
#endif
}
Determining if the function pthread_create exists in the pthreads failed with the following output:
Change Dir: /tmp/yaourt-tmp-nuklea/aur-qutim-stable/src/qutim-0.3.1/build/CMakeFiles/CMakeTmp
Run Build Command:/usr/bin/make "cmTryCompileExec1945618027/fast"
/usr/bin/make -f CMakeFiles/cmTryCompileExec1945618027.dir/build.make CMakeFiles/cmTryCompileExec1945618027.dir/build
make[1]: Entering directory '/tmp/yaourt-tmp-nuklea/aur-qutim-stable/src/qutim-0.3.1/build/CMakeFiles/CMakeTmp'
/usr/bin/cmake -E cmake_progress_report /tmp/yaourt-tmp-nuklea/aur-qutim-stable/src/qutim-0.3.1/build/CMakeFiles/CMakeTmp/CMakeFiles 1
Building C object CMakeFiles/cmTryCompileExec1945618027.dir/CheckFunctionExists.c.o
/usr/bin/cc -march=x86-64 -mtune=generic -O2 -pipe -fstack-protector --param=ssp-buffer-size=4 -DCHECK_FUNCTION_EXISTS=pthread_create -o CMakeFiles/cmTryCompileExec1945618027.dir/CheckFunctionExists.c.o -c /usr/share/cmake-2.8/Modules/CheckFunctionExists.c
Linking C executable cmTryCompileExec1945618027
/usr/bin/cmake -E cmake_link_script CMakeFiles/cmTryCompileExec1945618027.dir/link.txt --verbose=1
/usr/bin/cc -march=x86-64 -mtune=generic -O2 -pipe -fstack-protector --param=ssp-buffer-size=4 -DCHECK_FUNCTION_EXISTS=pthread_create CMakeFiles/cmTryCompileExec1945618027.dir/CheckFunctionExists.c.o -o cmTryCompileExec1945618027 -rdynamic -lpthreads
/usr/bin/ld: cannot find -lpthreads
collect2: error: ld returned 1 exit status
CMakeFiles/cmTryCompileExec1945618027.dir/build.make:91: recipe for target 'cmTryCompileExec1945618027' failed
make[1]: Leaving directory '/tmp/yaourt-tmp-nuklea/aur-qutim-stable/src/qutim-0.3.1/build/CMakeFiles/CMakeTmp'
make[1]: *** [cmTryCompileExec1945618027] Error 1
Makefile:117: recipe for target 'cmTryCompileExec1945618027/fast' failed
make: *** [cmTryCompileExec1945618027/fast] Error 2
Sign up for free to join this conversation on GitHub. Already have an account? Sign in to comment
Something went wrong with that request. Please try again.