Skip to content

Instantly share code, notes, and snippets.

/Normal log Secret

Created Mar 11, 2018
Embed
What would you like to do?
[INFO] -------< org.openhab.binding:org.openhab.binding.eurothermostat >-------
[INFO] Building EuroThermostat Binding 2.3.0-SNAPSHOT [1/109]
[INFO] ---------------------------[ eclipse-plugin ]---------------------------
[INFO]
[INFO] --- tycho-packaging-plugin:1.0.0:build-qualifier (default-build-qualifier) @ org.openhab.binding.eurothermostat ---
[INFO] The project's OSGi version is 2.3.0.201803111807
[INFO]
[INFO] --- tycho-packaging-plugin:1.0.0:validate-id (default-validate-id) @ org.openhab.binding.eurothermostat ---
[INFO]
[INFO] --- tycho-packaging-plugin:1.0.0:validate-version (default-validate-version) @ org.openhab.binding.eurothermostat ---
[INFO]
[INFO] --- directory-maven-plugin:0.2:highest-basedir (directories) @ org.openhab.binding.eurothermostat ---
[INFO] Highest basedir set to: D:\Users\user\openhab\openhab2-master\git\openhab2-addons
[INFO]
[INFO] --- maven-resources-plugin:2.4.3:resources (default-resources) @ org.openhab.binding.eurothermostat ---
[INFO] Using 'UTF-8' encoding to copy filtered resources.
[INFO] skip non existing resourceDirectory D:\Users\user\openhab\openhab2-master\git\openhab2-addons\addons\binding\org.openhab.binding.eurothermostat\src\main\resources
[INFO]
[INFO] --- tycho-compiler-plugin:1.0.0:compile (default-compile) @ org.openhab.binding.eurothermostat ---
[WARNING] Parameter 'useProjectSettings' is set to true, but preferences file 'D:\Users\user\openhab\openhab2-master\git\openhab2-addons\addons\binding\org.openhab.binding.eurothermostat\.settings\org.eclipse.jdt.core.prefs' could not b
e found!
[INFO] Nothing to compile - all classes are up to date
[INFO]
[INFO] --- maven-compiler-plugin:3.6.1:compile (default) @ org.openhab.binding.eurothermostat ---
[INFO] Changes detected - recompiling the module!
[INFO] Nothing to compile - all classes are up to date
[INFO]
[INFO] --- maven-scr-plugin:1.24.0:scr (generate-scr-scrdescriptor) @ org.openhab.binding.eurothermostat ---
[INFO] Writing 1 Service Component Descriptors to D:\Users\user\openhab\openhab2-master\git\openhab2-addons\addons\binding\org.openhab.binding.eurothermostat\target\classes\OSGI-INF\org.openhab.binding.eurothermostat.internal.EuroThermo
statHandlerFactory.xml
[INFO]
[INFO] --- maven-resources-plugin:2.4.3:testResources (default-testResources) @ org.openhab.binding.eurothermostat ---
[INFO] Using 'UTF-8' encoding to copy filtered resources.
[INFO] skip non existing resourceDirectory D:\Users\user\openhab\openhab2-master\git\openhab2-addons\addons\binding\org.openhab.binding.eurothermostat\src\test\resources
[INFO]
[INFO] --- target-platform-configuration:1.0.0:target-platform (default-target-platform) @ org.openhab.binding.eurothermostat ---
[INFO]
[INFO] --- tycho-packaging-plugin:1.0.0:package-plugin (default-package-plugin) @ org.openhab.binding.eurothermostat ---
[INFO]
[INFO] ---------< org.openhab.binding:org.openhab.binding.airquality >---------
[INFO] Building AirQuality Binding 2.3.0-SNAPSHOT [2/109]
[INFO] ---------------------------[ eclipse-plugin ]---------------------------
[INFO]
[...]
[INFO] ------------------------------------------------------------------------
[INFO] Reactor Summary:
[INFO]
[INFO] EuroThermostat Binding 2.3.0-SNAPSHOT .............. FAILURE [ 1.360 s]
[INFO] AirQuality Binding ................................. SUCCESS [ 22.917 s]
[INFO] AllPlay Binding .................................... SUCCESS [ 15.744 s]
[INFO] Amazon Dash Button Binding ......................... SUCCESS [ 13.979 s]
[INFO] Atlona Binding ..................................... SUCCESS [ 13.702 s]
[INFO] Autelis Binding .................................... SUCCESS [ 11.583 s]
[INFO] AVM FRITZ! Binding ................................. SUCCESS [ 14.716 s]
[INFO] AVM FRITZ! Binding Tests ........................... SUCCESS [ 15.665 s]
[INFO] BigAssFan Binding .................................. SUCCESS [ 13.838 s]
[INFO] BoschIndego Binding ................................ SUCCESS [ 9.755 s]
[INFO] Chromecast Binding ................................. SUCCESS [ 11.913 s]
[INFO] CM11A Binding ...................................... SUCCESS [ 14.104 s]
[INFO] CoolMasterNet Binding .............................. SUCCESS [ 11.225 s]
[INFO] D-Link Smart Home Binding .......................... SUCCESS [ 11.629 s]
[INFO] DSCAlarm Binding ................................... SUCCESS [ 15.902 s]
[INFO] Exec Binding ....................................... SUCCESS [ 10.274 s]
[INFO] openHAB I/O Add-Ons ................................ SUCCESS [ 0.184 s]
[INFO] Transport Feed bundle .............................. SUCCESS [ 3.523 s]
[INFO] Feed Binding ....................................... SUCCESS [ 9.597 s]
[INFO] Feed Binding Tests ................................. FAILURE [ 44.281 s]
[INFO] Feican Binding ..................................... SUCCESS [ 9.895 s]
[INFO] Folding Binding .................................... SUCCESS [ 10.854 s]
[INFO] Freebox Binding .................................... SUCCESS [ 14.945 s]
[INFO] Fronius Binding .................................... SUCCESS [ 12.105 s]
[INFO] Gardena Binding .................................... SUCCESS [ 13.613 s]
[INFO] HarmonyHub Binding ................................. SUCCESS [ 12.122 s]
[INFO] HDanywhere Binding ................................. SUCCESS [ 9.432 s]
[INFO] Hunter Douglas PowerView Binding ................... SUCCESS [ 9.854 s]
[INFO] Helios Binding ..................................... SUCCESS [ 12.509 s]
[INFO] Homematic Binding .................................. SUCCESS [ 22.068 s]
[INFO] GlobalCache Binding ................................ SUCCESS [ 12.555 s]
[INFO] iCloud Binding ..................................... SUCCESS [ 12.126 s]
[INFO] IPP Binding ........................................ SUCCESS [ 9.326 s]
[INFO] JeeLink Binding .................................... SUCCESS [ 11.976 s]
[INFO] Keba Binding ....................................... SUCCESS [ 11.619 s]
[INFO] Kodi Binding ....................................... SUCCESS [ 12.251 s]
[INFO] Kostal Binding ..................................... SUCCESS [ 9.143 s]
[INFO] LaMetric Time Binding .............................. SUCCESS [ 12.811 s]
[INFO] LG TV Serial Binding ............................... SUCCESS [ 9.119 s]
[INFO] LG webOS Binding ................................... SUCCESS [ 12.176 s]
[INFO] Loxone Binding ..................................... SUCCESS [ 18.816 s]
[INFO] Lutron Binding ..................................... SUCCESS [ 21.430 s]
[INFO] MAX! Binding ....................................... SUCCESS [ 19.027 s]
[INFO] MAX! Binding Tests ................................. SUCCESS [ 25.354 s]
[INFO] mcp23017 Binding ................................... SUCCESS [ 9.690 s]
[INFO] meteostick Binding ................................. SUCCESS [ 11.425 s]
[INFO] Miele Binding ...................................... SUCCESS [ 18.071 s]
[INFO] Xiaomi Mi Smart Home Binding ....................... SUCCESS [ 14.039 s]
[INFO] Milight Binding .................................... SUCCESS [ 13.946 s]
[INFO] Minecraft Binding .................................. SUCCESS [ 12.477 s]
[INFO] Netatmo Binding .................................... SUCCESS [ 13.078 s]
[INFO] Network Binding .................................... SUCCESS [ 12.351 s]
[INFO] network Binding Tests .............................. SUCCESS [ 16.606 s]
[INFO] Nest Binding ....................................... SUCCESS [ 14.265 s]
[INFO] Nest Binding Tests ................................. SUCCESS [ 14.924 s]
[INFO] Niko Home Control Binding .......................... SUCCESS [ 12.520 s]
[INFO] Oceanic Binding .................................... SUCCESS [ 9.872 s]
[INFO] OneBusAway Binding ................................. SUCCESS [ 9.361 s]
[INFO] OneWireGPIO Binding ................................ SUCCESS [ 8.178 s]
[INFO] Onkyo Binding ...................................... SUCCESS [ 13.186 s]
[INFO] OpenSprinkler Binding .............................. SUCCESS [ 11.062 s]
[INFO] Orvibo Binding ..................................... SUCCESS [ 9.173 s]
[INFO] Pentair Binding .................................... SUCCESS [ 11.584 s]
[INFO] PioneerAvr Binding ................................. SUCCESS [ 12.388 s]
[INFO] Plugwise Binding ................................... SUCCESS [ 19.642 s]
[INFO] Pulseaudio Binding ................................. SUCCESS [ 14.703 s]
[INFO] RegoHeatPump Binding ............................... SUCCESS [ 15.174 s]
[INFO] RME Binding ........................................ SUCCESS [ 13.191 s]
[INFO] Rfxcom Binding ..................................... SUCCESS [ 22.132 s]
[INFO] Rfxcom Binding Tests ............................... SUCCESS [ 19.569 s]
[INFO] RotelRa1x Binding .................................. SUCCESS [ 11.829 s]
[INFO] Russound Binding ................................... SUCCESS [ 20.321 s]
[INFO] SamsungTV Binding .................................. SUCCESS [ 15.427 s]
[INFO] Seneye Binding ..................................... SUCCESS [ 11.877 s]
[INFO] senseBox Binding ................................... SUCCESS [ 12.786 s]
[INFO] Silvercrest Wifi Socket Binding .................... SUCCESS [ 13.291 s]
[INFO] SleepIQ Binding .................................... SUCCESS [ 11.058 s]
[INFO] SMA EnergyMeter Binding ............................ SUCCESS [ 10.906 s]
[INFO] SqueezeBox Binding ................................. SUCCESS [ 16.931 s]
[INFO] Synop Analyzer Binding ............................. SUCCESS [ 12.035 s]
[INFO] Systeminfo Binding ................................. SUCCESS [ 14.464 s]
[INFO] Systeminfo Binding Test ............................ SUCCESS [01:14 min]
[INFO] Tankerkoenig Binding ............................... SUCCESS [ 10.036 s]
[INFO] Tellstick Binding .................................. SUCCESS [ 13.105 s]
[INFO] Tesla Binding ...................................... SUCCESS [ 13.427 s]
[INFO] Toon Binding ....................................... SUCCESS [ 10.358 s]
[INFO] TPLinkSmartHome Binding ............................ SUCCESS [ 14.079 s]
[INFO] TPLinkSmartHome Binding Tests ...................... SUCCESS [ 15.266 s]
[INFO] Somfy URTSI II binding ............................. SUCCESS [ 10.932 s]
[INFO] Vitotronic Binding ................................. SUCCESS [ 11.348 s]
[INFO] WiFiLED Binding .................................... SUCCESS [ 11.081 s]
[INFO] Windcentrale Binding ............................... SUCCESS [ 11.606 s]
[INFO] YamahaReceiver Binding ............................. SUCCESS [ 14.961 s]
[INFO] ZoneMinder Binding ................................. SUCCESS [ 12.196 s]
[INFO] ZWay Binding ....................................... SUCCESS [ 14.722 s]
[INFO] openHAB Cloud Connector ............................ SUCCESS [ 11.758 s]
[INFO] Hue Emulation Service .............................. SUCCESS [ 11.307 s]
[INFO] ImperiHome Integration Service ..................... SUCCESS [ 13.354 s]
[INFO] HomeKit Integration ................................ SUCCESS [ 11.502 s]
[INFO] openHAB UI Components .............................. SUCCESS [ 0.032 s]
[INFO] openHAB CometVisu Backend .......................... SUCCESS [ 22.838 s]
[INFO] PHP Support for the CometVisu Backend .............. SUCCESS [ 10.019 s]
[INFO] openHAB Voice Add-Ons .............................. SUCCESS [ 0.061 s]
[INFO] Mary TTS Integration ............................... SUCCESS [ 34.818 s]
[INFO] VoiceRSS TTS Integration ........................... SUCCESS [ 10.731 s]
[INFO] openHAB Features ................................... SUCCESS [ 0.089 s]
[INFO] openHAB Feature Addons External .................... SUCCESS [ 0.161 s]
[INFO] openHAB 2 Feature Addons ........................... SUCCESS [ 0.956 s]
[INFO] openHAB 2 Feature Verification 2.3.0-SNAPSHOT ...... SUCCESS [ 3.747 s]
[INFO] ------------------------------------------------------------------------
[INFO] BUILD FAILURE
[INFO] ------------------------------------------------------------------------
[INFO] Total time: 24:55 min
[INFO] Finished at: 2018-03-11T19:39:28+01:00
[INFO] ------------------------------------------------------------------------
[ERROR] Failed to execute goal org.eclipse.tycho:tycho-packaging-plugin:1.0.0:package-plugin (default-package-plugin) on project org.openhab.binding.eurothermostat: D:\Users\user\openhab\openhab2-master\git\openhab2-addons\addons\bindin
g\org.openhab.binding.eurothermostat\build.properties: bin.includes value(s) [NOTICE] do not match any files. -> [Help 1]
[ERROR] Failed to execute goal org.eclipse.tycho:tycho-surefire-plugin:1.0.0:test (default-test) on project org.openhab.binding.feed.test: There are test failures.
[ERROR]
[ERROR] Please refer to D:\Users\user\openhab\openhab2-master\git\openhab2-addons\addons\binding\org.openhab.binding.feed.test\target\surefire-reports for the individual test results.
[ERROR] -> [Help 2]
[ERROR]
[ERROR] To see the full stack trace of the errors, re-run Maven with the -e switch.
[ERROR] Re-run Maven using the -X switch to enable full debug logging.
[ERROR]
[ERROR] For more information about the errors and possible solutions, please read the following articles:
[ERROR] [Help 1] http://cwiki.apache.org/confluence/display/MAVEN/MojoExecutionException
[ERROR] [Help 2] http://cwiki.apache.org/confluence/display/MAVEN/MojoFailureException
[INFO] -------< org.openhab.binding:org.openhab.binding.eurothermostat >-------
[INFO] Building EuroThermostat Binding 2.3.0-SNAPSHOT [1/109]
[INFO] ---------------------------[ eclipse-plugin ]---------------------------
[DEBUG] Lifecycle default -> [validate, initialize, generate-sources, process-sources, generate-resources, process-resources, compile, process-classes, generate-test-sources, process-test-sources, generate-test-resources, process-test-resources, test-compile, process-test-classes, test, prepare-package, package, pre-integration-test, integration-test, post-integration-test, verify, install, deploy]
[DEBUG] Lifecycle clean -> [pre-clean, clean, post-clean]
[DEBUG] Lifecycle site -> [pre-site, site, post-site, site-deploy]
[DEBUG] Lifecycle default -> [validate, initialize, generate-sources, process-sources, generate-resources, process-resources, compile, process-classes, generate-test-sources, process-test-sources, generate-test-resources, process-test-resources, test-compile, process-test-classes, test, prepare-package, package, pre-integration-test, integration-test, post-integration-test, verify, install, deploy]
[DEBUG] Lifecycle clean -> [pre-clean, clean, post-clean]
[DEBUG] Lifecycle site -> [pre-site, site, post-site, site-deploy]
[DEBUG] Lifecycle default -> [validate, initialize, generate-sources, process-sources, generate-resources, process-resources, compile, process-classes, generate-test-sources, process-test-sources, generate-test-resources, process-test-resources, test-compile, process-test-classes, test, prepare-package, package, pre-integration-test, integration-test, post-integration-test, verify, install, deploy]
[DEBUG] Lifecycle clean -> [pre-clean, clean, post-clean]
[DEBUG] Lifecycle site -> [pre-site, site, post-site, site-deploy]
[DEBUG] Lifecycle default -> [validate, initialize, generate-sources, process-sources, generate-resources, process-resources, compile, process-classes, generate-test-sources, process-test-sources, generate-test-resources, process-test-resources, test-compile, process-test-classes, test, prepare-package, package, pre-integration-test, integration-test, post-integration-test, verify, install, deploy]
[DEBUG] Lifecycle clean -> [pre-clean, clean, post-clean]
[DEBUG] Lifecycle site -> [pre-site, site, post-site, site-deploy]
[DEBUG] Lifecycle default -> [validate, initialize, generate-sources, process-sources, generate-resources, process-resources, compile, process-classes, generate-test-sources, process-test-sources, generate-test-resources, process-test-resources, test-compile, process-test-classes, test, prepare-package, package, pre-integration-test, integration-test, post-integration-test, verify, install, deploy]
[DEBUG] Lifecycle clean -> [pre-clean, clean, post-clean]
[DEBUG] Lifecycle site -> [pre-site, site, post-site, site-deploy]
[DEBUG] Lifecycle default -> [validate, initialize, generate-sources, process-sources, generate-resources, process-resources, compile, process-classes, generate-test-sources, process-test-sources, generate-test-resources, process-test-resources, test-compile, process-test-classes, test, prepare-package, package, pre-integration-test, integration-test, post-integration-test, verify, install, deploy]
[DEBUG] Lifecycle clean -> [pre-clean, clean, post-clean]
[DEBUG] Lifecycle site -> [pre-site, site, post-site, site-deploy]
[DEBUG] Lifecycle default -> [validate, initialize, generate-sources, process-sources, generate-resources, process-resources, compile, process-classes, generate-test-sources, process-test-sources, generate-test-resources, process-test-resources, test-compile, process-test-classes, test, prepare-package, package, pre-integration-test, integration-test, post-integration-test, verify, install, deploy]
[DEBUG] Lifecycle clean -> [pre-clean, clean, post-clean]
[DEBUG] Lifecycle site -> [pre-site, site, post-site, site-deploy]
[DEBUG] Lifecycle default -> [validate, initialize, generate-sources, process-sources, generate-resources, process-resources, compile, process-classes, generate-test-sources, process-test-sources, generate-test-resources, process-test-resources, test-compile, process-test-classes, test, prepare-package, package, pre-integration-test, integration-test, post-integration-test, verify, install, deploy]
[DEBUG] Lifecycle clean -> [pre-clean, clean, post-clean]
[DEBUG] Lifecycle site -> [pre-site, site, post-site, site-deploy]
[DEBUG] Lifecycle default -> [validate, initialize, generate-sources, process-sources, generate-resources, process-resources, compile, process-classes, generate-test-sources, process-test-sources, generate-test-resources, process-test-resources, test-compile, process-test-classes, test, prepare-package, package, pre-integration-test, integration-test, post-integration-test, verify, install, deploy]
[DEBUG] Lifecycle clean -> [pre-clean, clean, post-clean]
[DEBUG] Lifecycle site -> [pre-site, site, post-site, site-deploy]
[DEBUG] Lifecycle default -> [validate, initialize, generate-sources, process-sources, generate-resources, process-resources, compile, process-classes, generate-test-sources, process-test-sources, generate-test-resources, process-test-resources, test-compile, process-test-classes, test, prepare-package, package, pre-integration-test, integration-test, post-integration-test, verify, install, deploy]
[DEBUG] Lifecycle clean -> [pre-clean, clean, post-clean]
[DEBUG] Lifecycle site -> [pre-site, site, post-site, site-deploy]
[DEBUG] === PROJECT BUILD PLAN ================================================
[DEBUG] Project: org.openhab.binding:org.openhab.binding.eurothermostat:2.3.0-SNAPSHOT
[DEBUG] Dependencies (collect): []
[DEBUG] Dependencies (resolve): [compile]
[DEBUG] Repositories (dependencies): [jcenter (https://jcenter.bintray.com/, default, releases), openhab-artifactory-release (https://openhab.jfrog.io/openhab/libs-release, default, releases), openhab-artifactory-snapshot (https://openhab.jfrog.io/openhab/libs-snapshot, default, snapshots), p2-smarthome-snapshot (https://openhab.jfrog.io/openhab/eclipse-smarthome-stable, p2, disabled), p2-smarthome-release (http://download.eclipse.org/smarthome/updates-release/0.9.0, p2, disabled), p2-openhab-deps-repo (https://dl.bintray.com/openhab/p2/openhab-deps-repo/1.0.22, p2, disabled), central (https://repo.maven.apache.org/maven2, default, releases)]
[DEBUG] Repositories (plugins) : [jcenter (https://jcenter.bintray.com/, default, releases), artifactory (https://openhab.jfrog.io/openhab/libs-release, default, releases), central (https://repo.maven.apache.org/maven2, default, releases)]
[DEBUG] -----------------------------------------------------------------------
[DEBUG] Goal: org.eclipse.tycho:tycho-packaging-plugin:1.0.0:build-qualifier (default-build-qualifier)
[DEBUG] Style: Regular
[DEBUG] Configuration: <?xml version="1.0" encoding="UTF-8"?>
<configuration>
<baseDir>${project.basedir}</baseDir>
<execution>${mojoExecution}</execution>
<forceContextQualifier>${forceContextQualifier}</forceContextQualifier>
<format default-value="yyyyMMddHHmm"/>
<packaging>${project.packaging}</packaging>
<project>${project}</project>
<session>${session}</session>
</configuration>
[DEBUG] -----------------------------------------------------------------------
[DEBUG] Goal: org.eclipse.tycho:tycho-packaging-plugin:1.0.0:validate-id (default-validate-id)
[DEBUG] Style: Regular
[DEBUG] Configuration: <?xml version="1.0" encoding="UTF-8"?>
<configuration>
<packaging>${project.packaging}</packaging>
<project>${project}</project>
</configuration>
[DEBUG] -----------------------------------------------------------------------
[DEBUG] Goal: org.eclipse.tycho:tycho-packaging-plugin:1.0.0:validate-version (default-validate-version)
[DEBUG] Style: Regular
[DEBUG] Configuration: <?xml version="1.0" encoding="UTF-8"?>
<configuration>
<packaging>${project.packaging}</packaging>
<project>${project}</project>
<strictVersions default-value="true">false</strictVersions>
</configuration>
[DEBUG] -----------------------------------------------------------------------
[DEBUG] Goal: org.commonjava.maven.plugins:directory-maven-plugin:0.2:highest-basedir (directories)
[DEBUG] Style: Regular
[DEBUG] Configuration: <?xml version="1.0" encoding="UTF-8"?>
<configuration>
<currentProject default-value="${project}"/>
<projects default-value="${reactorProjects}"/>
<property default-value="dirProperty">basedirRoot</property>
<quiet default-value="false"/>
<session default-value="${session}"/>
<systemProperty default-value="false"/>
</configuration>
[DEBUG] -----------------------------------------------------------------------
[DEBUG] Goal: org.apache.maven.plugins:maven-resources-plugin:2.4.3:resources (default-resources)
[DEBUG] Style: Regular
[DEBUG] Configuration: <?xml version="1.0" encoding="UTF-8"?>
<configuration>
<buildFilters default-value="${project.build.filters}"/>
<encoding default-value="${project.build.sourceEncoding}">${encoding}</encoding>
<escapeString default-value="${maven.resources.escapeString}"/>
<escapeWindowsPaths default-value="true">${maven.resources.escapeWindowsPaths}</escapeWindowsPaths>
<includeEmptyDirs default-value="false">${maven.resources.includeEmptyDirs}</includeEmptyDirs>
<outputDirectory default-value="${project.build.outputDirectory}"/>
<overwrite default-value="false">${maven.resources.overwrite}</overwrite>
<project default-value="${project}"/>
<resources default-value="${project.resources}"/>
<session default-value="${session}"/>
<useBuildFilters default-value="true"/>
<useDefaultDelimiters default-value="true"/>
</configuration>
[DEBUG] -----------------------------------------------------------------------
[DEBUG] Goal: org.eclipse.tycho:tycho-compiler-plugin:1.0.0:compile (default-compile)
[DEBUG] Style: Regular
[DEBUG] Configuration: <?xml version="1.0" encoding="UTF-8"?>
<configuration>
<basedir>${basedir}</basedir>
<buildDirectory>${project.build.directory}</buildDirectory>
<compilerArgs>
<arg>-warn:+nullAnnot(org.eclipse.jdt.annotation.Nullable|org.eclipse.jdt.annotation.NonNull|org.eclipse.jdt.annotation.NonNullByDefault),+null,+inheritNullAnnot,+nullAnnotConflict,+nullUncheckedConversion,+nullAnnotRedundant,+nullDereference</arg>
</compilerArgs>
<compilerId default-value="jdt">jdt</compilerId>
<compilerVersion>${maven.compiler.compilerVersion}</compilerVersion>
<copyResources default-value="true"/>
<debug default-value="true">${maven.compiler.debug}</debug>
<encoding>UTF-8</encoding>
<executable>${maven.compiler.executable}</executable>
<extraClasspathElements>
<extraClasspathElement>
<groupId>org.eclipse.jdt</groupId>
<artifactId>org.eclipse.jdt.annotation</artifactId>
<version>2.1.0</version>
</extraClasspathElement>
<extraClasspathElement>
<groupId>org.apache.felix</groupId>
<artifactId>org.apache.felix.scr.ds-annotations</artifactId>
<version>1.2.10</version>
</extraClasspathElement>
</extraClasspathElements>
<fork default-value="false"/>
<generatedSourcesDirectory default-value="${project.build.directory}/generated-sources/annotations"/>
<logDirectory default-value="${project.build.directory}/compile-logs"/>
<mavenCompilerEncoding>${maven.compiler.encoding}</mavenCompilerEncoding>
<maxmem>${maven.compiler.maxmem}</maxmem>
<meminitial>${maven.compiler.meminitial}</meminitial>
<optimize default-value="false">${maven.compiler.optimize}</optimize>
<outputFileName>${project.build.finalName}</outputFileName>
<project>${project}</project>
<requireJREPackageImports default-value="false"/>
<session>${session}</session>
<showDeprecation default-value="false">${maven.compiler.showDeprecation}</showDeprecation>
<showWarnings default-value="false">${maven.compiler.showWarnings}</showWarnings>
<source>1.8</source>
<staleMillis default-value="0">${lastModGranularityMs}</staleMillis>
<strictCompilerTarget default-value="false"/>
<target>1.8</target>
<useJDK default-value="SYSTEM"/>
<useProjectSettings default-value="true"/>
<verbose default-value="false">${maven.compiler.verbose}</verbose>
</configuration>
[DEBUG] -----------------------------------------------------------------------
[DEBUG] Goal: org.apache.maven.plugins:maven-compiler-plugin:3.6.1:compile (default)
[DEBUG] Style: Regular
[DEBUG] Configuration: <?xml version="1.0" encoding="UTF-8"?>
<configuration>
<basedir default-value="${basedir}"/>
<buildDirectory default-value="${project.build.directory}"/>
<compilePath default-value="${project.compileClasspathElements}"/>
<compileSourceRoots default-value="${project.compileSourceRoots}"/>
<compilerId default-value="javac">groovy-eclipse-compiler</compilerId>
<compilerReuseStrategy default-value="${reuseCreated}">${maven.compiler.compilerReuseStrategy}</compilerReuseStrategy>
<compilerVersion>${maven.compiler.compilerVersion}</compilerVersion>
<debug default-value="true">${maven.compiler.debug}</debug>
<debuglevel>${maven.compiler.debuglevel}</debuglevel>
<encoding default-value="${project.build.sourceEncoding}">${encoding}</encoding>
<executable>${maven.compiler.executable}</executable>
<failOnError default-value="true">${maven.compiler.failOnError}</failOnError>
<failOnWarning default-value="false">${maven.compiler.failOnWarning}</failOnWarning>
<forceJavacCompilerUse default-value="false">${maven.compiler.forceJavacCompilerUse}</forceJavacCompilerUse>
<fork default-value="false">${maven.compiler.fork}</fork>
<generatedSourcesDirectory default-value="${project.build.directory}/generated-sources/annotations"/>
<maxmem>${maven.compiler.maxmem}</maxmem>
<meminitial>${maven.compiler.meminitial}</meminitial>
<mojoExecution default-value="${mojoExecution}"/>
<optimize default-value="false">${maven.compiler.optimize}</optimize>
<outputDirectory default-value="${project.build.outputDirectory}"/>
<project default-value="${project}"/>
<projectArtifact default-value="${project.artifact}"/>
<release>${maven.compiler.release}</release>
<session default-value="${session}"/>
<showDeprecation default-value="false">${maven.compiler.showDeprecation}</showDeprecation>
<showWarnings default-value="false">${maven.compiler.showWarnings}</showWarnings>
<skipMain>${maven.main.skip}</skipMain>
<skipMultiThreadWarning default-value="false">${maven.compiler.skipMultiThreadWarning}</skipMultiThreadWarning>
<source default-value="1.5">${maven.compiler.source}</source>
<staleMillis default-value="0">${lastModGranularityMs}</staleMillis>
<target default-value="1.5">${maven.compiler.target}</target>
<useIncrementalCompilation default-value="true">${maven.compiler.useIncrementalCompilation}</useIncrementalCompilation>
<verbose default-value="false">${maven.compiler.verbose}</verbose>
</configuration>
[DEBUG] -----------------------------------------------------------------------
[DEBUG] Goal: org.apache.felix:maven-scr-plugin:1.24.0:scr (generate-scr-scrdescriptor)
[DEBUG] Style: Regular
[DEBUG] Configuration: <?xml version="1.0" encoding="UTF-8"?>
<configuration>
<generateAccessors default-value="true"/>
<outputDirectory>${project.build.outputDirectory}</outputDirectory>
<project>${project}</project>
<scanClasses default-value="false"/>
<skipVolatileCheck default-value="false"/>
<strictMode default-value="false"/>
<supportedProjectTypes>
<supportedProjectType>eclipse-plugin</supportedProjectType>
</supportedProjectTypes>
</configuration>
[DEBUG] -----------------------------------------------------------------------
[DEBUG] Goal: org.apache.maven.plugins:maven-resources-plugin:2.4.3:testResources (default-testResources)
[DEBUG] Style: Regular
[DEBUG] Configuration: <?xml version="1.0" encoding="UTF-8"?>
<configuration>
<buildFilters default-value="${project.build.filters}"/>
<encoding default-value="${project.build.sourceEncoding}">${encoding}</encoding>
<escapeString default-value="${maven.resources.escapeString}"/>
<escapeWindowsPaths default-value="true">${maven.resources.escapeWindowsPaths}</escapeWindowsPaths>
<includeEmptyDirs default-value="false">${maven.resources.includeEmptyDirs}</includeEmptyDirs>
<outputDirectory>${project.build.testOutputDirectory}</outputDirectory>
<overwrite default-value="false">${maven.resources.overwrite}</overwrite>
<project default-value="${project}"/>
<resources>${project.testResources}</resources>
<session default-value="${session}"/>
<useBuildFilters default-value="true"/>
<useDefaultDelimiters default-value="true"/>
</configuration>
[DEBUG] -----------------------------------------------------------------------
[DEBUG] Goal: org.eclipse.tycho:target-platform-configuration:1.0.0:target-platform (default-target-platform)
[DEBUG] Style: Regular
[DEBUG] Configuration: <?xml version="1.0" encoding="UTF-8"?>
<configuration>
<project>${project}</project>
</configuration>
[DEBUG] -----------------------------------------------------------------------
[DEBUG] Goal: org.eclipse.tycho:tycho-packaging-plugin:1.0.0:package-plugin (default-package-plugin)
[DEBUG] Style: Regular
[DEBUG] Configuration: <?xml version="1.0" encoding="UTF-8"?>
<configuration>
<buildDirectory>${project.build.directory}</buildDirectory>
<finalName>${project.build.finalName}</finalName>
<project>${project}</project>
<qualifier>${buildQualifier}</qualifier>
<session>${session}</session>
<strictBinIncludes default-value="true"/>
<useDefaultExcludes default-value="true"/>
</configuration>
[DEBUG] -----------------------------------------------------------------------
[DEBUG] Goal: org.eclipse.tycho:tycho-p2-plugin:1.0.0:p2-metadata-default (default-p2-metadata-default)
[DEBUG] Style: Regular
[DEBUG] Configuration: <?xml version="1.0" encoding="UTF-8"?>
<configuration>
<attachP2Metadata default-value="true"/>
<baselineMode default-value="warn">${tycho.baseline}</baselineMode>
<baselineReplace default-value="all">${tycho.baseline.replace}</baselineReplace>
<defaultP2Metadata default-value="true"/>
<project>${project}</project>
</configuration>
[DEBUG] -----------------------------------------------------------------------
[DEBUG] Goal: org.openhab.tools.sat:sat-plugin:0.4.1:checkstyle (default)
[DEBUG] Style: Regular
[DEBUG] Configuration: <?xml version="1.0" encoding="UTF-8"?>
<configuration>
<checkstyleFilter>${checkstyle.filter}</checkstyleFilter>
<checkstyleMavenVersion default-value="2.17">${maven.checkstyle.version}</checkstyleMavenVersion>
<checkstyleProperties>${basedirRoot}/tools/checkstyle.properties</checkstyleProperties>
<checkstyleRuleset>${checkstyle.ruleset}</checkstyleRuleset>
<mavenProject default-value="${project}"/>
<mavenSession default-value="${session}"/>
<plugin default-value="${plugin}"/>
</configuration>
[DEBUG] -----------------------------------------------------------------------
[DEBUG] Goal: org.openhab.tools.sat:sat-plugin:0.4.1:pmd (default)
[DEBUG] Style: Regular
[DEBUG] Configuration: <?xml version="1.0" encoding="UTF-8"?>
<configuration>
<mavenPmdVersion default-value="3.8">${maven.pmd.version}</mavenPmdVersion>
<mavenProject default-value="${project}"/>
<mavenSession default-value="${session}"/>
<plugin default-value="${plugin}"/>
<pmdRuleset>${pmd.ruleset}</pmdRuleset>
</configuration>
[DEBUG] -----------------------------------------------------------------------
[DEBUG] Goal: org.openhab.tools.sat:sat-plugin:0.4.1:findbugs (default)
[DEBUG] Style: Regular
[DEBUG] Configuration: <?xml version="1.0" encoding="UTF-8"?>
<configuration>
<findBugsSlf4jPluginVersion default-value="1.2.4">${findbugs.slf4j.version}</findBugsSlf4jPluginVersion>
<findbugsExclude>${findbugs.exclude}</findbugsExclude>
<findbugsInclude>${findbugs.include}</findbugsInclude>
<findbugsRuleset>${findbugs.ruleset}</findbugsRuleset>
<mavenProject default-value="${project}"/>
<mavenSession default-value="${session}"/>
<plugin default-value="${plugin}"/>
<spotBugsMavenPluginVersion default-value="3.0.6">${maven.spotbugs.version}</spotBugsMavenPluginVersion>
<spotBugsVersion default-value="3.1.0">${spotbugs.version}</spotBugsVersion>
</configuration>
[DEBUG] -----------------------------------------------------------------------
[DEBUG] Goal: org.openhab.tools.sat:sat-plugin:0.4.1:report (default)
[DEBUG] Style: Regular
[DEBUG] Configuration: <?xml version="1.0" encoding="UTF-8"?>
<configuration>
<failOnError default-value="true">${report.fail.on.error}</failOnError>
<reportInMaven default-value="true">${report.in.maven}</reportInMaven>
<summaryReportDirectory default-value="${session.executionRootDirectory}/target">${report.summary.targetDir}</summaryReportDirectory>
<targetDirectory default-value="${project.build.directory}/code-analysis">${report.targetDir}</targetDirectory>
</configuration>
[DEBUG] -----------------------------------------------------------------------
[DEBUG] Goal: org.apache.maven.plugins:maven-install-plugin:2.3.1:install (default-install)
[DEBUG] Style: Regular
[DEBUG] Configuration: <?xml version="1.0" encoding="UTF-8"?>
<configuration>
<artifact default-value="${project.artifact}"/>
<attachedArtifacts default-value="${project.attachedArtifacts}"/>
<createChecksum default-value="false">${createChecksum}</createChecksum>
<localRepository>${localRepository}</localRepository>
<packaging default-value="${project.packaging}"/>
<pomFile default-value="${project.file}"/>
<updateReleaseInfo default-value="false">${updateReleaseInfo}</updateReleaseInfo>
</configuration>
[DEBUG] -----------------------------------------------------------------------
[DEBUG] Goal: org.eclipse.tycho:tycho-p2-plugin:1.0.0:update-local-index (default-update-local-index)
[DEBUG] Style: Regular
[DEBUG] Configuration: <?xml version="1.0" encoding="UTF-8"?>
<configuration>
<project>${project}</project>
</configuration>
[DEBUG] =======================================================================
[DEBUG] Dependency collection stats: {ConflictMarker.analyzeTime=87854, ConflictMarker.markTime=43516, ConflictMarker.nodeCount=17, ConflictIdSorter.graphTime=8621, ConflictIdSorter.topsortTime=16422, ConflictIdSorter.conflictIdCount=16, ConflictIdSorter.conflictIdCycleCount=0, ConflictResolver.totalTime=1349818, ConflictResolver.conflictItemCount=16, DefaultDependencyCollector.collectTime=7199440, DefaultDependencyCollector.transformTime=1525935}
[DEBUG] org.openhab.binding:org.openhab.binding.eurothermostat:eclipse-plugin:2.3.0-SNAPSHOT
[DEBUG] org.apache.felix:org.apache.felix.fileinstall:jar:3.4.0:provided
[DEBUG] org.apache.felix:org.apache.felix.scr.ds-annotations:jar:1.2.10:compile (optional)
[DEBUG] p2.eclipse-plugin:com.google.gson:jar:2.7.0.v20170129-0911:system
[DEBUG] p2.eclipse-plugin:com.google.guava:jar:15.0.0.v201403281430:system
[DEBUG] p2.eclipse-plugin:org.eclipse.osgi:jar:3.12.1.v20170821-1548:system
[DEBUG] p2.eclipse-plugin:org.eclipse.osgi.services:jar:3.6.0.v20170228-1906:system
[DEBUG] p2.eclipse-plugin:org.eclipse.osgi.util:jar:3.4.0.v20170111-1608:system
[DEBUG] p2.eclipse-plugin:org.apache.commons.lang:jar:2.6.0.v201404270220:system
[DEBUG] p2.eclipse-plugin:org.eclipse.smarthome.config.core:jar:0.10.0.201802191927:system
[DEBUG] p2.eclipse-plugin:org.eclipse.smarthome.core:jar:0.10.0.201802191927:system
[DEBUG] p2.eclipse-plugin:org.slf4j.api:jar:1.7.2.v20121108-1250:system
[DEBUG] p2.eclipse-plugin:org.apache.commons.io:jar:2.2.0.v201405211200:system
[DEBUG] p2.eclipse-plugin:org.apache.commons.collections:jar:3.2.0.v2013030210310:system
[DEBUG] p2.eclipse-plugin:org.eclipse.smarthome.core.thing:jar:0.10.0.201802191927:system
[DEBUG] p2.eclipse-plugin:org.eclipse.smarthome.io.console:jar:0.10.0.201802191927:system
[DEBUG] p2.eclipse-plugin:org.eclipse.jdt.annotation:jar:2.1.100.v20170511-1408:system
[INFO]
[INFO] --- tycho-packaging-plugin:1.0.0:build-qualifier (default-build-qualifier) @ org.openhab.binding.eurothermostat ---
[DEBUG] Dependency collection stats: {ConflictMarker.analyzeTime=263970, ConflictMarker.markTime=175295, ConflictMarker.nodeCount=145, ConflictIdSorter.graphTime=95653, ConflictIdSorter.topsortTime=53369, ConflictIdSorter.conflictIdCount=40, ConflictIdSorter.conflictIdCycleCount=0, ConflictResolver.totalTime=2815816, ConflictResolver.conflictItemCount=95, DefaultDependencyCollector.collectTime=14460869, DefaultDependencyCollector.transformTime=3455419}
[DEBUG] org.eclipse.tycho:tycho-packaging-plugin:jar:1.0.0:
[DEBUG] org.eclipse.tycho:tycho-core:jar:1.0.0:compile
[DEBUG] org.eclipse.tycho:org.eclipse.osgi.compatibility.state:jar:1.0.200.v20160504-1419:compile
[DEBUG] org.eclipse.tycho:sisu-equinox-embedder:jar:1.0.0:compile
[DEBUG] org.eclipse.tycho:org.eclipse.osgi:jar:3.11.2.v20161107-1947:compile
[DEBUG] org.eclipse.tycho:sisu-equinox-api:jar:1.0.0:compile
[DEBUG] org.eclipse.tycho:tycho-metadata-model:jar:1.0.0:compile
[DEBUG] de.pdark:decentxml:jar:1.3:compile
[DEBUG] org.eclipse.tycho:tycho-embedder-api:jar:1.0.0:compile
[DEBUG] org.eclipse.tycho:org.eclipse.tycho.embedder.shared:jar:1.0.0:compile
[DEBUG] org.eclipse.tycho:org.eclipse.tycho.core.shared:jar:1.0.0:compile
[DEBUG] org.apache.maven:maven-compat:jar:3.0:compile
[DEBUG] org.apache.maven.wagon:wagon-provider-api:jar:1.0-beta-6:compile
[DEBUG] org.apache.maven:maven-core:jar:3.0:compile
[DEBUG] org.apache.maven:maven-model:jar:3.0:compile
[DEBUG] org.apache.maven:maven-settings:jar:3.0:compile
[DEBUG] org.apache.maven:maven-settings-builder:jar:3.0:compile
[DEBUG] org.apache.maven:maven-repository-metadata:jar:3.0:compile
[DEBUG] org.apache.maven:maven-artifact:jar:3.0:compile
[DEBUG] org.apache.maven:maven-model-builder:jar:3.0:compile
[DEBUG] org.apache.maven:maven-aether-provider:jar:3.0:runtime
[DEBUG] org.sonatype.aether:aether-impl:jar:1.7:compile
[DEBUG] org.sonatype.aether:aether-spi:jar:1.7:compile
[DEBUG] org.sonatype.aether:aether-api:jar:1.7:compile
[DEBUG] org.sonatype.aether:aether-util:jar:1.7:compile
[DEBUG] org.sonatype.sisu:sisu-inject-plexus:jar:1.4.2:compile
[DEBUG] org.sonatype.sisu:sisu-inject-bean:jar:1.4.2:compile
[DEBUG] org.sonatype.sisu:sisu-guice:jar:noaop:2.1.7:compile
[DEBUG] org.codehaus.plexus:plexus-interpolation:jar:1.14:compile
[DEBUG] org.codehaus.plexus:plexus-classworlds:jar:2.2.3:compile
[DEBUG] org.codehaus.plexus:plexus-component-annotations:jar:1.5.5:compile
[DEBUG] org.sonatype.plexus:plexus-sec-dispatcher:jar:1.3:compile
[DEBUG] org.sonatype.plexus:plexus-cipher:jar:1.7:compile
[DEBUG] org.apache.maven:maven-plugin-api:jar:3.0:compile
[DEBUG] org.codehaus.plexus:plexus-utils:jar:3.0.7:compile
[DEBUG] org.apache.maven:maven-archiver:jar:2.5:compile
[DEBUG] org.codehaus.plexus:plexus-archiver:jar:2.9.1:compile
[DEBUG] org.codehaus.plexus:plexus-io:jar:2.4.1:compile
[DEBUG] commons-io:commons-io:jar:2.2:compile
[DEBUG] org.apache.commons:commons-compress:jar:1.9:compile
[DEBUG] Created new class realm plugin>org.eclipse.tycho:tycho-packaging-plugin:1.0.0
[DEBUG] Importing foreign packages into class realm plugin>org.eclipse.tycho:tycho-packaging-plugin:1.0.0
[DEBUG] Imported: < project>org.openhab:pom-addons2:2.3.0-SNAPSHOT
[DEBUG] Populating class realm plugin>org.eclipse.tycho:tycho-packaging-plugin:1.0.0
[DEBUG] Included: org.eclipse.tycho:tycho-packaging-plugin:jar:1.0.0
[DEBUG] Included: org.eclipse.tycho:org.eclipse.osgi.compatibility.state:jar:1.0.200.v20160504-1419
[DEBUG] Included: org.sonatype.aether:aether-util:jar:1.7
[DEBUG] Included: org.sonatype.sisu:sisu-inject-bean:jar:1.4.2
[DEBUG] Included: org.sonatype.sisu:sisu-guice:jar:noaop:2.1.7
[DEBUG] Included: org.codehaus.plexus:plexus-interpolation:jar:1.14
[DEBUG] Included: org.codehaus.plexus:plexus-component-annotations:jar:1.5.5
[DEBUG] Included: org.sonatype.plexus:plexus-sec-dispatcher:jar:1.3
[DEBUG] Included: org.sonatype.plexus:plexus-cipher:jar:1.7
[DEBUG] Included: org.codehaus.plexus:plexus-utils:jar:3.0.7
[DEBUG] Included: org.apache.maven:maven-archiver:jar:2.5
[DEBUG] Included: org.codehaus.plexus:plexus-archiver:jar:2.9.1
[DEBUG] Included: org.codehaus.plexus:plexus-io:jar:2.4.1
[DEBUG] Included: commons-io:commons-io:jar:2.2
[DEBUG] Included: org.apache.commons:commons-compress:jar:1.9
[DEBUG] Configuring mojo org.eclipse.tycho:tycho-packaging-plugin:1.0.0:build-qualifier from plugin realm ClassRealm[plugin>org.eclipse.tycho:tycho-packaging-plugin:1.0.0, parent: sun.misc.Launcher$AppClassLoader@70dea4e]
[DEBUG] Configuring mojo 'org.eclipse.tycho:tycho-packaging-plugin:1.0.0:build-qualifier' with basic configurator -->
[DEBUG] (f) baseDir = D:\Users\user\openhab\openhab2-master\git\openhab2-addons\addons\binding\org.openhab.binding.eurothermostat
[DEBUG] (f) execution = org.eclipse.tycho:tycho-packaging-plugin:1.0.0:build-qualifier {execution: default-build-qualifier}
[DEBUG] (s) format = yyyyMMddHHmm
[DEBUG] (f) packaging = eclipse-plugin
[DEBUG] (f) project = MavenProject: org.openhab.binding:org.openhab.binding.eurothermostat:2.3.0-SNAPSHOT @ D:\Users\user\openhab\openhab2-master\git\openhab2-addons\addons\binding\org.openhab.binding.eurothermostat\pom.xml
[DEBUG] (f) session = org.apache.maven.execution.MavenSession@69aa2adb
[DEBUG] -- end configuration --
[INFO] The project's OSGi version is 2.3.0.201803111804
[INFO]
[INFO] --- tycho-packaging-plugin:1.0.0:validate-id (default-validate-id) @ org.openhab.binding.eurothermostat ---
[DEBUG] Configuring mojo org.eclipse.tycho:tycho-packaging-plugin:1.0.0:validate-id from plugin realm ClassRealm[plugin>org.eclipse.tycho:tycho-packaging-plugin:1.0.0, parent: sun.misc.Launcher$AppClassLoader@70dea4e]
[DEBUG] Configuring mojo 'org.eclipse.tycho:tycho-packaging-plugin:1.0.0:validate-id' with basic configurator -->
[DEBUG] (f) packaging = eclipse-plugin
[DEBUG] (f) project = MavenProject: org.openhab.binding:org.openhab.binding.eurothermostat:2.3.0-SNAPSHOT @ D:\Users\user\openhab\openhab2-master\git\openhab2-addons\addons\binding\org.openhab.binding.eurothermostat\pom.xml
[DEBUG] -- end configuration --
[INFO]
[INFO] --- tycho-packaging-plugin:1.0.0:validate-version (default-validate-version) @ org.openhab.binding.eurothermostat ---
[DEBUG] Configuring mojo org.eclipse.tycho:tycho-packaging-plugin:1.0.0:validate-version from plugin realm ClassRealm[plugin>org.eclipse.tycho:tycho-packaging-plugin:1.0.0, parent: sun.misc.Launcher$AppClassLoader@70dea4e]
[DEBUG] Configuring mojo 'org.eclipse.tycho:tycho-packaging-plugin:1.0.0:validate-version' with basic configurator -->
[DEBUG] (f) packaging = eclipse-plugin
[DEBUG] (f) project = MavenProject: org.openhab.binding:org.openhab.binding.eurothermostat:2.3.0-SNAPSHOT @ D:\Users\user\openhab\openhab2-master\git\openhab2-addons\addons\binding\org.openhab.binding.eurothermostat\pom.xml
[DEBUG] (f) strictVersions = false
[DEBUG] -- end configuration --
[INFO]
[INFO] --- directory-maven-plugin:0.2:highest-basedir (directories) @ org.openhab.binding.eurothermostat ---
[DEBUG] Dependency collection stats: {ConflictMarker.analyzeTime=112074, ConflictMarker.markTime=80874, ConflictMarker.nodeCount=59, ConflictIdSorter.graphTime=120695, ConflictIdSorter.topsortTime=33253, ConflictIdSorter.conflictIdCount=23, ConflictIdSorter.conflictIdCycleCount=0, ConflictResolver.totalTime=710214, ConflictResolver.conflictItemCount=58, DefaultDependencyCollector.collectTime=4213255, DefaultDependencyCollector.transformTime=1092827}
[DEBUG] org.commonjava.maven.plugins:directory-maven-plugin:jar:0.2:
[DEBUG] org.apache.maven:maven-core:jar:3.0.3:compile
[DEBUG] org.apache.maven:maven-settings:jar:3.0.3:compile
[DEBUG] org.apache.maven:maven-settings-builder:jar:3.0.3:compile
[DEBUG] org.apache.maven:maven-repository-metadata:jar:3.0.3:compile
[DEBUG] org.apache.maven:maven-artifact:jar:3.0.3:compile
[DEBUG] org.apache.maven:maven-model-builder:jar:3.0.3:compile
[DEBUG] org.apache.maven:maven-aether-provider:jar:3.0.3:compile
[DEBUG] org.sonatype.aether:aether-spi:jar:1.11:compile
[DEBUG] org.sonatype.aether:aether-impl:jar:1.11:compile
[DEBUG] org.sonatype.aether:aether-api:jar:1.11:compile
[DEBUG] org.sonatype.aether:aether-util:jar:1.11:compile
[DEBUG] org.sonatype.sisu:sisu-inject-plexus:jar:2.1.1:compile
[DEBUG] org.sonatype.sisu:sisu-inject-bean:jar:2.1.1:compile
[DEBUG] org.sonatype.sisu:sisu-guice:jar:no_aop:2.9.4:compile
[DEBUG] org.codehaus.plexus:plexus-interpolation:jar:1.14:compile
[DEBUG] org.codehaus.plexus:plexus-utils:jar:2.0.6:compile
[DEBUG] org.codehaus.plexus:plexus-classworlds:jar:2.4:compile
[DEBUG] org.codehaus.plexus:plexus-component-annotations:jar:1.5.5:compile
[DEBUG] org.sonatype.plexus:plexus-sec-dispatcher:jar:1.3:compile
[DEBUG] org.sonatype.plexus:plexus-cipher:jar:1.4:compile
[DEBUG] org.apache.maven:maven-plugin-api:jar:3.0.3:compile
[DEBUG] org.apache.maven:maven-model:jar:3.0.3:compile
[DEBUG] Created new class realm plugin>org.commonjava.maven.plugins:directory-maven-plugin:0.2
[DEBUG] Importing foreign packages into class realm plugin>org.commonjava.maven.plugins:directory-maven-plugin:0.2
[DEBUG] Imported: < project>org.openhab:pom-addons2:2.3.0-SNAPSHOT
[DEBUG] Populating class realm plugin>org.commonjava.maven.plugins:directory-maven-plugin:0.2
[DEBUG] Included: org.commonjava.maven.plugins:directory-maven-plugin:jar:0.2
[DEBUG] Included: org.sonatype.aether:aether-util:jar:1.11
[DEBUG] Included: org.sonatype.sisu:sisu-inject-bean:jar:2.1.1
[DEBUG] Included: org.sonatype.sisu:sisu-guice:jar:no_aop:2.9.4
[DEBUG] Included: org.codehaus.plexus:plexus-interpolation:jar:1.14
[DEBUG] Included: org.codehaus.plexus:plexus-utils:jar:2.0.6
[DEBUG] Included: org.codehaus.plexus:plexus-component-annotations:jar:1.5.5
[DEBUG] Included: org.sonatype.plexus:plexus-sec-dispatcher:jar:1.3
[DEBUG] Included: org.sonatype.plexus:plexus-cipher:jar:1.4
[DEBUG] Configuring mojo org.commonjava.maven.plugins:directory-maven-plugin:0.2:highest-basedir from plugin realm ClassRealm[plugin>org.commonjava.maven.plugins:directory-maven-plugin:0.2, parent: sun.misc.Launcher$AppClassLoader@70dea4e]
[DEBUG] Configuring mojo 'org.commonjava.maven.plugins:directory-maven-plugin:0.2:highest-basedir' with basic configurator -->
[DEBUG] (f) currentProject = MavenProject: org.openhab.binding:org.openhab.binding.eurothermostat:2.3.0-SNAPSHOT @ D:\Users\user\openhab\openhab2-master\git\openhab2-addons\addons\binding\org.openhab.binding.eurothermostat\pom.xml
[DEBUG] (f) projects = [MavenProject: org.openhab.binding:org.openhab.binding.eurothermostat:2.3.0-SNAPSHOT @ D:\Users\user\openhab\openhab2-master\git\openhab2-addons\addons\binding\org.openhab.binding.eurothermostat\pom.xml, MavenProject: org.openhab.binding:org.openhab.binding.airquality:2.3.0-SNAPSHOT @ D:\Users\user\openhab\openhab2-master\git\openhab2-addons\addons\binding\org.openhab.binding.airquality\pom.xml, MavenProject: org.openhab.binding:org.openhab.binding.allplay:2.3.0-SNAPSHOT @ D:\Users\user\openhab\openhab2-master\git\openhab2-addons\addons\binding\org.openhab.binding.allplay\pom.xml, MavenProject: org.openhab.binding:org.openhab.binding.amazondashbutton:2.3.0-SNAPSHOT @ D:\Users\user\openhab\openhab2-master\git\openhab2-addons\addons\binding\org.openhab.binding.amazondashbutton\pom.xml, MavenProject: org.openhab.binding:org.openhab.binding.atlona:2.3.0-SNAPSHOT @ D:\Users\user\openhab\openhab2-master\git\openhab2-addons\addons\binding\org.openhab.binding.atlona\pom.xml, MavenProject: org.openhab.binding:org.openhab.binding.autelis:2.3.0-SNAPSHOT @ D:\Users\user\openhab\openhab2-master\git\openhab2-addons\addons\binding\org.openhab.binding.autelis\pom.xml, MavenProject: org.openhab.binding:org.openhab.binding.avmfritz:2.3.0-SNAPSHOT @ D:\Users\user\openhab\openhab2-master\git\openhab2-addons\addons\binding\org.openhab.binding.avmfritz\pom.xml, MavenProject: org.openhab.binding:org.openhab.binding.avmfritz.test:2.3.0-SNAPSHOT @ D:\Users\user\openhab\openhab2-master\git\openhab2-addons\addons\binding\org.openhab.binding.avmfritz.test\pom.xml, MavenProject: org.openhab.binding:org.openhab.binding.bigassfan:2.3.0-SNAPSHOT @ D:\Users\user\openhab\openhab2-master\git\openhab2-addons\addons\binding\org.openhab.binding.bigassfan\pom.xml, MavenProject: org.openhab.binding:org.openhab.binding.boschindego:2.3.0-SNAPSHOT @ D:\Users\user\openhab\openhab2-master\git\openhab2-addons\addons\binding\org.openhab.binding.boschindego\pom.xml, MavenProject: org.openhab.binding:org.openhab.binding.chromecast:2.3.0-SNAPSHOT @ D:\Users\user\openhab\openhab2-master\git\openhab2-addons\addons\binding\org.openhab.binding.chromecast\pom.xml, MavenProject: org.openhab.binding:org.openhab.binding.cm11a:2.3.0-SNAPSHOT @ D:\Users\user\openhab\openhab2-master\git\openhab2-addons\addons\binding\org.openhab.binding.cm11a\pom.xml, MavenProject: org.openhab.binding:org.openhab.binding.coolmasternet:2.3.0-SNAPSHOT @ D:\Users\user\openhab\openhab2-master\git\openhab2-addons\addons\binding\org.openhab.binding.coolmasternet\pom.xml, MavenProject: org.openhab.binding:org.openhab.binding.dlinksmarthome:2.3.0-SNAPSHOT @ D:\Users\user\openhab\openhab2-master\git\openhab2-addons\addons\binding\org.openhab.binding.dlinksmarthome\pom.xml, MavenProject: org.openhab.binding:org.openhab.binding.dscalarm:2.3.0-SNAPSHOT @ D:\Users\user\openhab\openhab2-master\git\openhab2-addons\addons\binding\org.openhab.binding.dscalarm\pom.xml, MavenProject: org.openhab.binding:org.openhab.binding.exec:2.3.0-SNAPSHOT @ D:\Users\user\openhab\openhab2-master\git\openhab2-addons\addons\binding\org.openhab.binding.exec\pom.xml, MavenProject: org.openhab.addons.io:pom:2.3.0-SNAPSHOT @ D:\Users\user\openhab\openhab2-master\git\openhab2-addons\addons\io\pom.xml, MavenProject: org.openhab.io:org.openhab.io.transport.feed:2.3.0-SNAPSHOT @ D:\Users\user\openhab\openhab2-master\git\openhab2-addons\addons\io\org.openhab.io.transport.feed\pom.xml, MavenProject: org.openhab.binding:org.openhab.binding.feed:2.3.0-SNAPSHOT @ D:\Users\user\openhab\openhab2-master\git\openhab2-addons\addons\binding\org.openhab.binding.feed\pom.xml, MavenProject: org.openhab.binding:org.openhab.binding.feed.test:2.3.0-SNAPSHOT @ D:\Users\user\openhab\openhab2-master\git\openhab2-addons\addons\binding\org.openhab.binding.feed.test\pom.xml, MavenProject: org.openhab.binding:org.openhab.binding.feican:2.3.0-SNAPSHOT @ D:\Users\user\openhab\openhab2-master\git\openhab2-addons\addons\binding\org.openhab.binding.feican\pom.xml, MavenProject: org.openhab.binding:org.openhab.binding.folding:2.3.0-SNAPSHOT @ D:\Users\user\openhab\openhab2-master\git\openhab2-addons\addons\binding\org.openhab.binding.folding\pom.xml, MavenProject: org.openhab.binding:org.openhab.binding.freebox:2.3.0-SNAPSHOT @ D:\Users\user\openhab\openhab2-master\git\openhab2-addons\addons\binding\org.openhab.binding.freebox\pom.xml, MavenProject: org.openhab.binding:org.openhab.binding.fronius:2.3.0-SNAPSHOT @ D:\Users\user\openhab\openhab2-master\git\openhab2-addons\addons\binding\org.openhab.binding.fronius\pom.xml, MavenProject: org.openhab.binding:org.openhab.binding.gardena:2.3.0-SNAPSHOT @ D:\Users\user\openhab\openhab2-master\git\openhab2-addons\addons\binding\org.openhab.binding.gardena\pom.xml, MavenProject: org.openhab.binding:org.openhab.binding.harmonyhub:2.3.0-SNAPSHOT @ D:\Users\user\openhab\openhab2-master\git\openhab2-addons\addons\binding\org.openhab.binding.harmonyhub\pom.xml, MavenProject: org.openhab.binding:org.openhab.binding.hdanywhere:2.3.0-SNAPSHOT @ D:\Users\user\openhab\openhab2-master\git\openhab2-addons\addons\binding\org.openhab.binding.hdanywhere\pom.xml, MavenProject: org.openhab.binding:org.openhab.binding.hdpowerview:2.3.0-SNAPSHOT @ D:\Users\user\openhab\openhab2-master\git\openhab2-addons\addons\binding\org.openhab.binding.hdpowerview\pom.xml, MavenProject: org.openhab.binding:org.openhab.binding.helios:2.3.0-SNAPSHOT @ D:\Users\user\openhab\openhab2-master\git\openhab2-addons\addons\binding\org.openhab.binding.helios\pom.xml, MavenProject: org.openhab.binding:org.openhab.binding.homematic:2.3.0-SNAPSHOT @ D:\Users\user\openhab\openhab2-master\git\openhab2-addons\addons\binding\org.openhab.binding.homematic\pom.xml, MavenProject: org.openhab.binding:org.openhab.binding.globalcache:2.3.0-SNAPSHOT @ D:\Users\user\openhab\openhab2-master\git\openhab2-addons\addons\binding\org.openhab.binding.globalcache\pom.xml, MavenProject: org.openhab.binding:org.openhab.binding.icloud:2.3.0-SNAPSHOT @ D:\Users\user\openhab\openhab2-master\git\openhab2-addons\addons\binding\org.openhab.binding.icloud\pom.xml, MavenProject: org.openhab.binding:org.openhab.binding.ipp:2.3.0-SNAPSHOT @ D:\Users\user\openhab\openhab2-master\git\openhab2-addons\addons\binding\org.openhab.binding.ipp\pom.xml, MavenProject: org.openhab.binding:org.openhab.binding.jeelink:2.3.0-SNAPSHOT @ D:\Users\user\openhab\openhab2-master\git\openhab2-addons\addons\binding\org.openhab.binding.jeelink\pom.xml, MavenProject: org.openhab.binding:org.openhab.binding.keba:2.3.0-SNAPSHOT @ D:\Users\user\openhab\openhab2-master\git\openhab2-addons\addons\binding\org.openhab.binding.keba\pom.xml, MavenProject: org.openhab.binding:org.openhab.binding.kodi:2.3.0-SNAPSHOT @ D:\Users\user\openhab\openhab2-master\git\openhab2-addons\addons\binding\org.openhab.binding.kodi\pom.xml, MavenProject: org.openhab.binding:org.openhab.binding.kostalinverter:2.3.0-SNAPSHOT @ D:\Users\user\openhab\openhab2-master\git\openhab2-addons\addons\binding\org.openhab.binding.kostalinverter\pom.xml, MavenProject: org.openhab.binding:org.openhab.binding.lametrictime:2.3.0-SNAPSHOT @ D:\Users\user\openhab\openhab2-master\git\openhab2-addons\addons\binding\org.openhab.binding.lametrictime\pom.xml, MavenProject: org.openhab.binding:org.openhab.binding.lgtvserial:2.3.0-SNAPSHOT @ D:\Users\user\openhab\openhab2-master\git\openhab2-addons\addons\binding\org.openhab.binding.lgtvserial\pom.xml, MavenProject: org.openhab.binding:org.openhab.binding.lgwebos:2.3.0-SNAPSHOT @ D:\Users\user\openhab\openhab2-master\git\openhab2-addons\addons\binding\org.openhab.binding.lgwebos\pom.xml, MavenProject: org.openhab.binding:org.openhab.binding.loxone:2.3.0-SNAPSHOT @ D:\Users\user\openhab\openhab2-master\git\openhab2-addons\addons\binding\org.openhab.binding.loxone\pom.xml, MavenProject: org.openhab.binding:org.openhab.binding.lutron:2.3.0-SNAPSHOT @ D:\Users\user\openhab\openhab2-master\git\openhab2-addons\addons\binding\org.openhab.binding.lutron\pom.xml, MavenProject: org.openhab.binding:org.openhab.binding.max:2.3.0-SNAPSHOT @ D:\Users\user\openhab\openhab2-master\git\openhab2-addons\addons\binding\org.openhab.binding.max\pom.xml, MavenProject: org.openhab.binding:org.openhab.binding.max.test:2.3.0-SNAPSHOT @ D:\Users\user\openhab\openhab2-master\git\openhab2-addons\addons\binding\org.openhab.binding.max.test\pom.xml, MavenProject: org.openhab.binding:org.openhab.binding.mcp23017:2.3.0-SNAPSHOT @ D:\Users\user\openhab\openhab2-master\git\openhab2-addons\addons\binding\org.openhab.binding.mcp23017\pom.xml, MavenProject: org.openhab.binding:org.openhab.binding.meteostick:2.3.0-SNAPSHOT @ D:\Users\user\openhab\openhab2-master\git\openhab2-addons\addons\binding\org.openhab.binding.meteostick\pom.xml, MavenProject: org.openhab.binding:org.openhab.binding.miele:2.3.0-SNAPSHOT @ D:\Users\user\openhab\openhab2-master\git\openhab2-addons\addons\binding\org.openhab.binding.miele\pom.xml, MavenProject: org.openhab.binding:org.openhab.binding.mihome:2.3.0-SNAPSHOT @ D:\Users\user\openhab\openhab2-master\git\openhab2-addons\addons\binding\org.openhab.binding.mihome\pom.xml, MavenProject: org.openhab.binding:org.openhab.binding.milight:2.3.0-SNAPSHOT @ D:\Users\user\openhab\openhab2-master\git\openhab2-addons\addons\binding\org.openhab.binding.milight\pom.xml, MavenProject: org.openhab.binding:org.openhab.binding.minecraft:2.3.0-SNAPSHOT @ D:\Users\user\openhab\openhab2-master\git\openhab2-addons\addons\binding\org.openhab.binding.minecraft\pom.xml, MavenProject: org.openhab.binding:org.openhab.binding.netatmo:2.3.0-SNAPSHOT @ D:\Users\user\openhab\openhab2-master\git\openhab2-addons\addons\binding\org.openhab.binding.netatmo\pom.xml, MavenProject: org.openhab.binding:org.openhab.binding.network:2.3.0-SNAPSHOT @ D:\Users\user\openhab\openhab2-master\git\openhab2-addons\addons\binding\org.openhab.binding.network\pom.xml, MavenProject: org.openhab.binding:org.openhab.binding.network.test:2.3.0-SNAPSHOT @ D:\Users\user\openhab\openhab2-master\git\openhab2-addons\addons\binding\org.openhab.binding.network.test\pom.xml, MavenProject: org.openhab.binding:org.openhab.binding.nest:2.3.0-SNAPSHOT @ D:\Users\user\openhab\openhab2-master\git\openhab2-addons\addons\binding\org.openhab.binding.nest\pom.xml, MavenProject: org.openhab.binding:org.openhab.binding.nest.test:2.3.0-SNAPSHOT @ D:\Users\user\openhab\openhab2-master\git\openhab2-addons\addons\binding\org.openhab.binding.nest.test\pom.xml, MavenProject: org.openhab.binding:org.openhab.binding.nikohomecontrol:2.3.0-SNAPSHOT @ D:\Users\user\openhab\openhab2-master\git\openhab2-addons\addons\binding\org.openhab.binding.nikohomecontrol\pom.xml, MavenProject: org.openhab.binding:org.openhab.binding.oceanic:2.3.0-SNAPSHOT @ D:\Users\user\openhab\openhab2-master\git\openhab2-addons\addons\binding\org.openhab.binding.oceanic\pom.xml, MavenProject: org.openhab.binding:org.openhab.binding.onebusaway:2.3.0-SNAPSHOT @ D:\Users\user\openhab\openhab2-master\git\openhab2-addons\addons\binding\org.openhab.binding.onebusaway\pom.xml, MavenProject: org.openhab.binding:org.openhab.binding.onewiregpio:2.3.0-SNAPSHOT @ D:\Users\user\openhab\openhab2-master\git\openhab2-addons\addons\binding\org.openhab.binding.onewiregpio\pom.xml, MavenProject: org.openhab.binding:org.openhab.binding.onkyo:2.3.0-SNAPSHOT @ D:\Users\user\openhab\openhab2-master\git\openhab2-addons\addons\binding\org.openhab.binding.onkyo\pom.xml, MavenProject: org.openhab.binding:org.openhab.binding.opensprinkler:2.3.0-SNAPSHOT @ D:\Users\user\openhab\openhab2-master\git\openhab2-addons\addons\binding\org.openhab.binding.opensprinkler\pom.xml, MavenProject: org.openhab.binding:org.openhab.binding.orvibo:2.3.0-SNAPSHOT @ D:\Users\user\openhab\openhab2-master\git\openhab2-addons\addons\binding\org.openhab.binding.orvibo\pom.xml, MavenProject: org.openhab.binding:org.openhab.binding.pentair:2.3.0-SNAPSHOT @ D:\Users\user\openhab\openhab2-master\git\openhab2-addons\addons\binding\org.openhab.binding.pentair\pom.xml, MavenProject: org.openhab.binding:org.openhab.binding.pioneeravr:2.3.0-SNAPSHOT @ D:\Users\user\openhab\openhab2-master\git\openhab2-addons\addons\binding\org.openhab.binding.pioneeravr\pom.xml, MavenProject: org.openhab.binding:org.openhab.binding.plugwise:2.3.0-SNAPSHOT @ D:\Users\user\openhab\openhab2-master\git\openhab2-addons\addons\binding\org.openhab.binding.plugwise\pom.xml, MavenProject: org.openhab.binding:org.openhab.binding.pulseaudio:2.3.0-SNAPSHOT @ D:\Users\user\openhab\openhab2-master\git\openhab2-addons\addons\binding\org.openhab.binding.pulseaudio\pom.xml, MavenProject: org.openhab.binding:org.openhab.binding.regoheatpump:2.3.0-SNAPSHOT @ D:\Users\user\openhab\openhab2-master\git\openhab2-addons\addons\binding\org.openhab.binding.regoheatpump\pom.xml, MavenProject: org.openhab.binding:org.openhab.binding.rme:2.3.0-SNAPSHOT @ D:\Users\user\openhab\openhab2-master\git\openhab2-addons\addons\binding\org.openhab.binding.rme\pom.xml, MavenProject: org.openhab.binding:org.openhab.binding.rfxcom:2.3.0-SNAPSHOT @ D:\Users\user\openhab\openhab2-master\git\openhab2-addons\addons\binding\org.openhab.binding.rfxcom\pom.xml, MavenProject: org.openhab.binding:org.openhab.binding.rfxcom.test:2.3.0-SNAPSHOT @ D:\Users\user\openhab\openhab2-master\git\openhab2-addons\addons\binding\org.openhab.binding.rfxcom.test\pom.xml, MavenProject: org.openhab.binding:org.openhab.binding.rotelra1x:2.3.0-SNAPSHOT @ D:\Users\user\openhab\openhab2-master\git\openhab2-addons\addons\binding\org.openhab.binding.rotelra1x\pom.xml, MavenProject: org.openhab.binding:org.openhab.binding.russound:2.3.0-SNAPSHOT @ D:\Users\user\openhab\openhab2-master\git\openhab2-addons\addons\binding\org.openhab.binding.russound\pom.xml, MavenProject: org.openhab.binding:org.openhab.binding.samsungtv:2.3.0-SNAPSHOT @ D:\Users\user\openhab\openhab2-master\git\openhab2-addons\addons\binding\org.openhab.binding.samsungtv\pom.xml, MavenProject: org.openhab.binding:org.openhab.binding.seneye:2.3.0-SNAPSHOT @ D:\Users\user\openhab\openhab2-master\git\openhab2-addons\addons\binding\org.openhab.binding.seneye\pom.xml, MavenProject: org.openhab.binding:org.openhab.binding.sensebox:2.3.0-SNAPSHOT @ D:\Users\user\openhab\openhab2-master\git\openhab2-addons\addons\binding\org.openhab.binding.sensebox\pom.xml, MavenProject: org.openhab.binding:org.openhab.binding.silvercrestwifisocket:2.3.0-SNAPSHOT @ D:\Users\user\openhab\openhab2-master\git\openhab2-addons\addons\binding\org.openhab.binding.silvercrestwifisocket\pom.xml, MavenProject: org.openhab.binding:org.openhab.binding.sleepiq:2.3.0-SNAPSHOT @ D:\Users\user\openhab\openhab2-master\git\openhab2-addons\addons\binding\org.openhab.binding.sleepiq\pom.xml, MavenProject: org.openhab.binding:org.openhab.binding.smaenergymeter:2.3.0-SNAPSHOT @ D:\Users\user\openhab\openhab2-master\git\openhab2-addons\addons\binding\org.openhab.binding.smaenergymeter\pom.xml, MavenProject: org.openhab.binding:org.openhab.binding.squeezebox:2.3.0-SNAPSHOT @ D:\Users\user\openhab\openhab2-master\git\openhab2-addons\addons\binding\org.openhab.binding.squeezebox\pom.xml, MavenProject: org.openhab.binding:org.openhab.binding.synopanalyzer:2.3.0-SNAPSHOT @ D:\Users\user\openhab\openhab2-master\git\openhab2-addons\addons\binding\org.openhab.binding.synopanalyzer\pom.xml, MavenProject: org.openhab.binding:org.openhab.binding.systeminfo:2.3.0-SNAPSHOT @ D:\Users\user\openhab\openhab2-master\git\openhab2-addons\addons\binding\org.openhab.binding.systeminfo\pom.xml, MavenProject: org.openhab.binding:org.openhab.binding.systeminfo.test:2.3.0-SNAPSHOT @ D:\Users\user\openhab\openhab2-master\git\openhab2-addons\addons\binding\org.openhab.binding.systeminfo.test\pom.xml, MavenProject: org.openhab.binding:org.openhab.binding.tankerkoenig:2.3.0-SNAPSHOT @ D:\Users\user\openhab\openhab2-master\git\openhab2-addons\addons\binding\org.openhab.binding.tankerkoenig\pom.xml, MavenProject: org.openhab.binding:org.openhab.binding.tellstick:2.3.0-SNAPSHOT @ D:\Users\user\openhab\openhab2-master\git\openhab2-addons\addons\binding\org.openhab.binding.tellstick\pom.xml, MavenProject: org.openhab.binding:org.openhab.binding.tesla:2.3.0-SNAPSHOT @ D:\Users\user\openhab\openhab2-master\git\openhab2-addons\addons\binding\org.openhab.binding.tesla\pom.xml, MavenProject: org.openhab.binding:org.openhab.binding.toon:2.3.0-SNAPSHOT @ D:\Users\user\openhab\openhab2-master\git\openhab2-addons\addons\binding\org.openhab.binding.toon\pom.xml, MavenProject: org.openhab.binding:org.openhab.binding.tplinksmarthome:2.3.0-SNAPSHOT @ D:\Users\user\openhab\openhab2-master\git\openhab2-addons\addons\binding\org.openhab.binding.tplinksmarthome\pom.xml, MavenProject: org.openhab.binding:org.openhab.binding.tplinksmarthome.test:2.3.0-SNAPSHOT @ D:\Users\user\openhab\openhab2-master\git\openhab2-addons\addons\binding\org.openhab.binding.tplinksmarthome.test\pom.xml, MavenProject: org.openhab.binding:org.openhab.binding.urtsi:2.3.0-SNAPSHOT @ D:\Users\user\openhab\openhab2-master\git\openhab2-addons\addons\binding\org.openhab.binding.urtsi\pom.xml, MavenProject: org.openhab.binding:org.openhab.binding.vitotronic:2.3.0-SNAPSHOT @ D:\Users\user\openhab\openhab2-master\git\openhab2-addons\addons\binding\org.openhab.binding.vitotronic\pom.xml, MavenProject: org.openhab.binding:org.openhab.binding.wifiled:2.3.0-SNAPSHOT @ D:\Users\user\openhab\openhab2-master\git\openhab2-addons\addons\binding\org.openhab.binding.wifiled\pom.xml, MavenProject: org.openhab.binding:org.openhab.binding.windcentrale:2.3.0-SNAPSHOT @ D:\Users\user\openhab\openhab2-master\git\openhab2-addons\addons\binding\org.openhab.binding.windcentrale\pom.xml, MavenProject: org.openhab.binding:org.openhab.binding.yamahareceiver:2.3.0-SNAPSHOT @ D:\Users\user\openhab\openhab2-master\git\openhab2-addons\addons\binding\org.openhab.binding.yamahareceiver\pom.xml, MavenProject: org.openhab.binding:org.openhab.binding.zoneminder:2.3.0-SNAPSHOT @ D:\Users\user\openhab\openhab2-master\git\openhab2-addons\addons\binding\org.openhab.binding.zoneminder\pom.xml, MavenProject: org.openhab.binding:org.openhab.binding.zway:2.3.0-SNAPSHOT @ D:\Users\user\openhab\openhab2-master\git\openhab2-addons\addons\binding\org.openhab.binding.zway\pom.xml, MavenProject: org.openhab.io:org.openhab.io.openhabcloud:2.3.0-SNAPSHOT @ D:\Users\user\openhab\openhab2-master\git\openhab2-addons\addons\io\org.openhab.io.openhabcloud\pom.xml, MavenProject: org.openhab.io:org.openhab.io.hueemulation:2.3.0-SNAPSHOT @ D:\Users\user\openhab\openhab2-master\git\openhab2-addons\addons\io\org.openhab.io.hueemulation\pom.xml, MavenProject: org.openhab.io:org.openhab.io.imperihome:2.3.0-SNAPSHOT @ D:\Users\user\openhab\openhab2-master\git\openhab2-addons\addons\io\org.openhab.io.imperihome\pom.xml, MavenProject: org.openhab.io:org.openhab.io.homekit:2.3.0-SNAPSHOT @ D:\Users\user\openhab\openhab2-master\git\openhab2-addons\addons\io\org.openhab.io.homekit\pom.xml, MavenProject: org.openhab.ui:pom:2.3.0-SNAPSHOT @ D:\Users\user\openhab\openhab2-master\git\openhab2-addons\addons\ui\pom.xml, MavenProject: org.openhab.ui:org.openhab.ui.cometvisu:2.3.0-SNAPSHOT @ D:\Users\user\openhab\openhab2-master\git\openhab2-addons\addons\ui\org.openhab.ui.cometvisu\pom.xml, MavenProject: org.openhab.ui:org.openhab.ui.cometvisu.php:2.3.0-SNAPSHOT @ D:\Users\user\openhab\openhab2-master\git\openhab2-addons\addons\ui\org.openhab.ui.cometvisu.php\pom.xml, MavenProject: org.openhab.addons.voice:pom:2.3.0-SNAPSHOT @ D:\Users\user\openhab\openhab2-master\git\openhab2-addons\addons\voice\pom.xml, MavenProject: org.openhab.voice:org.openhab.voice.marytts:2.3.0-SNAPSHOT @ D:\Users\user\openhab\openhab2-master\git\openhab2-addons\addons\voice\org.openhab.voice.marytts\pom.xml, MavenProject: org.openhab.voice:org.openhab.voice.voicerss:2.3.0-SNAPSHOT @ D:\Users\user\openhab\openhab2-master\git\openhab2-addons\addons\voice\org.openhab.voice.voicerss\pom.xml, MavenProject: org.openhab:features:2.3.0-SNAPSHOT @ D:\Users\user\openhab\openhab2-master\git\openhab2-addons\features\pom.xml, MavenProject: org.openhab.addons:openhab2-addons-external:2.3.0-SNAPSHOT @ D:\Users\user\openhab\openhab2-master\git\openhab2-addons\features\openhab-addons-external\pom.xml, MavenProject: org.openhab.addons:openhab2-addons:2.3.0-SNAPSHOT @ D:\Users\user\openhab\openhab2-master\git\openhab2-addons\features\openhab-addons\pom.xml, MavenProject: org.openhab.addons:openhab2-addons-verify:2.3.0-SNAPSHOT @ D:\Users\user\openhab\openhab2-master\git\openhab2-addons\features\openhab-addons-verify\pom.xml]
[DEBUG] (f) property = basedirRoot
[DEBUG] (f) quiet = false
[DEBUG] (f) session = org.apache.maven.execution.MavenSession@69aa2adb
[DEBUG] (f) systemProperty = false
[DEBUG] -- end configuration --
[INFO] Highest basedir set to: D:\Users\user\openhab\openhab2-master\git\openhab2-addons
[DEBUG] After setting property 'basedirRoot', project properties are:
-- listing properties --
nrjavaserial.version=3.12.0.OH
tycho-version=1.0.0
build.helper.maven.plugin.version=1.9.1
tycho-groupid=org.eclipse.tycho
jdt-annotations.version=2.1.0
ohc.version=2.3.0-SNAPSHOT
sat.version=0.4.1
esh.version=0.10.0-SNAPSHOT
tycho.env.osgi.arch=x86_64
project.build.sourceEncoding=UTF-8
maven.compiler.source=1.8
tycho.env.osgi.ws=win32
ohdr.version=1.0.22
groovy.eclipse.compiler.version=2.9.2-01
esh.releaseVersion=0.9.0
bundle.namespace=org.openhab.binding.eurothermostat
scm.gitBaseUrl=https://github.com/openhab
license.maven.plugin.version=2.10
tycho.env.osgi.os=win32
qualifiedVersion=2.3.0.201803111804
maven.compiler.target=1.8
ds-annotations.version=1.2.10
project.reporting.outputEncoding=UTF-8
jetty.version=9.3.22.v20171030
maven.compiler.version=3.6.1
unqualifiedVersion=2.3.0
maven.compiler.plugin.version=3.3
jackson.version=1.9.13
repo.version=2.2.x
karaf.version=4.1.3
groovy.eclipse.batch.version=2.4.3-01
bundle.symbolicName=org.openhab.binding.eurothermostat
buildQualifier=201803111804
basedirRoot=D:\Users\user\openhab\openhab2-maste...
[INFO]
[INFO] --- maven-resources-plugin:2.4.3:resources (default-resources) @ org.openhab.binding.eurothermostat ---
[DEBUG] Dependency collection stats: {ConflictMarker.analyzeTime=98116, ConflictMarker.markTime=90727, ConflictMarker.nodeCount=78, ConflictIdSorter.graphTime=47210, ConflictIdSorter.topsortTime=34074, ConflictIdSorter.conflictIdCount=26, ConflictIdSorter.conflictIdCycleCount=0, ConflictResolver.totalTime=431055, ConflictResolver.conflictItemCount=75, DefaultDependencyCollector.collectTime=7912528, DefaultDependencyCollector.transformTime=734846}
[DEBUG] org.apache.maven.plugins:maven-resources-plugin:jar:2.4.3:
[DEBUG] org.apache.maven:maven-plugin-api:jar:2.0.6:compile
[DEBUG] org.apache.maven:maven-project:jar:2.0.6:compile
[DEBUG] org.apache.maven:maven-profile:jar:2.0.6:compile
[DEBUG] org.apache.maven:maven-artifact-manager:jar:2.0.6:compile
[DEBUG] org.apache.maven:maven-plugin-registry:jar:2.0.6:compile
[DEBUG] org.apache.maven:maven-core:jar:2.0.6:compile
[DEBUG] org.apache.maven:maven-plugin-parameter-documenter:jar:2.0.6:compile
[DEBUG] org.apache.maven.reporting:maven-reporting-api:jar:2.0.6:compile
[DEBUG] org.apache.maven.doxia:doxia-sink-api:jar:1.0-alpha-7:compile
[DEBUG] org.apache.maven:maven-repository-metadata:jar:2.0.6:compile
[DEBUG] org.apache.maven:maven-error-diagnostics:jar:2.0.6:compile
[DEBUG] commons-cli:commons-cli:jar:1.0:compile
[DEBUG] org.apache.maven:maven-plugin-descriptor:jar:2.0.6:compile
[DEBUG] org.codehaus.plexus:plexus-interactivity-api:jar:1.0-alpha-4:compile
[DEBUG] classworlds:classworlds:jar:1.1:compile
[DEBUG] org.apache.maven:maven-artifact:jar:2.0.6:compile
[DEBUG] org.apache.maven:maven-settings:jar:2.0.6:compile
[DEBUG] org.apache.maven:maven-model:jar:2.0.6:compile
[DEBUG] org.apache.maven:maven-monitor:jar:2.0.6:compile
[DEBUG] org.codehaus.plexus:plexus-container-default:jar:1.0-alpha-9-stable-1:compile
[DEBUG] junit:junit:jar:3.8.1:compile
[DEBUG] org.codehaus.plexus:plexus-utils:jar:2.0.5:compile
[DEBUG] org.apache.maven.shared:maven-filtering:jar:1.0-beta-4:compile
[DEBUG] org.sonatype.plexus:plexus-build-api:jar:0.0.4:compile
[DEBUG] org.codehaus.plexus:plexus-interpolation:jar:1.13:compile
[DEBUG] Created new class realm plugin>org.apache.maven.plugins:maven-resources-plugin:2.4.3
[DEBUG] Importing foreign packages into class realm plugin>org.apache.maven.plugins:maven-resources-plugin:2.4.3
[DEBUG] Imported: < project>org.openhab:pom-addons2:2.3.0-SNAPSHOT
[DEBUG] Populating class realm plugin>org.apache.maven.plugins:maven-resources-plugin:2.4.3
[DEBUG] Included: org.apache.maven.plugins:maven-resources-plugin:jar:2.4.3
[DEBUG] Included: org.apache.maven.reporting:maven-reporting-api:jar:2.0.6
[DEBUG] Included: org.apache.maven.doxia:doxia-sink-api:jar:1.0-alpha-7
[DEBUG] Included: commons-cli:commons-cli:jar:1.0
[DEBUG] Included: org.codehaus.plexus:plexus-interactivity-api:jar:1.0-alpha-4
[DEBUG] Included: junit:junit:jar:3.8.1
[DEBUG] Included: org.codehaus.plexus:plexus-utils:jar:2.0.5
[DEBUG] Included: org.apache.maven.shared:maven-filtering:jar:1.0-beta-4
[DEBUG] Included: org.sonatype.plexus:plexus-build-api:jar:0.0.4
[DEBUG] Included: org.codehaus.plexus:plexus-interpolation:jar:1.13
[DEBUG] Configuring mojo org.apache.maven.plugins:maven-resources-plugin:2.4.3:resources from plugin realm ClassRealm[plugin>org.apache.maven.plugins:maven-resources-plugin:2.4.3, parent: sun.misc.Launcher$AppClassLoader@70dea4e]
[DEBUG] Configuring mojo 'org.apache.maven.plugins:maven-resources-plugin:2.4.3:resources' with basic configurator -->
[DEBUG] (f) buildFilters = []
[DEBUG] (f) encoding = UTF-8
[DEBUG] (f) escapeWindowsPaths = true
[DEBUG] (s) includeEmptyDirs = false
[DEBUG] (s) outputDirectory = D:\Users\user\openhab\openhab2-master\git\openhab2-addons\addons\binding\org.openhab.binding.eurothermostat\target\classes
[DEBUG] (s) overwrite = false
[DEBUG] (f) project = MavenProject: org.openhab.binding:org.openhab.binding.eurothermostat:2.3.0-SNAPSHOT @ D:\Users\user\openhab\openhab2-master\git\openhab2-addons\addons\binding\org.openhab.binding.eurothermostat\pom.xml
[DEBUG] (s) resources = [Resource {targetPath: null, filtering: false, FileSet {directory: D:\Users\user\openhab\openhab2-master\git\openhab2-addons\addons\binding\org.openhab.binding.eurothermostat\src\main\resources, PatternSet [includes: {}, excludes: {}]}}]
[DEBUG] (f) session = org.apache.maven.execution.MavenSession@69aa2adb
[DEBUG] (f) useBuildFilters = true
[DEBUG] (s) useDefaultDelimiters = true
[DEBUG] -- end configuration --
[DEBUG] properties used {file.encoding.pkg=sun.io, env.PROMPT=$P$G, user.language.format=de, env.VS120COMNTOOLS=C:\Program Files (x86)\Microsoft Visual Studio 12.0\Common7\Tools\, env.=D:=D:\Users\user\openhab\openhab2-master\git\openhab2-addons, java.home=C:\Program Files\Java\jdk1.8.0_65\jre, env.DXSDK_DIR=D:\SDKs\Microsoft DirectX SDK (June 2010)\, bundle.namespace=org.openhab.binding.eurothermostat, unqualifiedVersion=2.3.0, classworlds.conf=D:\Users\user\Desktop\apache-maven-3.5.3\bin\..\bin\m2.conf, env.OPENCV_DIR=C:\Program Files\opencv\build\x64\vc12, java.endorsed.dirs=C:\Program Files\Java\jdk1.8.0_65\jre\lib\endorsed, env.USERNAME=user, groovy.eclipse.compiler.version=2.9.2-01, env.JD2_HOME=D:\Users\user\AppData\Local\JDownloader 2.0, sun.os.patch.level=, java.vendor.url=http://java.oracle.com/, env.COMPUTERNAME=LAPLUKE, java.version=1.8.0_65, env.ANDROID_HOME=C:\Users\user\AppData\Local\Android\sdk, java.vendor.url.bug=http://bugreport.sun.com/bugreport/, env.USERPROFILE=D:\Users\user, user.name=user, sun.io.unicode.encoding=UnicodeLittle, sun.jnu.encoding=Cp1252, java.runtime.name=Java(TM) SE Runtime Environment, env.CHOCOLATEYLASTPATHUPDATE=Do Dez 21 18:29:09 2017, env.LOCALAPPDATA=D:\Users\user\AppData\Local, env.COMMONPROGRAMW6432=C:\Program Files\Common Files, env.VS140COMNTOOLS=C:\Program Files (x86)\Microsoft Visual Studio 14.0\Common7\Tools\, java.specification.name=Java Platform API Specification, user.timezone=, user.script=, path.separator=;, env.MAVEN_CMD_LINE_ARGS=-fae install -rf :org.openhab.binding.eurothermostat -X -Dtycho.debug.resolver=true, license.maven.plugin.version=2.10, env.PROCESSOR_IDENTIFIER=Intel64 Family 6 Model 58 Stepping 9, GenuineIntel, file.encoding=Cp1252, bundle.symbolicName=org.openhab.binding.eurothermostat, sun.java.command=org.codehaus.plexus.classworlds.launcher.Launcher -fae install -rf :org.openhab.binding.eurothermostat -X -Dtycho.debug.resolver=true, env.NUMBER_OF_PROCESSORS=4, env.APPDATA=D:\Users\user\AppData\Roaming, env.MSYS2_BIN=C:\msys64\usr\bin\bash.exe, esh.releaseVersion=0.9.0, env.WINDIR=C:\WINDOWS, tycho-groupid=org.eclipse.tycho, env.FSHARPINSTALLDIR=C:\Program Files (x86)\Microsoft SDKs\F#\10.1\Framework\v4.0\, java.io.tmpdir=D:\Users\user\AppData\Local\Temp\, user.language=en, line.separator=
, nrjavaserial.version=3.12.0.OH, tycho.env.osgi.os=win32, env.COMMONPROGRAMFILES=C:\Program Files\Common Files, qualifiedVersion=2.3.0.201803111804, java.vm.info=mixed mode, ohdr.version=1.0.22, sun.desktop=windows, java.vm.specification.name=Java Virtual Machine Specification, project.reporting.outputEncoding=UTF-8, tycho-version=1.0.0, esh.version=0.10.0-SNAPSHOT, maven.compiler.plugin.version=3.3, env.PATHEXT=.COM;.EXE;.BAT;.CMD;.VBS;.VBE;.JS;.JSE;.WSF;.WSH;.MSC;.PY;.PYW;.RB;.RBW, env.WDIR=D:\, env.ONEDRIVE=D:\Users\user\OneDrive, env.USERDOMAIN_ROAMINGPROFILE=LAPLUKE, build.helper.maven.plugin.version=1.9.1, ohc.version=2.3.0-SNAPSHOT, env.LOGONSERVER=\\LAPLUKE, env.PSMODULEPATH=C:\WINDOWS\system32\WindowsPowerShell\v1.0\Modules\;C:\Program Files\WindowsPowerShell\Modules\;C:\Program Files (x86)\Microsoft SDKs\Azure\PowerShell\ResourceManager\AzureResourceManager\;C:\Program Files (x86)\Microsoft SDKs\Azure\PowerShell\ServiceManagement\;C:\Program Files (x86)\Microsoft SDKs\Azure\PowerShell\Storage\, java.awt.printerjob=sun.awt.windows.WPrinterJob, env.JAVACMD=C:\Program Files\Java\jdk1.8.0_65\bin\java.exe, env.JVMCONFIG=\.mvn\jvm.config, buildQualifier=201803111804, env.PUBLIC=D:\Users\Public, env.USERDOMAIN=LAPLUKE, user.country.format=DE, env.VBOX_MSI_INSTALL_PATH=C:\Program Files\Oracle\VirtualBox\, jetty.version=9.3.22.v20171030, env.PROCESSOR_LEVEL=6, env.PROGRAMFILES(X86)=C:\Program Files (x86), env.=EXITCODE=00000001, os.name=Windows 10, java.specification.vendor=Oracle Corporation, env.TMP=D:\Users\user\AppData\Local\Temp, java.vm.name=Java HotSpot(TM) 64-Bit Server VM, env.OS=Windows_NT, java.library.path=C:\Program Files\Java\jdk1.8.0_65\bin;C:\WINDOWS\Sun\Java\bin;C:\WINDOWS\system32;C:\WINDOWS;D:\Programs\Python\Python36-32\Scripts\;D:\Programs\Python\Python36-32\;C:\Python27\;C:\Python27\Scripts;C:\Windows\System32\WindowsPowerShell\v1.0\;C:\Program Files\7-Zip\;C:\Program Files (x86)\NVIDIA Corporation\PhysX\Common;C:\ProgramData\Oracle\Java\javapath;C:\Windows\System32;C:\Windows;C:\Program Files\SysinternalsSuite\;C:\Windows\System32\wbem;C:\Users\user\.dnx\bin;C:\Program Files\Microsoft DNX\Dnvm\;C:\Program Files\Microsoft SQL Server\120\Tools\Binn\;C:\Program Files\Microsoft\Web Platform Installer\;C:\Program Files\Dell\DW WLAN Card;C:\Program Files\MiKTeX 2.9\miktex\bin\x64\;C:\msys64\usr\bin\bash.exe;C:\Program Files (x86)\Skype\Phone\;C:\Program Files\nodejs\;C:\Program Files\Common Files\Autodesk Shared\;C:\Windows\System32;C:\Windows;C:\Windows\System32\wbem;C:\Windows\System32\WindowsPowerShell\v1.0\;C:\Program Files\Microsoft SQL Server\130\Tools\Binn\;C:\Program Files (x86)\Microsoft Emulator Manager\1.0\;C:\Users\user\AppData\Local\Android\sdk\tools;C:\Users\user\AppData\Local\Android\sdk\platform-tools;C:\Program Files (x86)\Microsoft SDKs\Azure\CLI\wbin;C:\Program Files (x86)\Microsoft SQL Server\110\DTS\Binn\;C:\Program Files (x86)\Microsoft SQL Server\120\DTS\Binn\;C:\Program Files (x86)\Microsoft SQL Server\130\DTS\Binn\;C:\MinGW\bin\;C:\Program Files\dotnet\;C:\ProgramData\Anaconda2;C:\ProgramData\Anaconda2\Scripts;C:\ProgramData\Anaconda2\Library\bin;C:\Program Files\TortoiseSVN\bin;C:\Program Files\PuTTY\;C:\Program Files\Calibre2\;C:\Program Files (x86)\GnuPG\bin;C:\ProgramData\chocolatey\bin;C:\Program Files (x86)\Microsoft SQL Server\Client SDK\ODBC\130\Tools\Binn\;C:\Program Files (x86)\Microsoft SQL Server\140\Tools\Binn\;C:\Program Files (x86)\Microsoft SQL Server\140\DTS\Binn\;C:\Program Files (x86)\Microsoft SQL Server\140\Tools\Binn\ManagementStudio\;C:\Program Files\LLVM\bin;C:\Program Files\TortoiseGit\bin;C:\Program Files\Git\cmd;D:\Users\user\.dnx\bin;C:\Ruby\22-x64\bin;C:\Program Files\SysinternalsSuite\;D:\Users\user\AppData\Roaming\npm;D:\Users\user\AppData\Local\Microsoft\WindowsApps;C:\Program Files (x86)\Microsoft VS Code Insiders\bin;C:\Program Files\apache-maven-3.5.0\bin;C:\Program Files (x86)\mitmproxy\bin;D:\Users\user\AppData\Local\Microsoft\WindowsApps;D:\Users\user\AppData\Roaming\MiKTeX\2.9\miktex\bin\x64\;;., env.PROGRAMW6432=C:\Program Files, env.PATH=D:\Programs\Python\Python36-32\Scripts\;D:\Programs\Python\Python36-32\;C:\Python27\;C:\Python27\Scripts;C:\Windows\System32\WindowsPowerShell\v1.0\;C:\Program Files\7-Zip\;C:\Program Files (x86)\NVIDIA Corporation\PhysX\Common;C:\ProgramData\Oracle\Java\javapath;C:\Windows\System32;C:\Windows;C:\Program Files\SysinternalsSuite\;C:\Windows\System32\wbem;C:\Users\user\.dnx\bin;C:\Program Files\Microsoft DNX\Dnvm\;C:\Program Files\Microsoft SQL Server\120\Tools\Binn\;C:\Program Files\Microsoft\Web Platform Installer\;C:\Program Files\Dell\DW WLAN Card;C:\Program Files\MiKTeX 2.9\miktex\bin\x64\;C:\msys64\usr\bin\bash.exe;C:\Program Files (x86)\Skype\Phone\;C:\Program Files\nodejs\;C:\Program Files\Common Files\Autodesk Shared\;C:\Windows\System32;C:\Windows;C:\Windows\System32\wbem;C:\Windows\System32\WindowsPowerShell\v1.0\;C:\Program Files\Microsoft SQL Server\130\Tools\Binn\;C:\Program Files (x86)\Microsoft Emulator Manager\1.0\;C:\Users\user\AppData\Local\Android\sdk\tools;C:\Users\user\AppData\Local\Android\sdk\platform-tools;C:\Program Files (x86)\Microsoft SDKs\Azure\CLI\wbin;C:\Program Files (x86)\Microsoft SQL Server\110\DTS\Binn\;C:\Program Files (x86)\Microsoft SQL Server\120\DTS\Binn\;C:\Program Files (x86)\Microsoft SQL Server\130\DTS\Binn\;C:\MinGW\bin\;C:\Program Files\dotnet\;C:\ProgramData\Anaconda2;C:\ProgramData\Anaconda2\Scripts;C:\ProgramData\Anaconda2\Library\bin;C:\Program Files\TortoiseSVN\bin;C:\Program Files\PuTTY\;C:\Program Files\Calibre2\;C:\Program Files (x86)\GnuPG\bin;C:\ProgramData\chocolatey\bin;C:\Program Files (x86)\Microsoft SQL Server\Client SDK\ODBC\130\Tools\Binn\;C:\Program Files (x86)\Microsoft SQL Server\140\Tools\Binn\;C:\Program Files (x86)\Microsoft SQL Server\140\DTS\Binn\;C:\Program Files (x86)\Microsoft SQL Server\140\Tools\Binn\ManagementStudio\;C:\Program Files\LLVM\bin;C:\Program Files\TortoiseGit\bin;C:\Program Files\Git\cmd;D:\Users\user\.dnx\bin;C:\Ruby\22-x64\bin;C:\Program Files\SysinternalsSuite\;D:\Users\user\AppData\Roaming\npm;D:\Users\user\AppData\Local\Microsoft\WindowsApps;C:\Program Files (x86)\Microsoft VS Code Insiders\bin;C:\Program Files\apache-maven-3.5.0\bin;C:\Program Files (x86)\mitmproxy\bin;D:\Users\user\AppData\Local\Microsoft\WindowsApps;D:\Users\user\AppData\Roaming\MiKTeX\2.9\miktex\bin\x64\;, repo.version=2.2.x, library.jansi.path=D:\Users\user\Desktop\apache-maven-3.5.3\bin\..\lib\jansi-native, tycho.env.osgi.arch=x86_64, java.class.version=52.0, maven.multiModuleProjectDirectory=D:\Users\user\openhab\openhab2-master\git\openhab2-addons, sat.version=0.4.1, env.HOMEDRIVE=D:, env.SYSTEMROOT=C:\WINDOWS, maven.compiler.version=3.6.1, env.COMSPEC=C:\WINDOWS\system32\cmd.exe, sun.boot.library.path=C:\Program Files\Java\jdk1.8.0_65\jre\bin, project.build.sourceEncoding=UTF-8, env.SYSTEMDRIVE=C:, env.PROCESSOR_REVISION=3a09, basedirRoot=D:\Users\user\openhab\openhab2-master\git\openhab2-addons, sun.management.compiler=HotSpot 64-Bit Tiered Compilers, java.awt.graphicsenv=sun.awt.Win32GraphicsEnvironment, user.variant=, env.PROGRAMFILES=C:\Program Files, tycho.env.osgi.ws=win32, java.vm.specification.version=1.8, env.PROGRAMDATA=C:\ProgramData, awt.toolkit=sun.awt.windows.WToolkit, env.MAVEN_HOME=D:\Users\user\Desktop\apache-maven-3.5.3\bin\.., sun.cpu.isalist=amd64, sun.stderr.encoding=cp850, env.MAVEN_PROJECTBASEDIR=D:\Users\user\openhab\openhab2-master\git\openhab2-addons, java.ext.dirs=C:\Program Files\Java\jdk1.8.0_65\jre\lib\ext;C:\WINDOWS\Sun\Java\lib\ext, env.SSL_CERT_FILE=C:\Ruby\cacert.pem, os.version=10.0, env.ERROR_CODE=0, user.home=D:\Users\user, env.CHOCOLATEYINSTALL=C:\ProgramData\chocolatey, java.vm.vendor=Oracle Corporation, env.JAVA_HOME=C:\Program Files\Java\jdk1.8.0_65, user.dir=D:\Users\user\openhab\openhab2-master\git\openhab2-addons, maven.conf=D:\Users\user\Desktop\apache-maven-3.5.3\bin\../conf, jdt-annotations.version=2.1.0, env.COMMONPROGRAMFILES(X86)=C:\Program Files (x86)\Common Files, sun.cpu.endian=little, env.ALLUSERSPROFILE=C:\ProgramData, env.CLASSWORLDS_LAUNCHER=org.codehaus.plexus.classworlds.launcher.Launcher, env.PROCESSOR_ARCHITECTURE=AMD64, java.vm.version=25.65-b01, java.class.path=D:\Users\user\Desktop\apache-maven-3.5.3\bin\..\boot\plexus-classworlds-2.5.2.jar, env.=::=::\, env.HOMEPATH=\Users\user, env.EXEC_DIR=D:\Users\user\openhab\openhab2-master\git\openhab2-addons, os.arch=amd64, maven.build.version=Apache Maven 3.5.3 (3383c37e1f9e9b3bc3df5050c29c8aff9f295297; 2018-02-24T20:49:05+01:00), env.SESSIONNAME=Console, tycho.debug.resolver=true, sun.java.launcher=SUN_STANDARD, groovy.eclipse.batch.version=2.4.3-01, java.vm.specification.vendor=Oracle Corporation, ds-annotations.version=1.2.10, file.separator=\, java.runtime.version=1.8.0_65-b17, sun.boot.class.path=C:\Program Files\Java\jdk1.8.0_65\jre\lib\resources.jar;C:\Program Files\Java\jdk1.8.0_65\jre\lib\rt.jar;C:\Program Files\Java\jdk1.8.0_65\jre\lib\sunrsasign.jar;C:\Program Files\Java\jdk1.8.0_65\jre\lib\jsse.jar;C:\Program Files\Java\jdk1.8.0_65\jre\lib\jce.jar;C:\Program Files\Java\jdk1.8.0_65\jre\lib\charsets.jar;C:\Program Files\Java\jdk1.8.0_65\jre\lib\jfr.jar;C:\Program Files\Java\jdk1.8.0_65\jre\classes, scm.gitBaseUrl=https://github.com/openhab, env.ADSK_3DSMAX_X64_2017=D:\Temp\3ds MAX\3ds Max 2017\, maven.version=3.5.3, jackson.version=1.9.13, env.TEMP=D:\Users\user\AppData\Local\Temp, env.VS110COMNTOOLS=C:\Program Files (x86)\Microsoft Visual Studio 11.0\Common7\Tools\, user.country=US, maven.home=D:\Users\user\Desktop\apache-maven-3.5.3\bin\.., maven.compiler.target=1.8, java.vendor=Oracle Corporation, karaf.version=4.1.3, env.CLASSWORLDS_JAR="D:\Users\user\Desktop\apache-maven-3.5.3\bin\..\boot\plexus-classworlds-2.5.2.jar", maven.compiler.source=1.8, java.specification.version=1.8, sun.arch.data.model=64}
[INFO] Using 'UTF-8' encoding to copy filtered resources.
[DEBUG] resource with targetPath null
directory D:\Users\user\openhab\openhab2-master\git\openhab2-addons\addons\binding\org.openhab.binding.eurothermostat\src\main\resources
excludes []
includes []
[INFO] skip non existing resourceDirectory D:\Users\user\openhab\openhab2-master\git\openhab2-addons\addons\binding\org.openhab.binding.eurothermostat\src\main\resources
[INFO]
[INFO] --- tycho-compiler-plugin:1.0.0:compile (default-compile) @ org.openhab.binding.eurothermostat ---
[DEBUG] Dependency collection stats: {ConflictMarker.analyzeTime=129727, ConflictMarker.markTime=107148, ConflictMarker.nodeCount=99, ConflictIdSorter.graphTime=55011, ConflictIdSorter.topsortTime=53779, ConflictIdSorter.conflictIdCount=44, ConflictIdSorter.conflictIdCycleCount=0, ConflictResolver.totalTime=1031658, ConflictResolver.conflictItemCount=98, DefaultDependencyCollector.collectTime=13258431, DefaultDependencyCollector.transformTime=1421660}
[DEBUG] org.eclipse.tycho:tycho-compiler-plugin:jar:1.0.0:
[DEBUG] org.apache.maven:maven-plugin-api:jar:3.0:compile
[DEBUG] org.apache.maven:maven-model:jar:3.0:compile
[DEBUG] org.apache.maven:maven-artifact:jar:3.0:compile
[DEBUG] org.sonatype.sisu:sisu-inject-plexus:jar:1.4.2:compile
[DEBUG] org.codehaus.plexus:plexus-classworlds:jar:2.2.3:compile
[DEBUG] org.sonatype.sisu:sisu-inject-bean:jar:1.4.2:compile
[DEBUG] org.sonatype.sisu:sisu-guice:jar:noaop:2.1.7:compile
[DEBUG] org.apache.maven:maven-compat:jar:3.0:compile
[DEBUG] org.apache.maven:maven-model-builder:jar:3.0:compile
[DEBUG] org.apache.maven:maven-settings:jar:3.0:compile
[DEBUG] org.apache.maven:maven-core:jar:3.0:compile
[DEBUG] org.apache.maven:maven-settings-builder:jar:3.0:compile
[DEBUG] org.apache.maven:maven-repository-metadata:jar:3.0:compile
[DEBUG] org.apache.maven:maven-aether-provider:jar:3.0:runtime
[DEBUG] org.sonatype.aether:aether-impl:jar:1.7:compile
[DEBUG] org.sonatype.aether:aether-spi:jar:1.7:compile
[DEBUG] org.sonatype.aether:aether-api:jar:1.7:compile
[DEBUG] org.sonatype.aether:aether-util:jar:1.7:compile
[DEBUG] org.sonatype.plexus:plexus-sec-dispatcher:jar:1.3:compile
[DEBUG] org.sonatype.plexus:plexus-cipher:jar:1.7:compile
[DEBUG] org.codehaus.plexus:plexus-interpolation:jar:1.14:compile
[DEBUG] org.codehaus.plexus:plexus-component-annotations:jar:1.5.5:compile
[DEBUG] org.apache.maven.wagon:wagon-provider-api:jar:1.0-beta-6:compile
[DEBUG] org.codehaus.plexus:plexus-utils:jar:3.0.7:compile
[DEBUG] org.codehaus.plexus:plexus-compiler-manager:jar:2.2:compile
[DEBUG] org.codehaus.plexus:plexus-compiler-api:jar:2.2:compile
[DEBUG] org.eclipse.tycho:tycho-core:jar:1.0.0:compile
[DEBUG] org.codehaus.plexus:plexus-archiver:jar:2.9.1:compile
[DEBUG] org.codehaus.plexus:plexus-io:jar:2.4.1:compile
[DEBUG] commons-io:commons-io:jar:2.2:compile
[DEBUG] org.apache.commons:commons-compress:jar:1.9:compile
[DEBUG] org.eclipse.tycho:org.eclipse.osgi.compatibility.state:jar:1.0.200.v20160504-1419:compile
[DEBUG] org.eclipse.tycho:sisu-equinox-embedder:jar:1.0.0:compile
[DEBUG] org.eclipse.tycho:org.eclipse.osgi:jar:3.11.2.v20161107-1947:compile
[DEBUG] org.eclipse.tycho:sisu-equinox-api:jar:1.0.0:compile
[DEBUG] org.eclipse.tycho:tycho-metadata-model:jar:1.0.0:compile
[DEBUG] de.pdark:decentxml:jar:1.3:compile
[DEBUG] org.eclipse.tycho:tycho-embedder-api:jar:1.0.0:compile
[DEBUG] org.eclipse.tycho:org.eclipse.tycho.embedder.shared:jar:1.0.0:compile
[DEBUG] org.eclipse.tycho:org.eclipse.tycho.core.shared:jar:1.0.0:compile
[DEBUG] org.eclipse.tycho:tycho-compiler-jdt:jar:1.0.0:compile
[DEBUG] org.eclipse.tycho:org.eclipse.jdt.core:jar:3.12.2.v20161117-1814:compile
[DEBUG] org.eclipse.tycho:org.eclipse.jdt.compiler.apt:jar:1.2.100.v20160418-1457:compile
[DEBUG] Created new class realm plugin>org.eclipse.tycho:tycho-compiler-plugin:1.0.0
[DEBUG] Importing foreign packages into class realm plugin>org.eclipse.tycho:tycho-compiler-plugin:1.0.0
[DEBUG] Imported: < project>org.openhab:pom-addons2:2.3.0-SNAPSHOT
[DEBUG] Populating class realm plugin>org.eclipse.tycho:tycho-compiler-plugin:1.0.0
[DEBUG] Included: org.eclipse.tycho:tycho-compiler-plugin:jar:1.0.0
[DEBUG] Included: org.sonatype.sisu:sisu-inject-bean:jar:1.4.2
[DEBUG] Included: org.sonatype.sisu:sisu-guice:jar:noaop:2.1.7
[DEBUG] Included: org.sonatype.aether:aether-util:jar:1.7
[DEBUG] Included: org.sonatype.plexus:plexus-sec-dispatcher:jar:1.3
[DEBUG] Included: org.sonatype.plexus:plexus-cipher:jar:1.7
[DEBUG] Included: org.codehaus.plexus:plexus-interpolation:jar:1.14
[DEBUG] Included: org.codehaus.plexus:plexus-component-annotations:jar:1.5.5
[DEBUG] Included: org.codehaus.plexus:plexus-utils:jar:3.0.7
[DEBUG] Included: org.codehaus.plexus:plexus-compiler-manager:jar:2.2
[DEBUG] Included: org.codehaus.plexus:plexus-compiler-api:jar:2.2
[DEBUG] Included: org.codehaus.plexus:plexus-archiver:jar:2.9.1
[DEBUG] Included: org.codehaus.plexus:plexus-io:jar:2.4.1
[DEBUG] Included: commons-io:commons-io:jar:2.2
[DEBUG] Included: org.apache.commons:commons-compress:jar:1.9
[DEBUG] Included: org.eclipse.tycho:org.eclipse.osgi.compatibility.state:jar:1.0.200.v20160504-1419
[DEBUG] Included: org.eclipse.tycho:tycho-compiler-jdt:jar:1.0.0
[DEBUG] Included: org.eclipse.tycho:org.eclipse.jdt.core:jar:3.12.2.v20161117-1814
[DEBUG] Included: org.eclipse.tycho:org.eclipse.jdt.compiler.apt:jar:1.2.100.v20160418-1457
[DEBUG] Configuring mojo org.eclipse.tycho:tycho-compiler-plugin:1.0.0:compile from plugin realm ClassRealm[plugin>org.eclipse.tycho:tycho-compiler-plugin:1.0.0, parent: sun.misc.Launcher$AppClassLoader@70dea4e]
[DEBUG] Configuring mojo 'org.eclipse.tycho:tycho-compiler-plugin:1.0.0:compile' with basic configurator -->
[DEBUG] (f) basedir = D:\Users\user\openhab\openhab2-master\git\openhab2-addons\addons\binding\org.openhab.binding.eurothermostat
[DEBUG] (f) buildDirectory = D:\Users\user\openhab\openhab2-master\git\openhab2-addons\addons\binding\org.openhab.binding.eurothermostat\target
[DEBUG] (f) compilerArgs = [-warn:+nullAnnot(org.eclipse.jdt.annotation.Nullable|org.eclipse.jdt.annotation.NonNull|org.eclipse.jdt.annotation.NonNullByDefault),+null,+inheritNullAnnot,+nullAnnotConflict,+nullUncheckedConversion,+nullAnnotRedundant,+nullDereference]
[DEBUG] (f) compilerId = jdt
[DEBUG] (f) copyResources = true
[DEBUG] (f) debug = true
[DEBUG] (f) encoding = UTF-8
[DEBUG] (s) groupId = org.eclipse.jdt
[DEBUG] (s) artifactId = org.eclipse.jdt.annotation
[DEBUG] (s) version = 2.1.0
[DEBUG] (s) groupId = org.apache.felix
[DEBUG] (s) artifactId = org.apache.felix.scr.ds-annotations
[DEBUG] (s) version = 1.2.10
[DEBUG] (f) extraClasspathElements = [Dependency {groupId=org.eclipse.jdt, artifactId=org.eclipse.jdt.annotation, version=2.1.0, type=jar}, Dependency {groupId=org.apache.felix, artifactId=org.apache.felix.scr.ds-annotations, version=1.2.10, type=jar}]
[DEBUG] (f) fork = false
[DEBUG] (f) generatedSourcesDirectory = D:\Users\user\openhab\openhab2-master\git\openhab2-addons\addons\binding\org.openhab.binding.eurothermostat\target\generated-sources\annotations
[DEBUG] (f) logDirectory = D:\Users\user\openhab\openhab2-master\git\openhab2-addons\addons\binding\org.openhab.binding.eurothermostat\target\compile-logs
[DEBUG] (f) optimize = false
[DEBUG] (f) outputFileName = org.openhab.binding.eurothermostat-2.3.0-SNAPSHOT
[DEBUG] (f) project = MavenProject: org.openhab.binding:org.openhab.binding.eurothermostat:2.3.0-SNAPSHOT @ D:\Users\user\openhab\openhab2-master\git\openhab2-addons\addons\binding\org.openhab.binding.eurothermostat\pom.xml
[DEBUG] (f) requireJREPackageImports = false
[DEBUG] (f) session = org.apache.maven.execution.MavenSession@69aa2adb
[DEBUG] (f) showDeprecation = false
[DEBUG] (f) showWarnings = false
[DEBUG] (f) source = 1.8
[DEBUG] (f) staleMillis = 0
[DEBUG] (f) strictCompilerTarget = false
[DEBUG] (f) target = 1.8
[DEBUG] (f) useJDK = SYSTEM
[DEBUG] (f) useProjectSettings = true
[DEBUG] (f) verbose = false
[DEBUG] -- end configuration --
[DEBUG] Manifest BREEs: [OSGi profile 'JavaSE-1.8' { source level: 1.8, target level: 1.8}]
[DEBUG] Effective EE: OSGi profile 'JavaSE-1.8' { source level: 1.8, target level: 1.8}
[DEBUG] Effective source/target: 1.8/1.8
[DEBUG] Using compiler 'jdt'.
[DEBUG] Source directories: [D:\Users\user\openhab\openhab2-master\git\openhab2-addons\addons\binding\org.openhab.binding.eurothermostat\src\main\java]
[DEBUG] Classpath: [D:\Users\user\openhab\openhab2-master\git\openhab2-addons\addons\binding\org.openhab.binding.eurothermostat\target\classes
D:\Users\user\.m2\repository\p2\osgi\bundle\org.eclipse.jdt.annotation\2.1.100.v20170511-1408\org.eclipse.jdt.annotation-2.1.100.v20170511-1408.jar[+org/eclipse/jdt/annotation/*;?**/*]
D:\Users\user\.m2\repository\p2\osgi\bundle\org.eclipse.smarthome.config.core\0.10.0.201802191927\org.eclipse.smarthome.config.core-0.10.0.201802191927.jar[+org/eclipse/smarthome/config/core/*;?**/*]
D:\Users\user\.m2\repository\p2\osgi\bundle\org.eclipse.smarthome.core.thing\0.10.0.201802191927\org.eclipse.smarthome.core.thing-0.10.0.201802191927.jar[+org/eclipse/smarthome/core/thing/*;+org/eclipse/smarthome/core/thing/binding/*;+org/eclipse/smarthome/core/thing/binding/builder/*;+org/eclipse/smarthome/core/thing/type/*;?**/*]
D:\Users\user\.m2\repository\p2\osgi\bundle\org.eclipse.smarthome.core\0.10.0.201802191927\org.eclipse.smarthome.core-0.10.0.201802191927.jar[+org/eclipse/smarthome/core/library/types/*;+org/eclipse/smarthome/core/types/*;?**/*]
D:\Users\user\.m2\repository\p2\osgi\bundle\org.slf4j.api\1.7.2.v20121108-1250\org.slf4j.api-1.7.2.v20121108-1250.jar[+org/slf4j/*;?**/*]
D:\Users\user\.m2\repository\org\eclipse\jdt\org.eclipse.jdt.annotation\2.1.0\org.eclipse.jdt.annotation-2.1.0.jar
D:\Users\user\.m2\repository\org\apache\felix\org.apache.felix.scr.ds-annotations\1.2.10\org.apache.felix.scr.ds-annotations-1.2.10.jar
D:\Users\user\.m2\repository\org\apache\felix\org.apache.felix.scr.generator\1.16.0\org.apache.felix.scr.generator-1.16.0.jar
D:\Users\user\.m2\repository\org\ow2\asm\asm-all\5.1\asm-all-5.1.jar
D:\Users\user\.m2\repository\org\osgi\org.osgi.core\4.2.0\org.osgi.core-4.2.0.jar
D:\Users\user\.m2\repository\org\osgi\org.osgi.compendium\4.3.0\org.osgi.compendium-4.3.0.jar
D:\Users\user\.m2\repository\junit\junit\4.12\junit-4.12.jar
D:\Users\user\.m2\repository\org\hamcrest\hamcrest-core\1.3\hamcrest-core-1.3.jar
D:\Users\user\.m2\repository\org\easymock\easymock\3.4\easymock-3.4.jar
D:\Users\user\.m2\repository\org\objenesis\objenesis\2.2\objenesis-2.2.jar
D:\Users\user\.m2\repository\org\mockito\mockito-all\1.10.19\mockito-all-1.10.19.jar]
[DEBUG] Output directory: D:\Users\user\openhab\openhab2-master\git\openhab2-addons\addons\binding\org.openhab.binding.eurothermostat\target\classes
[WARNING] Parameter 'useProjectSettings' is set to true, but preferences file 'D:\Users\user\openhab\openhab2-master\git\openhab2-addons\addons\binding\org.openhab.binding.eurothermostat\.settings\org.eclipse.jdt.core.prefs' could not be found!
[INFO] Nothing to compile - all classes are up to date
[INFO]
[INFO] --- maven-compiler-plugin:3.6.1:compile (default) @ org.openhab.binding.eurothermostat ---
[DEBUG] Dependency collection stats: {ConflictMarker.analyzeTime=239338, ConflictMarker.markTime=175706, ConflictMarker.nodeCount=184, ConflictIdSorter.graphTime=97295, ConflictIdSorter.topsortTime=328833, ConflictIdSorter.conflictIdCount=57, ConflictIdSorter.conflictIdCycleCount=1, ConflictResolver.totalTime=5090965, ConflictResolver.conflictItemCount=84, DefaultDependencyCollector.collectTime=95281220, DefaultDependencyCollector.transformTime=5971549}
[DEBUG] org.apache.maven.plugins:maven-compiler-plugin:jar:3.6.1:
[DEBUG] org.codehaus.groovy:groovy-eclipse-compiler:jar:2.9.2-01:runtime
[DEBUG] org.codehaus.plexus:plexus-container-default:jar:1.5.4:runtime
[DEBUG] org.apache.xbean:xbean-reflect:jar:3.4:runtime
[DEBUG] log4j:log4j:jar:1.2.12:runtime
[DEBUG] commons-logging:commons-logging-api:jar:1.1:runtime
[DEBUG] com.google.collections:google-collections:jar:1.0:runtime
[DEBUG] junit:junit:jar:3.8.2:runtime
[DEBUG] org.codehaus.groovy:groovy-eclipse-batch:jar:2.4.3-01:runtime
[DEBUG] org.apache.maven:maven-plugin-api:jar:3.0:compile
[DEBUG] org.apache.maven:maven-model:jar:3.0:compile
[DEBUG] org.sonatype.sisu:sisu-inject-plexus:jar:1.4.2:compile
[DEBUG] org.sonatype.sisu:sisu-inject-bean:jar:1.4.2:compile
[DEBUG] org.sonatype.sisu:sisu-guice:jar:noaop:2.1.7:compile
[DEBUG] org.apache.maven:maven-artifact:jar:3.0:compile
[DEBUG] org.codehaus.plexus:plexus-utils:jar:2.0.4:compile
[DEBUG] org.apache.maven:maven-core:jar:3.0:compile
[DEBUG] org.apache.maven:maven-settings:jar:3.0:compile
[DEBUG] org.apache.maven:maven-settings-builder:jar:3.0:compile
[DEBUG] org.apache.maven:maven-repository-metadata:jar:3.0:compile
[DEBUG] org.apache.maven:maven-model-builder:jar:3.0:compile
[DEBUG] org.apache.maven:maven-aether-provider:jar:3.0:runtime
[DEBUG] org.sonatype.aether:aether-impl:jar:1.7:compile
[DEBUG] org.sonatype.aether:aether-spi:jar:1.7:compile
[DEBUG] org.sonatype.aether:aether-api:jar:1.7:compile
[DEBUG] org.sonatype.aether:aether-util:jar:1.7:compile
[DEBUG] org.codehaus.plexus:plexus-interpolation:jar:1.14:compile
[DEBUG] org.codehaus.plexus:plexus-classworlds:jar:2.2.3:compile
[DEBUG] org.codehaus.plexus:plexus-component-annotations:jar:1.6:compile
[DEBUG] org.sonatype.plexus:plexus-sec-dispatcher:jar:1.3:compile
[DEBUG] org.sonatype.plexus:plexus-cipher:jar:1.4:compile
[DEBUG] org.apache.maven.shared:maven-shared-utils:jar:3.1.0:compile
[DEBUG] commons-io:commons-io:jar:2.5:compile
[DEBUG] org.apache.maven.shared:maven-shared-incremental:jar:1.1:compile
[DEBUG] org.ow2.asm:asm:jar:6.0_ALPHA:compile
[DEBUG] com.thoughtworks.qdox:qdox:jar:2.0-M5:compile
[DEBUG] org.codehaus.plexus:plexus-compiler-api:jar:2.8.1:compile
[DEBUG] org.codehaus.plexus:plexus-compiler-manager:jar:2.8.1:compile
[DEBUG] org.codehaus.plexus:plexus-compiler-javac:jar:2.8.1:runtime
[DEBUG] Created new class realm plugin>org.apache.maven.plugins:maven-compiler-plugin:3.6.1
[DEBUG] Importing foreign packages into class realm plugin>org.apache.maven.plugins:maven-compiler-plugin:3.6.1
[DEBUG] Imported: < project>org.openhab:pom-addons2:2.3.0-SNAPSHOT
[DEBUG] Populating class realm plugin>org.apache.maven.plugins:maven-compiler-plugin:3.6.1
[DEBUG] Included: org.apache.maven.plugins:maven-compiler-plugin:jar:3.6.1
[DEBUG] Included: org.codehaus.groovy:groovy-eclipse-compiler:jar:2.9.2-01
[DEBUG] Included: org.apache.xbean:xbean-reflect:jar:3.4
[DEBUG] Included: log4j:log4j:jar:1.2.12
[DEBUG] Included: commons-logging:commons-logging-api:jar:1.1
[DEBUG] Included: com.google.collections:google-collections:jar:1.0
[DEBUG] Included: junit:junit:jar:3.8.2
[DEBUG] Included: org.codehaus.groovy:groovy-eclipse-batch:jar:2.4.3-01
[DEBUG] Included: org.sonatype.sisu:sisu-inject-bean:jar:1.4.2
[DEBUG] Included: org.sonatype.sisu:sisu-guice:jar:noaop:2.1.7
[DEBUG] Included: org.codehaus.plexus:plexus-utils:jar:2.0.4
[DEBUG] Included: org.sonatype.aether:aether-util:jar:1.7
[DEBUG] Included: org.codehaus.plexus:plexus-interpolation:jar:1.14
[DEBUG] Included: org.codehaus.plexus:plexus-component-annotations:jar:1.6
[DEBUG] Included: org.sonatype.plexus:plexus-sec-dispatcher:jar:1.3
[DEBUG] Included: org.sonatype.plexus:plexus-cipher:jar:1.4
[DEBUG] Included: org.apache.maven.shared:maven-shared-utils:jar:3.1.0
[DEBUG] Included: commons-io:commons-io:jar:2.5
[DEBUG] Included: org.apache.maven.shared:maven-shared-incremental:jar:1.1
[DEBUG] Included: org.ow2.asm:asm:jar:6.0_ALPHA
[DEBUG] Included: com.thoughtworks.qdox:qdox:jar:2.0-M5
[DEBUG] Included: org.codehaus.plexus:plexus-compiler-api:jar:2.8.1
[DEBUG] Included: org.codehaus.plexus:plexus-compiler-manager:jar:2.8.1
[DEBUG] Included: org.codehaus.plexus:plexus-compiler-javac:jar:2.8.1
[DEBUG] Configuring mojo org.apache.maven.plugins:maven-compiler-plugin:3.6.1:compile from plugin realm ClassRealm[plugin>org.apache.maven.plugins:maven-compiler-plugin:3.6.1, parent: sun.misc.Launcher$AppClassLoader@70dea4e]
[DEBUG] Configuring mojo 'org.apache.maven.plugins:maven-compiler-plugin:3.6.1:compile' with basic configurator -->
[DEBUG] (f) basedir = D:\Users\user\openhab\openhab2-master\git\openhab2-addons\addons\binding\org.openhab.binding.eurothermostat
[DEBUG] (f) buildDirectory = D:\Users\user\openhab\openhab2-master\git\openhab2-addons\addons\binding\org.openhab.binding.eurothermostat\target
[DEBUG] (f) compilePath = [D:\Users\user\openhab\openhab2-master\git\openhab2-addons\addons\binding\org.openhab.binding.eurothermostat\target\classes, D:\Users\user\.m2\repository\org\apache\felix\org.apache.felix.fileinstall\3.4.0\org.apache.felix.fileinstall-3.4.0.jar, D:\Users\user\.m2\repository\org\apache\felix\org.apache.felix.scr.ds-annotations\1.2.10\org.apache.felix.scr.ds-annotations-1.2.10.jar, D:\Users\user\.m2\repository\p2\osgi\bundle\com.google.gson\2.7.0.v20170129-0911\com.google.gson-2.7.0.v20170129-0911.jar, D:\Users\user\.m2\repository\p2\osgi\bundle\com.google.guava\15.0.0.v201403281430\com.google.guava-15.0.0.v201403281430.jar, D:\Users\user\.m2\repository\p2\osgi\bundle\org.eclipse.osgi\3.12.1.v20170821-1548\org.eclipse.osgi-3.12.1.v20170821-1548.jar, D:\Users\user\.m2\repository\p2\osgi\bundle\org.eclipse.osgi.services\3.6.0.v20170228-1906\org.eclipse.osgi.services-3.6.0.v20170228-1906.jar, D:\Users\user\.m2\repository\p2\osgi\bundle\org.eclipse.osgi.util\3.4.0.v20170111-1608\org.eclipse.osgi.util-3.4.0.v20170111-1608.jar, D:\Users\user\.m2\repository\p2\osgi\bundle\org.apache.commons.lang\2.6.0.v201404270220\org.apache.commons.lang-2.6.0.v201404270220.jar, D:\Users\user\.m2\repository\p2\osgi\bundle\org.eclipse.smarthome.config.core\0.10.0.201802191927\org.eclipse.smarthome.config.core-0.10.0.201802191927.jar, D:\Users\user\.m2\repository\p2\osgi\bundle\org.eclipse.smarthome.core\0.10.0.201802191927\org.eclipse.smarthome.core-0.10.0.201802191927.jar, D:\Users\user\.m2\repository\p2\osgi\bundle\org.slf4j.api\1.7.2.v20121108-1250\org.slf4j.api-1.7.2.v20121108-1250.jar, D:\Users\user\.m2\repository\p2\osgi\bundle\org.apache.commons.io\2.2.0.v201405211200\org.apache.commons.io-2.2.0.v201405211200.jar, D:\Users\user\.m2\repository\p2\osgi\bundle\org.apache.commons.collections\3.2.0.v2013030210310\org.apache.commons.collections-3.2.0.v2013030210310.jar, D:\Users\user\.m2\repository\p2\osgi\bundle\org.eclipse.smarthome.core.thing\0.10.0.201802191927\org.eclipse.smarthome.core.thing-0.10.0.201802191927.jar, D:\Users\user\.m2\repository\p2\osgi\bundle\org.eclipse.smarthome.io.console\0.10.0.201802191927\org.eclipse.smarthome.io.console-0.10.0.201802191927.jar, D:\Users\user\.m2\repository\p2\osgi\bundle\org.eclipse.jdt.annotation\2.1.100.v20170511-1408\org.eclipse.jdt.annotation-2.1.100.v20170511-1408.jar]
[DEBUG] (f) compileSourceRoots = [D:\Users\user\openhab\openhab2-master\git\openhab2-addons\addons\binding\org.openhab.binding.eurothermostat\src\main\java]
[DEBUG] (f) compilerId = groovy-eclipse-compiler
[DEBUG] (f) debug = true
[DEBUG] (f) encoding = UTF-8
[DEBUG] (f) failOnError = true
[DEBUG] (f) failOnWarning = false
[DEBUG] (f) forceJavacCompilerUse = false
[DEBUG] (f) fork = false
[DEBUG] (f) generatedSourcesDirectory = D:\Users\user\openhab\openhab2-master\git\openhab2-addons\addons\binding\org.openhab.binding.eurothermostat\target\generated-sources\annotations
[DEBUG] (f) mojoExecution = org.apache.maven.plugins:maven-compiler-plugin:3.6.1:compile {execution: default}
[DEBUG] (f) optimize = false
[DEBUG] (f) outputDirectory = D:\Users\user\openhab\openhab2-master\git\openhab2-addons\addons\binding\org.openhab.binding.eurothermostat\target\classes
[DEBUG] (f) project = MavenProject: org.openhab.binding:org.openhab.binding.eurothermostat:2.3.0-SNAPSHOT @ D:\Users\user\openhab\openhab2-master\git\openhab2-addons\addons\binding\org.openhab.binding.eurothermostat\pom.xml
[DEBUG] (f) projectArtifact = org.openhab.binding:org.openhab.binding.eurothermostat:eclipse-plugin:2.3.0-SNAPSHOT
[DEBUG] (f) session = org.apache.maven.execution.MavenSession@69aa2adb
[DEBUG] (f) showDeprecation = false
[DEBUG] (f) showWarnings = false
[DEBUG] (f) skipMultiThreadWarning = false
[DEBUG] (f) source = 1.8
[DEBUG] (f) staleMillis = 0
[DEBUG] (f) target = 1.8
[DEBUG] (f) useIncrementalCompilation = true
[DEBUG] (f) verbose = false
[DEBUG] -- end configuration --
[DEBUG] Using compiler 'groovy-eclipse-compiler'.
[DEBUG] Adding D:\Users\user\openhab\openhab2-master\git\openhab2-addons\addons\binding\org.openhab.binding.eurothermostat\target\generated-sources\annotations to compile source roots:
D:\Users\user\openhab\openhab2-master\git\openhab2-addons\addons\binding\org.openhab.binding.eurothermostat\src\main\java
[DEBUG] New compile source roots:
D:\Users\user\openhab\openhab2-master\git\openhab2-addons\addons\binding\org.openhab.binding.eurothermostat\src\main\java
D:\Users\user\openhab\openhab2-master\git\openhab2-addons\addons\binding\org.openhab.binding.eurothermostat\target\generated-sources\annotations
[DEBUG] CompilerReuseStrategy: reuseCreated
[DEBUG] useIncrementalCompilation enabled
[DEBUG] classpathElements: [D:\Users\user\openhab\openhab2-master\git\openhab2-addons\addons\binding\org.openhab.binding.eurothermostat\target\classes, D:\Users\user\.m2\repository\org\apache\felix\org.apache.felix.fileinstall\3.4.0\org.apache.felix.fileinstall-3.4.0.jar, D:\Users\user\.m2\repository\org\apache\felix\org.apache.felix.scr.ds-annotations\1.2.10\org.apache.felix.scr.ds-annotations-1.2.10.jar, D:\Users\user\.m2\repository\p2\osgi\bundle\com.google.gson\2.7.0.v20170129-0911\com.google.gson-2.7.0.v20170129-0911.jar, D:\Users\user\.m2\repository\p2\osgi\bundle\com.google.guava\15.0.0.v201403281430\com.google.guava-15.0.0.v201403281430.jar, D:\Users\user\.m2\repository\p2\osgi\bundle\org.eclipse.osgi\3.12.1.v20170821-1548\org.eclipse.osgi-3.12.1.v20170821-1548.jar, D:\Users\user\.m2\repository\p2\osgi\bundle\org.eclipse.osgi.services\3.6.0.v20170228-1906\org.eclipse.osgi.services-3.6.0.v20170228-1906.jar, D:\Users\user\.m2\repository\p2\osgi\bundle\org.eclipse.osgi.util\3.4.0.v20170111-1608\org.eclipse.osgi.util-3.4.0.v20170111-1608.jar, D:\Users\user\.m2\repository\p2\osgi\bundle\org.apache.commons.lang\2.6.0.v201404270220\org.apache.commons.lang-2.6.0.v201404270220.jar, D:\Users\user\.m2\repository\p2\osgi\bundle\org.eclipse.smarthome.config.core\0.10.0.201802191927\org.eclipse.smarthome.config.core-0.10.0.201802191927.jar, D:\Users\user\.m2\repository\p2\osgi\bundle\org.eclipse.smarthome.core\0.10.0.201802191927\org.eclipse.smarthome.core-0.10.0.201802191927.jar, D:\Users\user\.m2\repository\p2\osgi\bundle\org.slf4j.api\1.7.2.v20121108-1250\org.slf4j.api-1.7.2.v20121108-1250.jar, D:\Users\user\.m2\repository\p2\osgi\bundle\org.apache.commons.io\2.2.0.v201405211200\org.apache.commons.io-2.2.0.v201405211200.jar, D:\Users\user\.m2\repository\p2\osgi\bundle\org.apache.commons.collections\3.2.0.v2013030210310\org.apache.commons.collections-3.2.0.v2013030210310.jar, D:\Users\user\.m2\repository\p2\osgi\bundle\org.eclipse.smarthome.core.thing\0.10.0.201802191927\org.eclipse.smarthome.core.thing-0.10.0.201802191927.jar, D:\Users\user\.m2\repository\p2\osgi\bundle\org.eclipse.smarthome.io.console\0.10.0.201802191927\org.eclipse.smarthome.io.console-0.10.0.201802191927.jar, D:\Users\user\.m2\repository\p2\osgi\bundle\org.eclipse.jdt.annotation\2.1.100.v20170511-1408\org.eclipse.jdt.annotation-2.1.100.v20170511-1408.jar]
[DEBUG] Stale source detected: D:\Users\user\openhab\openhab2-master\git\openhab2-addons\addons\binding\org.openhab.binding.eurothermostat\src\main\java\org\openhab\binding\eurothermostat\EuroThermostatBindingConstants.java
[DEBUG] Stale source detected: D:\Users\user\openhab\openhab2-master\git\openhab2-addons\addons\binding\org.openhab.binding.eurothermostat\src\main\java\org\openhab\binding\eurothermostat\handler\EuroThermostatHandler.java
[DEBUG] Stale source detected: D:\Users\user\openhab\openhab2-master\git\openhab2-addons\addons\binding\org.openhab.binding.eurothermostat\src\main\java\org\openhab\binding\eurothermostat\internal\EuroThermostatConfiguration.java
[DEBUG] Stale source detected: D:\Users\user\openhab\openhab2-master\git\openhab2-addons\addons\binding\org.openhab.binding.eurothermostat\src\main\java\org\openhab\binding\eurothermostat\internal\EuroThermostatHandlerFactory.java
[INFO] Changes detected - recompiling the module!
[DEBUG] Classpath:
[DEBUG] D:\Users\user\openhab\openhab2-master\git\openhab2-addons\addons\binding\org.openhab.binding.eurothermostat\target\classes
[DEBUG] D:\Users\user\.m2\repository\org\apache\felix\org.apache.felix.fileinstall\3.4.0\org.apache.felix.fileinstall-3.4.0.jar
[DEBUG] D:\Users\user\.m2\repository\org\apache\felix\org.apache.felix.scr.ds-annotations\1.2.10\org.apache.felix.scr.ds-annotations-1.2.10.jar
[DEBUG] D:\Users\user\.m2\repository\p2\osgi\bundle\com.google.gson\2.7.0.v20170129-0911\com.google.gson-2.7.0.v20170129-0911.jar
[DEBUG] D:\Users\user\.m2\repository\p2\osgi\bundle\com.google.guava\15.0.0.v201403281430\com.google.guava-15.0.0.v201403281430.jar
[DEBUG] D:\Users\user\.m2\repository\p2\osgi\bundle\org.eclipse.osgi\3.12.1.v20170821-1548\org.eclipse.osgi-3.12.1.v20170821-1548.jar
[DEBUG] D:\Users\user\.m2\repository\p2\osgi\bundle\org.eclipse.osgi.services\3.6.0.v20170228-1906\org.eclipse.osgi.services-3.6.0.v20170228-1906.jar
[DEBUG] D:\Users\user\.m2\repository\p2\osgi\bundle\org.eclipse.osgi.util\3.4.0.v20170111-1608\org.eclipse.osgi.util-3.4.0.v20170111-1608.jar
[DEBUG] D:\Users\user\.m2\repository\p2\osgi\bundle\org.apache.commons.lang\2.6.0.v201404270220\org.apache.commons.lang-2.6.0.v201404270220.jar
[DEBUG] D:\Users\user\.m2\repository\p2\osgi\bundle\org.eclipse.smarthome.config.core\0.10.0.201802191927\org.eclipse.smarthome.config.core-0.10.0.201802191927.jar
[DEBUG] D:\Users\user\.m2\repository\p2\osgi\bundle\org.eclipse.smarthome.core\0.10.0.201802191927\org.eclipse.smarthome.core-0.10.0.201802191927.jar
[DEBUG] D:\Users\user\.m2\repository\p2\osgi\bundle\org.slf4j.api\1.7.2.v20121108-1250\org.slf4j.api-1.7.2.v20121108-1250.jar
[DEBUG] D:\Users\user\.m2\repository\p2\osgi\bundle\org.apache.commons.io\2.2.0.v201405211200\org.apache.commons.io-2.2.0.v201405211200.jar
[DEBUG] D:\Users\user\.m2\repository\p2\osgi\bundle\org.apache.commons.collections\3.2.0.v2013030210310\org.apache.commons.collections-3.2.0.v2013030210310.jar
[DEBUG] D:\Users\user\.m2\repository\p2\osgi\bundle\org.eclipse.smarthome.core.thing\0.10.0.201802191927\org.eclipse.smarthome.core.thing-0.10.0.201802191927.jar
[DEBUG] D:\Users\user\.m2\repository\p2\osgi\bundle\org.eclipse.smarthome.io.console\0.10.0.201802191927\org.eclipse.smarthome.io.console-0.10.0.201802191927.jar
[DEBUG] D:\Users\user\.m2\repository\p2\osgi\bundle\org.eclipse.jdt.annotation\2.1.100.v20170511-1408\org.eclipse.jdt.annotation-2.1.100.v20170511-1408.jar
[DEBUG] Source roots:
[DEBUG] D:\Users\user\openhab\openhab2-master\git\openhab2-addons\addons\binding\org.openhab.binding.eurothermostat\src\main\java
[DEBUG] D:\Users\user\openhab\openhab2-master\git\openhab2-addons\addons\binding\org.openhab.binding.eurothermostat\target\generated-sources\annotations
[DEBUG] incrementalBuildHelper#beforeRebuildExecution
[INFO] Nothing to compile - all classes are up to date
[DEBUG] incrementalBuildHelper#afterRebuildExecution
[INFO]
[INFO] --- maven-scr-plugin:1.24.0:scr (generate-scr-scrdescriptor) @ org.openhab.binding.eurothermostat ---
[DEBUG] Dependency collection stats: {ConflictMarker.analyzeTime=44337, ConflictMarker.markTime=92369, ConflictMarker.nodeCount=39, ConflictIdSorter.graphTime=31610, ConflictIdSorter.topsortTime=33664, ConflictIdSorter.conflictIdCount=21, ConflictIdSorter.conflictIdCycleCount=0, ConflictResolver.totalTime=364549, ConflictResolver.conflictItemCount=35, DefaultDependencyCollector.collectTime=31102466, DefaultDependencyCollector.transformTime=617435}
[DEBUG] org.apache.felix:maven-scr-plugin:jar:1.24.0:
[DEBUG] org.osgi:org.osgi.service.component.annotations:jar:1.3.0:runtime
[DEBUG] org.apache.maven:maven-plugin-api:jar:2.0.7:compile
[DEBUG] org.apache.maven:maven-archiver:jar:2.2:compile
[DEBUG] org.apache.maven:maven-project:jar:2.0:compile
[DEBUG] org.apache.maven:maven-profile:jar:2.0:compile
[DEBUG] org.apache.maven:maven-model:jar:2.0:compile
[DEBUG] org.apache.maven:maven-artifact-manager:jar:2.0:compile
[DEBUG] org.apache.maven:maven-repository-metadata:jar:2.0:compile
[DEBUG] org.codehaus.plexus:plexus-container-default:jar:1.0-alpha-8:compile
[DEBUG] junit:junit:jar:4.12:compile
[DEBUG] org.hamcrest:hamcrest-core:jar:1.3:compile
[DEBUG] classworlds:classworlds:jar:1.1-alpha-2:compile
[DEBUG] org.codehaus.plexus:plexus-archiver:jar:1.0-alpha-7:compile
[DEBUG] org.apache.maven:maven-artifact:jar:2.0:compile
[DEBUG] org.apache.felix:org.apache.felix.scr.generator:jar:1.16.0:compile
[DEBUG] org.ow2.asm:asm-all:jar:5.1:compile
[DEBUG] org.osgi:org.osgi.core:jar:4.2.0:compile
[DEBUG] org.osgi:org.osgi.compendium:jar:4.2.0:compile
[DEBUG] org.sonatype.plexus:plexus-build-api:jar:0.0.7:compile
[DEBUG] org.codehaus.plexus:plexus-utils:jar:1.5.8:compile
[DEBUG] Created new class realm plugin>org.apache.felix:maven-scr-plugin:1.24.0
[DEBUG] Importing foreign packages into class realm plugin>org.apache.felix:maven-scr-plugin:1.24.0
[DEBUG] Imported: < project>org.openhab:pom-addons2:2.3.0-SNAPSHOT
[DEBUG] Populating class realm plugin>org.apache.felix:maven-scr-plugin:1.24.0
[DEBUG] Included: org.apache.felix:maven-scr-plugin:jar:1.24.0
[DEBUG] Included: org.osgi:org.osgi.service.component.annotations:jar:1.3.0
[DEBUG] Included: org.apache.maven:maven-archiver:jar:2.2
[DEBUG] Included: junit:junit:jar:4.12
[DEBUG] Included: org.hamcrest:hamcrest-core:jar:1.3
[DEBUG] Included: org.codehaus.plexus:plexus-archiver:jar:1.0-alpha-7
[DEBUG] Included: org.apache.felix:org.apache.felix.scr.generator:jar:1.16.0
[DEBUG] Included: org.ow2.asm:asm-all:jar:5.1
[DEBUG] Included: org.osgi:org.osgi.core:jar:4.2.0
[DEBUG] Included: org.osgi:org.osgi.compendium:jar:4.2.0
[DEBUG] Included: org.sonatype.plexus:plexus-build-api:jar:0.0.7
[DEBUG] Included: org.codehaus.plexus:plexus-utils:jar:1.5.8
[DEBUG] Configuring mojo org.apache.felix:maven-scr-plugin:1.24.0:scr from plugin realm ClassRealm[plugin>org.apache.felix:maven-scr-plugin:1.24.0, parent: sun.misc.Launcher$AppClassLoader@70dea4e]
[DEBUG] Configuring mojo 'org.apache.felix:maven-scr-plugin:1.24.0:scr' with basic configurator -->
[DEBUG] (f) generateAccessors = true
[DEBUG] (f) outputDirectory = D:\Users\user\openhab\openhab2-master\git\openhab2-addons\addons\binding\org.openhab.binding.eurothermostat\target\classes
[DEBUG] (f) project = MavenProject: org.openhab.binding:org.openhab.binding.eurothermostat:2.3.0-SNAPSHOT @ D:\Users\user\openhab\openhab2-master\git\openhab2-addons\addons\binding\org.openhab.binding.eurothermostat\pom.xml
[DEBUG] (f) scanClasses = false
[DEBUG] (f) skipVolatileCheck = false
[DEBUG] (f) strictMode = false
[DEBUG] (f) supportedProjectTypes = [eclipse-plugin]
[DEBUG] -- end configuration --
[DEBUG] Checking artifact org.apache.felix:org.apache.felix.fileinstall:jar:3.4.0:provided
[DEBUG] Resolving artifact org.apache.felix:org.apache.felix.fileinstall:jar:3.4.0:provided
[DEBUG] Checking artifact org.apache.felix:org.apache.felix.scr.ds-annotations:jar:1.2.10:compile
[DEBUG] Resolving artifact org.apache.felix:org.apache.felix.scr.ds-annotations:jar:1.2.10:compile
[DEBUG] Checking artifact p2.eclipse-plugin:com.google.gson:jar:2.7.0.v20170129-0911:system
[DEBUG] Resolving artifact p2.eclipse-plugin:com.google.gson:jar:2.7.0.v20170129-0911:system
[DEBUG] Checking artifact p2.eclipse-plugin:com.google.guava:jar:15.0.0.v201403281430:system
[DEBUG] Resolving artifact p2.eclipse-plugin:com.google.guava:jar:15.0.0.v201403281430:system
[DEBUG] Checking artifact p2.eclipse-plugin:org.eclipse.osgi:jar:3.12.1.v20170821-1548:system
[DEBUG] Resolving artifact p2.eclipse-plugin:org.eclipse.osgi:jar:3.12.1.v20170821-1548:system
[DEBUG] Checking artifact p2.eclipse-plugin:org.eclipse.osgi.services:jar:3.6.0.v20170228-1906:system
[DEBUG] Resolving artifact p2.eclipse-plugin:org.eclipse.osgi.services:jar:3.6.0.v20170228-1906:system
[DEBUG] Checking artifact p2.eclipse-plugin:org.eclipse.osgi.util:jar:3.4.0.v20170111-1608:system
[DEBUG] Resolving artifact p2.eclipse-plugin:org.eclipse.osgi.util:jar:3.4.0.v20170111-1608:system
[DEBUG] Checking artifact p2.eclipse-plugin:org.apache.commons.lang:jar:2.6.0.v201404270220:system
[DEBUG] Resolving artifact p2.eclipse-plugin:org.apache.commons.lang:jar:2.6.0.v201404270220:system
[DEBUG] Checking artifact p2.eclipse-plugin:org.eclipse.smarthome.config.core:jar:0.10.0.201802191927:system
[DEBUG] Resolving artifact p2.eclipse-plugin:org.eclipse.smarthome.config.core:jar:0.10.0.201802191927:system
[DEBUG] Checking artifact p2.eclipse-plugin:org.eclipse.smarthome.core:jar:0.10.0.201802191927:system
[DEBUG] Resolving artifact p2.eclipse-plugin:org.eclipse.smarthome.core:jar:0.10.0.201802191927:system
[DEBUG] Checking artifact p2.eclipse-plugin:org.slf4j.api:jar:1.7.2.v20121108-1250:system
[DEBUG] Resolving artifact p2.eclipse-plugin:org.slf4j.api:jar:1.7.2.v20121108-1250:system
[DEBUG] Checking artifact p2.eclipse-plugin:org.apache.commons.io:jar:2.2.0.v201405211200:system
[DEBUG] Resolving artifact p2.eclipse-plugin:org.apache.commons.io:jar:2.2.0.v201405211200:system
[DEBUG] Checking artifact p2.eclipse-plugin:org.apache.commons.collections:jar:3.2.0.v2013030210310:system
[DEBUG] Resolving artifact p2.eclipse-plugin:org.apache.commons.collections:jar:3.2.0.v2013030210310:system
[DEBUG] Checking artifact p2.eclipse-plugin:org.eclipse.smarthome.core.thing:jar:0.10.0.201802191927:system
[DEBUG] Resolving artifact p2.eclipse-plugin:org.eclipse.smarthome.core.thing:jar:0.10.0.201802191927:system
[DEBUG] Checking artifact p2.eclipse-plugin:org.eclipse.smarthome.io.console:jar:0.10.0.201802191927:system
[DEBUG] Resolving artifact p2.eclipse-plugin:org.eclipse.smarthome.io.console:jar:0.10.0.201802191927:system
[DEBUG] Checking artifact p2.eclipse-plugin:org.eclipse.jdt.annotation:jar:2.1.100.v20170511-1408:system
[DEBUG] Resolving artifact p2.eclipse-plugin:org.eclipse.jdt.annotation:jar:2.1.100.v20170511-1408:system
[DEBUG] Scanning source tree D:\Users\user\openhab\openhab2-master\git\openhab2-addons\addons\binding\org.openhab.binding.eurothermostat\src\main\java
[DEBUG] Scanning source tree D:\Users\user\openhab\openhab2-master\git\openhab2-addons\addons\binding\org.openhab.binding.eurothermostat\target\generated-sources\annotations
[DEBUG] Scanning source tree D:\Users\user\openhab\openhab2-master\git\openhab2-addons\addons\binding\org.openhab.binding.eurothermostat\src\main\java
[DEBUG] Scanning source tree D:\Users\user\openhab\openhab2-master\git\openhab2-addons\addons\binding\org.openhab.binding.eurothermostat\target\generated-sources\annotations
[DEBUG] Deleting D:\Users\user\openhab\openhab2-master\git\openhab2-addons\addons\binding\org.openhab.binding.eurothermostat\target\classes\OSGI-INF\metatype\org.openhab.binding.eurothermostat.EuroThermostatBindingConstants.xml
[DEBUG] Deleting D:\Users\user\openhab\openhab2-master\git\openhab2-addons\addons\binding\org.openhab.binding.eurothermostat\target\classes\OSGI-INF\metatype\org.openhab.binding.eurothermostat.EuroThermostatBindingConstants.properties
[DEBUG] Deleting D:\Users\user\openhab\openhab2-master\git\openhab2-addons\addons\binding\org.openhab.binding.eurothermostat\target\classes\OSGI-INF\org.openhab.binding.eurothermostat.EuroThermostatBindingConstants.xml
[DEBUG] Deleting D:\Users\user\openhab\openhab2-master\git\openhab2-addons\addons\binding\org.openhab.binding.eurothermostat\target\classes\OSGI-INF\metatype\org.openhab.binding.eurothermostat.handler.EuroThermostatHandler.xml
[DEBUG] Deleting D:\Users\user\openhab\openhab2-master\git\openhab2-addons\addons\binding\org.openhab.binding.eurothermostat\target\classes\OSGI-INF\metatype\org.openhab.binding.eurothermostat.handler.EuroThermostatHandler.properties
[DEBUG] Deleting D:\Users\user\openhab\openhab2-master\git\openhab2-addons\addons\binding\org.openhab.binding.eurothermostat\target\classes\OSGI-INF\org.openhab.binding.eurothermostat.handler.EuroThermostatHandler.xml
[DEBUG] Deleting D:\Users\user\openhab\openhab2-master\git\openhab2-addons\addons\binding\org.openhab.binding.eurothermostat\target\classes\OSGI-INF\metatype\org.openhab.binding.eurothermostat.internal.EuroThermostatConfiguration.xml
[DEBUG] Deleting D:\Users\user\openhab\openhab2-master\git\openhab2-addons\addons\binding\org.openhab.binding.eurothermostat\target\classes\OSGI-INF\metatype\org.openhab.binding.eurothermostat.internal.EuroThermostatConfiguration.properties
[DEBUG] Deleting D:\Users\user\openhab\openhab2-master\git\openhab2-addons\addons\binding\org.openhab.binding.eurothermostat\target\classes\OSGI-INF\org.openhab.binding.eurothermostat.internal.EuroThermostatConfiguration.xml
[DEBUG] Deleting D:\Users\user\openhab\openhab2-master\git\openhab2-addons\addons\binding\org.openhab.binding.eurothermostat\target\classes\OSGI-INF\metatype\org.openhab.binding.eurothermostat.internal.EuroThermostatHandlerFactory.xml
[DEBUG] Deleting D:\Users\user\openhab\openhab2-master\git\openhab2-addons\addons\binding\org.openhab.binding.eurothermostat\target\classes\OSGI-INF\metatype\org.openhab.binding.eurothermostat.internal.EuroThermostatHandlerFactory.properties
[DEBUG] Deleting D:\Users\user\openhab\openhab2-master\git\openhab2-addons\addons\binding\org.openhab.binding.eurothermostat\target\classes\OSGI-INF\org.openhab.binding.eurothermostat.internal.EuroThermostatHandlerFactory.xml
[DEBUG] Starting SCR Descriptor Generator....
[DEBUG] ..using output directory: D:\Users\user\openhab\openhab2-master\git\openhab2-addons\addons\binding\org.openhab.binding.eurothermostat\target\classes
[DEBUG] ..strict mode: false
[DEBUG] ..generating accessors: true
[DEBUG] ..auto detecting spec version
[DEBUG] ..using annotation processors:
[DEBUG] - DS Annotation Processor - 300
[DEBUG] Scanning class org.openhab.binding.eurothermostat.EuroThermostatBindingConstants
[DEBUG] Processing org.openhab.binding.eurothermostat.EuroThermostatBindingConstants
[DEBUG] Found descriptions ClassDescription [descriptions=[], describedClass=class org.openhab.binding.eurothermostat.EuroThermostatBindingConstants, source=D:\Users\user\openhab\openhab2-master\git\openhab2-addons\addons\binding\org.openhab.binding.eurothermostat\src\main\java\org\openhab\binding\eurothermostat\EuroThermostatBindingConstants.java] in org.openhab.binding.eurothermostat.EuroThermostatBindingConstants
[DEBUG] Scanning class org.openhab.binding.eurothermostat.handler.EuroThermostatHandler
[DEBUG] Processing org.openhab.binding.eurothermostat.handler.EuroThermostatHandler
[DEBUG] Found descriptions ClassDescription [descriptions=[], describedClass=class org.openhab.binding.eurothermostat.handler.EuroThermostatHandler, source=D:\Users\user\openhab\openhab2-master\git\openhab2-addons\addons\binding\org.openhab.binding.eurothermostat\src\main\java\org\openhab\binding\eurothermostat\handler\EuroThermostatHandler.java] in org.openhab.binding.eurothermostat.handler.EuroThermostatHandler
[DEBUG] Scanning class org.openhab.binding.eurothermostat.internal.EuroThermostatConfiguration
[DEBUG] Processing org.openhab.binding.eurothermostat.internal.EuroThermostatConfiguration
[DEBUG] Scanning class org.openhab.binding.eurothermostat.internal.EuroThermostatHandlerFactory
[DEBUG] Processing org.openhab.binding.eurothermostat.internal.EuroThermostatHandlerFactory
[DEBUG] Found descriptions ClassDescription [descriptions=[ComponentDescription [name=org.openhab.binding.eurothermostat.internal.EuroThermostatHandlerFactory, label=null, description=null, configurationPolicy=OPTIONAL, isAbstract=false, isInherit=false, createDs=true, createMetatype=false, enabled=null, immediate=true, factory=null, isSetMetatypeFactoryPid=false, activate=null, deactivate=null, modified=null, specVersion=null, configurationPid=binding.eurothermostat], ServiceDescription [isServiceFactory=false, interfaces=[org.eclipse.smarthome.core.thing.binding.ThingHandlerFactory], annotation=ClassAnnotationDescription [name=org.osgi.service.component.annotations.Component, values={immediate=true, service=[Ljava.lang.String;@14e9458a, configurationPid=binding.eurothermostat}]]], describedClass=class org.openhab.binding.eurothermostat.internal.EuroThermostatHandlerFactory, source=D:\Users\user\openhab\openhab2-master\git\openhab2-addons\addons\binding\org.openhab.binding.eurothermostat\src\main\java\org\openhab\binding\eurothermostat\internal\EuroThermostatHandlerFactory.java] in org.openhab.binding.eurothermostat.internal.EuroThermostatHandlerFactory
[DEBUG] Found component description ClassDescription [descriptions=[ComponentDescription [name=org.openhab.binding.eurothermostat.internal.EuroThermostatHandlerFactory, label=null, description=null, configurationPolicy=OPTIONAL, isAbstract=false, isInherit=false, createDs=true, createMetatype=false, enabled=null, immediate=true, factory=null, isSetMetatypeFactoryPid=false, activate=null, deactivate=null, modified=null, specVersion=null, configurationPid=binding.eurothermostat], ServiceDescription [isServiceFactory=false, interfaces=[org.eclipse.smarthome.core.thing.binding.ThingHandlerFactory], annotation=ClassAnnotationDescription [name=org.osgi.service.component.annotations.Component, values={immediate=true, service=[Ljava.lang.String;@14e9458a, configurationPid=binding.eurothermostat}]]], describedClass=class org.openhab.binding.eurothermostat.internal.EuroThermostatHandlerFactory, source=D:\Users\user\openhab\openhab2-master\git\openhab2-addons\addons\binding\org.openhab.binding.eurothermostat\src\main\java\org\openhab\binding\eurothermostat\internal\EuroThermostatHandlerFactory.java] in org.openhab.binding.eurothermostat.internal.EuroThermostatHandlerFactory
[DEBUG] Processing component class D:\Users\user\openhab\openhab2-master\git\openhab2-addons\addons\binding\org.openhab.binding.eurothermostat\src\main\java\org\openhab\binding\eurothermostat\internal\EuroThermostatHandlerFactory.java
[DEBUG] Processing org.eclipse.smarthome.core.thing.binding.ThingHandlerFactory
[DEBUG] Found descriptions ClassDescription [descriptions=[], describedClass=interface org.eclipse.smarthome.core.thing.binding.ThingHandlerFactory, source=<generated>] in org.eclipse.smarthome.core.thing.binding.ThingHandlerFactory
[DEBUG] Setting used spec version to VERSION_1_2
[DEBUG] Generating descriptor for spec version: VERSION_1_2
[DEBUG] Adding descriptor for DS : ComponentContainer [classDescription=ClassDescription [descriptions=[ComponentDescription [name=org.openhab.binding.eurothermostat.internal.EuroThermostatHandlerFactory, label=null, description=null, configurationPolicy=OPTIONAL, isAbstract=false, isInherit=false, createDs=true, createMetatype=false, enabled=null, immediate=true, factory=null, isSetMetatypeFactoryPid=false, activate=null, deactivate=null, modified=null, specVersion=VERSION_1_2, configurationPid=binding.eurothermostat], ServiceDescription [isServiceFactory=false, interfaces=[org.eclipse.smarthome.core.thing.binding.ThingHandlerFactory], annotation=ClassAnnotationDescription [name=org.osgi.service.component.annotations.Component, values={immediate=true, service=[Ljava.lang.String;@14e9458a, configurationPid=binding.eurothermostat}]]], describedClass=class org.openhab.binding.eurothermostat.internal.EuroThermostatHandlerFactory, source=D:\Users\user\openhab\openhab2-master\git\openhab2-addons\addons\binding\org.openhab.binding.eurothermostat\src\main\java\org\openhab\binding\eurothermostat\internal\EuroThermostatHandlerFactory.java], componentDescription=ComponentDescription [name=org.openhab.binding.eurothermostat.internal.EuroThermostatHandlerFactory, label=null, description=null, configurationPolicy=OPTIONAL, isAbstract=false, isInherit=false, createDs=true, createMetatype=false, enabled=null, immediate=true, factory=null, isSetMetatypeFactoryPid=false, activate=null, deactivate=null, modified=null, specVersion=VERSION_1_2, configurationPid=binding.eurothermostat], serviceDescription=ServiceDescription [isServiceFactory=false, interfaces=[org.eclipse.smarthome.core.thing.binding.ThingHandlerFactory], annotation=ClassAnnotationDescription [name=org.osgi.service.component.annotations.Component, values={immediate=true, service=[Ljava.lang.String;@14e9458a, configurationPid=binding.eurothermostat}]], allReferences={}, allProperties={}]
[INFO] Writing 1 Service Component Descriptors to D:\Users\user\openhab\openhab2-master\git\openhab2-addons\addons\binding\org.openhab.binding.eurothermostat\target\classes\OSGI-INF\org.openhab.binding.eurothermostat.internal.EuroThermostatHandlerFactory.xml
[DEBUG] Scanning source tree D:\Users\user\openhab\openhab2-master\git\openhab2-addons\addons\binding\org.openhab.binding.eurothermostat\src\main\java
[DEBUG] Scanning source tree D:\Users\user\openhab\openhab2-master\git\openhab2-addons\addons\binding\org.openhab.binding.eurothermostat\target\generated-sources\annotations
[DEBUG] Refreshing D:\Users\user\openhab\openhab2-master\git\openhab2-addons\addons\binding\org.openhab.binding.eurothermostat\target\classes\OSGI-INF\org.openhab.binding.eurothermostat.internal.EuroThermostatHandlerFactory.xml
[INFO]
[INFO] --- maven-resources-plugin:2.4.3:testResources (default-testResources) @ org.openhab.binding.eurothermostat ---
[DEBUG] Configuring mojo org.apache.maven.plugins:maven-resources-plugin:2.4.3:testResources from plugin realm ClassRealm[plugin>org.apache.maven.plugins:maven-resources-plugin:2.4.3, parent: sun.misc.Launcher$AppClassLoader@70dea4e]
[DEBUG] Configuring mojo 'org.apache.maven.plugins:maven-resources-plugin:2.4.3:testResources' with basic configurator -->
[DEBUG] (f) buildFilters = []
[DEBUG] (f) encoding = UTF-8
[DEBUG] (f) escapeWindowsPaths = true
[DEBUG] (s) includeEmptyDirs = false
[DEBUG] (s) outputDirectory = D:\Users\user\openhab\openhab2-master\git\openhab2-addons\addons\binding\org.openhab.binding.eurothermostat\target\test-classes
[DEBUG] (s) overwrite = false
[DEBUG] (f) project = MavenProject: org.openhab.binding:org.openhab.binding.eurothermostat:2.3.0-SNAPSHOT @ D:\Users\user\openhab\openhab2-master\git\openhab2-addons\addons\binding\org.openhab.binding.eurothermostat\pom.xml
[DEBUG] (s) resources = [Resource {targetPath: null, filtering: false, FileSet {directory: D:\Users\user\openhab\openhab2-master\git\openhab2-addons\addons\binding\org.openhab.binding.eurothermostat\src\test\resources, PatternSet [includes: {}, excludes: {}]}}]
[DEBUG] (f) session = org.apache.maven.execution.MavenSession@69aa2adb
[DEBUG] (f) useBuildFilters = true
[DEBUG] (s) useDefaultDelimiters = true
[DEBUG] -- end configuration --
[DEBUG] properties used {file.encoding.pkg=sun.io, env.PROMPT=$P$G, user.language.format=de, env.VS120COMNTOOLS=C:\Program Files (x86)\Microsoft Visual Studio 12.0\Common7\Tools\, env.=D:=D:\Users\user\openhab\openhab2-master\git\openhab2-addons, java.home=C:\Program Files\Java\jdk1.8.0_65\jre, env.DXSDK_DIR=D:\SDKs\Microsoft DirectX SDK (June 2010)\, bundle.namespace=org.openhab.binding.eurothermostat, unqualifiedVersion=2.3.0, classworlds.conf=D:\Users\user\Desktop\apache-maven-3.5.3\bin\..\bin\m2.conf, env.OPENCV_DIR=C:\Program Files\opencv\build\x64\vc12, java.endorsed.dirs=C:\Program Files\Java\jdk1.8.0_65\jre\lib\endorsed, env.USERNAME=user, groovy.eclipse.compiler.version=2.9.2-01, env.JD2_HOME=D:\Users\user\AppData\Local\JDownloader 2.0, Service-Component=OSGI-INF/org.openhab.binding.eurothermostat.internal.EuroThermostatHandlerFactory.xml, sun.os.patch.level=, java.vendor.url=http://java.oracle.com/, env.COMPUTERNAME=LAPLUKE, java.version=1.8.0_65, env.ANDROID_HOME=C:\Users\user\AppData\Local\Android\sdk, java.vendor.url.bug=http://bugreport.sun.com/bugreport/, env.USERPROFILE=D:\Users\user, user.name=user, sun.io.unicode.encoding=UnicodeLittle, sun.jnu.encoding=Cp1252, java.runtime.name=Java(TM) SE Runtime Environment, env.CHOCOLATEYLASTPATHUPDATE=Do Dez 21 18:29:09 2017, env.LOCALAPPDATA=D:\Users\user\AppData\Local, env.COMMONPROGRAMW6432=C:\Program Files\Common Files, env.VS140COMNTOOLS=C:\Program Files (x86)\Microsoft Visual Studio 14.0\Common7\Tools\, java.specification.name=Java Platform API Specification, user.timezone=, user.script=, path.separator=;, env.MAVEN_CMD_LINE_ARGS=-fae install -rf :org.openhab.binding.eurothermostat -X -Dtycho.debug.resolver=true, license.maven.plugin.version=2.10, env.PROCESSOR_IDENTIFIER=Intel64 Family 6 Model 58 Stepping 9, GenuineIntel, file.encoding=Cp1252, bundle.symbolicName=org.openhab.binding.eurothermostat, sun.java.command=org.codehaus.plexus.classworlds.launcher.Launcher -fae install -rf :org.openhab.binding.eurothermostat -X -Dtycho.debug.resolver=true, env.NUMBER_OF_PROCESSORS=4, env.APPDATA=D:\Users\user\AppData\Roaming, env.MSYS2_BIN=C:\msys64\usr\bin\bash.exe, esh.releaseVersion=0.9.0, env.WINDIR=C:\WINDOWS, tycho-groupid=org.eclipse.tycho, env.FSHARPINSTALLDIR=C:\Program Files (x86)\Microsoft SDKs\F#\10.1\Framework\v4.0\, java.io.tmpdir=D:\Users\user\AppData\Local\Temp\, user.language=en, Include-Resource={maven-resources},OSGI-INF/org.openhab.binding.eurothermostat.internal.EuroThermostatHandlerFactory.xml=D:\Users\user\openhab\openhab2-master\git\openhab2-addons\addons\binding\org.openhab.binding.eurothermostat\target\classes\OSGI-INF/org.openhab.binding.eurothermostat.internal.EuroThermostatHandlerFactory.xml, line.separator=
, nrjavaserial.version=3.12.0.OH, tycho.env.osgi.os=win32, env.COMMONPROGRAMFILES=C:\Program Files\Common Files, qualifiedVersion=2.3.0.201803111804, java.vm.info=mixed mode, ohdr.version=1.0.22, sun.desktop=windows, java.vm.specification.name=Java Virtual Machine Specification, project.reporting.outputEncoding=UTF-8, tycho-version=1.0.0, esh.version=0.10.0-SNAPSHOT, maven.compiler.plugin.version=3.3, env.PATHEXT=.COM;.EXE;.BAT;.CMD;.VBS;.VBE;.JS;.JSE;.WSF;.WSH;.MSC;.PY;.PYW;.RB;.RBW, env.WDIR=D:\, env.ONEDRIVE=D:\Users\user\OneDrive, env.USERDOMAIN_ROAMINGPROFILE=LAPLUKE, build.helper.maven.plugin.version=1.9.1, ohc.version=2.3.0-SNAPSHOT, env.LOGONSERVER=\\LAPLUKE, env.PSMODULEPATH=C:\WINDOWS\system32\WindowsPowerShell\v1.0\Modules\;C:\Program Files\WindowsPowerShell\Modules\;C:\Program Files (x86)\Microsoft SDKs\Azure\PowerShell\ResourceManager\AzureResourceManager\;C:\Program Files (x86)\Microsoft SDKs\Azure\PowerShell\ServiceManagement\;C:\Program Files (x86)\Microsoft SDKs\Azure\PowerShell\Storage\, java.awt.printerjob=sun.awt.windows.WPrinterJob, env.JAVACMD=C:\Program Files\Java\jdk1.8.0_65\bin\java.exe, env.JVMCONFIG=\.mvn\jvm.config, buildQualifier=201803111804, env.PUBLIC=D:\Users\Public, env.USERDOMAIN=LAPLUKE, user.country.format=DE, env.VBOX_MSI_INSTALL_PATH=C:\Program Files\Oracle\VirtualBox\, jetty.version=9.3.22.v20171030, env.PROCESSOR_LEVEL=6, env.PROGRAMFILES(X86)=C:\Program Files (x86), env.=EXITCODE=00000001, os.name=Windows 10, java.specification.vendor=Oracle Corporation, env.TMP=D:\Users\user\AppData\Local\Temp, java.vm.name=Java HotSpot(TM) 64-Bit Server VM, env.OS=Windows_NT, java.library.path=C:\Program Files\Java\jdk1.8.0_65\bin;C:\WINDOWS\Sun\Java\bin;C:\WINDOWS\system32;C:\WINDOWS;D:\Programs\Python\Python36-32\Scripts\;D:\Programs\Python\Python36-32\;C:\Python27\;C:\Python27\Scripts;C:\Windows\System32\WindowsPowerShell\v1.0\;C:\Program Files\7-Zip\;C:\Program Files (x86)\NVIDIA Corporation\PhysX\Common;C:\ProgramData\Oracle\Java\javapath;C:\Windows\System32;C:\Windows;C:\Program Files\SysinternalsSuite\;C:\Windows\System32\wbem;C:\Users\user\.dnx\bin;C:\Program Files\Microsoft DNX\Dnvm\;C:\Program Files\Microsoft SQL Server\120\Tools\Binn\;C:\Program Files\Microsoft\Web Platform Installer\;C:\Program Files\Dell\DW WLAN Card;C:\Program Files\MiKTeX 2.9\miktex\bin\x64\;C:\msys64\usr\bin\bash.exe;C:\Program Files (x86)\Skype\Phone\;C:\Program Files\nodejs\;C:\Program Files\Common Files\Autodesk Shared\;C:\Windows\System32;C:\Windows;C:\Windows\System32\wbem;C:\Windows\System32\WindowsPowerShell\v1.0\;C:\Program Files\Microsoft SQL Server\130\Tools\Binn\;C:\Program Files (x86)\Microsoft Emulator Manager\1.0\;C:\Users\user\AppData\Local\Android\sdk\tools;C:\Users\user\AppData\Local\Android\sdk\platform-tools;C:\Program Files (x86)\Microsoft SDKs\Azure\CLI\wbin;C:\Program Files (x86)\Microsoft SQL Server\110\DTS\Binn\;C:\Program Files (x86)\Microsoft SQL Server\120\DTS\Binn\;C:\Program Files (x86)\Microsoft SQL Server\130\DTS\Binn\;C:\MinGW\bin\;C:\Program Files\dotnet\;C:\ProgramData\Anaconda2;C:\ProgramData\Anaconda2\Scripts;C:\ProgramData\Anaconda2\Library\bin;C:\Program Files\TortoiseSVN\bin;C:\Program Files\PuTTY\;C:\Program Files\Calibre2\;C:\Program Files (x86)\GnuPG\bin;C:\ProgramData\chocolatey\bin;C:\Program Files (x86)\Microsoft SQL Server\Client SDK\ODBC\130\Tools\Binn\;C:\Program Files (x86)\Microsoft SQL Server\140\Tools\Binn\;C:\Program Files (x86)\Microsoft SQL Server\140\DTS\Binn\;C:\Program Files (x86)\Microsoft SQL Server\140\Tools\Binn\ManagementStudio\;C:\Program Files\LLVM\bin;C:\Program Files\TortoiseGit\bin;C:\Program Files\Git\cmd;D:\Users\user\.dnx\bin;C:\Ruby\22-x64\bin;C:\Program Files\SysinternalsSuite\;D:\Users\user\AppData\Roaming\npm;D:\Users\user\AppData\Local\Microsoft\WindowsApps;C:\Program Files (x86)\Microsoft VS Code Insiders\bin;C:\Program Files\apache-maven-3.5.0\bin;C:\Program Files (x86)\mitmproxy\bin;D:\Users\user\AppData\Local\Microsoft\WindowsApps;D:\Users\user\AppData\Roaming\MiKTeX\2.9\miktex\bin\x64\;;., env.PROGRAMW6432=C:\Program Files, env.PATH=D:\Programs\Python\Python36-32\Scripts\;D:\Programs\Python\Python36-32\;C:\Python27\;C:\Python27\Scripts;C:\Windows\System32\WindowsPowerShell\v1.0\;C:\Program Files\7-Zip\;C:\Program Files (x86)\NVIDIA Corporation\PhysX\Common;C:\ProgramData\Oracle\Java\javapath;C:\Windows\System32;C:\Windows;C:\Program Files\SysinternalsSuite\;C:\Windows\System32\wbem;C:\Users\user\.dnx\bin;C:\Program Files\Microsoft DNX\Dnvm\;C:\Program Files\Microsoft SQL Server\120\Tools\Binn\;C:\Program Files\Microsoft\Web Platform Installer\;C:\Program Files\Dell\DW WLAN Card;C:\Program Files\MiKTeX 2.9\miktex\bin\x64\;C:\msys64\usr\bin\bash.exe;C:\Program Files (x86)\Skype\Phone\;C:\Program Files\nodejs\;C:\Program Files\Common Files\Autodesk Shared\;C:\Windows\System32;C:\Windows;C:\Windows\System32\wbem;C:\Windows\System32\WindowsPowerShell\v1.0\;C:\Program Files\Microsoft SQL Server\130\Tools\Binn\;C:\Program Files (x86)\Microsoft Emulator Manager\1.0\;C:\Users\user\AppData\Local\Android\sdk\tools;C:\Users\user\AppData\Local\Android\sdk\platform-tools;C:\Program Files (x86)\Microsoft SDKs\Azure\CLI\wbin;C:\Program Files (x86)\Microsoft SQL Server\110\DTS\Binn\;C:\Program Files (x86)\Microsoft SQL Server\120\DTS\Binn\;C:\Program Files (x86)\Microsoft SQL Server\130\DTS\Binn\;C:\MinGW\bin\;C:\Program Files\dotnet\;C:\ProgramData\Anaconda2;C:\ProgramData\Anaconda2\Scripts;C:\ProgramData\Anaconda2\Library\bin;C:\Program Files\TortoiseSVN\bin;C:\Program Files\PuTTY\;C:\Program Files\Calibre2\;C:\Program Files (x86)\GnuPG\bin;C:\ProgramData\chocolatey\bin;C:\Program Files (x86)\Microsoft SQL Server\Client SDK\ODBC\130\Tools\Binn\;C:\Program Files (x86)\Microsoft SQL Server\140\Tools\Binn\;C:\Program Files (x86)\Microsoft SQL Server\140\DTS\Binn\;C:\Program Files (x86)\Microsoft SQL Server\140\Tools\Binn\ManagementStudio\;C:\Program Files\LLVM\bin;C:\Program Files\TortoiseGit\bin;C:\Program Files\Git\cmd;D:\Users\user\.dnx\bin;C:\Ruby\22-x64\bin;C:\Program Files\SysinternalsSuite\;D:\Users\user\AppData\Roaming\npm;D:\Users\user\AppData\Local\Microsoft\WindowsApps;C:\Program Files (x86)\Microsoft VS Code Insiders\bin;C:\Program Files\apache-maven-3.5.0\bin;C:\Program Files (x86)\mitmproxy\bin;D:\Users\user\AppData\Local\Microsoft\WindowsApps;D:\Users\user\AppData\Roaming\MiKTeX\2.9\miktex\bin\x64\;, repo.version=2.2.x, library.jansi.path=D:\Users\user\Desktop\apache-maven-3.5.3\bin\..\lib\jansi-native, tycho.env.osgi.arch=x86_64, java.class.version=52.0, maven.multiModuleProjectDirectory=D:\Users\user\openhab\openhab2-master\git\openhab2-addons, sat.version=0.4.1, env.HOMEDRIVE=D:, env.SYSTEMROOT=C:\WINDOWS, maven.compiler.version=3.6.1, env.COMSPEC=C:\WINDOWS\system32\cmd.exe, sun.boot.library.path=C:\Program Files\Java\jdk1.8.0_65\jre\bin, project.build.sourceEncoding=UTF-8, env.SYSTEMDRIVE=C:, env.PROCESSOR_REVISION=3a09, basedirRoot=D:\Users\user\openhab\openhab2-master\git\openhab2-addons, sun.management.compiler=HotSpot 64-Bit Tiered Compilers, java.awt.graphicsenv=sun.awt.Win32GraphicsEnvironment, user.variant=, env.PROGRAMFILES=C:\Program Files, tycho.env.osgi.ws=win32, java.vm.specification.version=1.8, env.PROGRAMDATA=C:\ProgramData, awt.toolkit=sun.awt.windows.WToolkit, env.MAVEN_HOME=D:\Users\user\Desktop\apache-maven-3.5.3\bin\.., sun.cpu.isalist=amd64, sun.stderr.encoding=cp850, env.MAVEN_PROJECTBASEDIR=D:\Users\user\openhab\openhab2-master\git\openhab2-addons, java.ext.dirs=C:\Program Files\Java\jdk1.8.0_65\jre\lib\ext;C:\WINDOWS\Sun\Java\lib\ext, env.SSL_CERT_FILE=C:\Ruby\cacert.pem, os.version=10.0, env.ERROR_CODE=0, user.home=D:\Users\user, env.CHOCOLATEYINSTALL=C:\ProgramData\chocolatey, java.vm.vendor=Oracle Corporation, env.JAVA_HOME=C:\Program Files\Java\jdk1.8.0_65, user.dir=D:\Users\user\openhab\openhab2-master\git\openhab2-addons, maven.conf=D:\Users\user\Desktop\apache-maven-3.5.3\bin\../conf, jdt-annotations.version=2.1.0, env.COMMONPROGRAMFILES(X86)=C:\Program Files (x86)\Common Files, sun.cpu.endian=little, env.ALLUSERSPROFILE=C:\ProgramData, env.CLASSWORLDS_LAUNCHER=org.codehaus.plexus.classworlds.launcher.Launcher, env.PROCESSOR_ARCHITECTURE=AMD64, java.vm.version=25.65-b01, java.class.path=D:\Users\user\Desktop\apache-maven-3.5.3\bin\..\boot\plexus-classworlds-2.5.2.jar, env.=::=::\, env.HOMEPATH=\Users\user, env.EXEC_DIR=D:\Users\user\openhab\openhab2-master\git\openhab2-addons, os.arch=amd64, maven.build.version=Apache Maven 3.5.3 (3383c37e1f9e9b3bc3df5050c29c8aff9f295297; 2018-02-24T20:49:05+01:00), tycho.debug.resolver=true, env.SESSIONNAME=Console, sun.java.launcher=SUN_STANDARD, groovy.eclipse.batch.version=2.4.3-01, java.vm.specification.vendor=Oracle Corporation, ds-annotations.version=1.2.10, file.separator=\, java.runtime.version=1.8.0_65-b17, sun.boot.class.path=C:\Program Files\Java\jdk1.8.0_65\jre\lib\resources.jar;C:\Program Files\Java\jdk1.8.0_65\jre\lib\rt.jar;C:\Program Files\Java\jdk1.8.0_65\jre\lib\sunrsasign.jar;C:\Program Files\Java\jdk1.8.0_65\jre\lib\jsse.jar;C:\Program Files\Java\jdk1.8.0_65\jre\lib\jce.jar;C:\Program Files\Java\jdk1.8.0_65\jre\lib\charsets.jar;C:\Program Files\Java\jdk1.8.0_65\jre\lib\jfr.jar;C:\Program Files\Java\jdk1.8.0_65\jre\classes, scm.gitBaseUrl=https://github.com/openhab, env.ADSK_3DSMAX_X64_2017=D:\Temp\3ds MAX\3ds Max 2017\, maven.version=3.5.3, jackson.version=1.9.13, env.TEMP=D:\Users\user\AppData\Local\Temp, env.VS110COMNTOOLS=C:\Program Files (x86)\Microsoft Visual Studio 11.0\Common7\Tools\, user.country=US, maven.home=D:\Users\user\Desktop\apache-maven-3.5.3\bin\.., maven.compiler.target=1.8, java.vendor=Oracle Corporation, karaf.version=4.1.3, env.CLASSWORLDS_JAR="D:\Users\user\Desktop\apache-maven-3.5.3\bin\..\boot\plexus-classworlds-2.5.2.jar", maven.compiler.source=1.8, java.specification.version=1.8, sun.arch.data.model=64}
[INFO] Using 'UTF-8' encoding to copy filtered resources.
[DEBUG] resource with targetPath null
directory D:\Users\user\openhab\openhab2-master\git\openhab2-addons\addons\binding\org.openhab.binding.eurothermostat\src\test\resources
excludes []
includes []
[INFO] skip non existing resourceDirectory D:\Users\user\openhab\openhab2-master\git\openhab2-addons\addons\binding\org.openhab.binding.eurothermostat\src\test\resources
[INFO]
[INFO] --- target-platform-configuration:1.0.0:target-platform (default-target-platform) @ org.openhab.binding.eurothermostat ---
[DEBUG] Dependency collection stats: {ConflictMarker.analyzeTime=107148, ConflictMarker.markTime=106327, ConflictMarker.nodeCount=90, ConflictIdSorter.graphTime=54600, ConflictIdSorter.topsortTime=52958, ConflictIdSorter.conflictIdCount=40, ConflictIdSorter.conflictIdCycleCount=0, ConflictResolver.totalTime=746751, ConflictResolver.conflictItemCount=89, DefaultDependencyCollector.collectTime=5096302, DefaultDependencyCollector.transformTime=1204901}
[DEBUG] org.eclipse.tycho:target-platform-configuration:jar:1.0.0:
[DEBUG] org.apache.maven:maven-core:jar:3.0:compile
[DEBUG] org.apache.maven:maven-model:jar:3.0:compile
[DEBUG] org.apache.maven:maven-settings:jar:3.0:compile
[DEBUG] org.apache.maven:maven-settings-builder:jar:3.0:compile
[DEBUG] org.apache.maven:maven-repository-metadata:jar:3.0:compile
[DEBUG] org.apache.maven:maven-artifact:jar:3.0:compile
[DEBUG] org.apache.maven:maven-plugin-api:jar:3.0:compile
[DEBUG] org.apache.maven:maven-model-builder:jar:3.0:compile
[DEBUG] org.apache.maven:maven-aether-provider:jar:3.0:runtime
[DEBUG] org.sonatype.aether:aether-impl:jar:1.7:compile
[DEBUG] org.sonatype.aether:aether-spi:jar:1.7:compile
[DEBUG] org.sonatype.aether:aether-api:jar:1.7:compile
[DEBUG] org.sonatype.aether:aether-util:jar:1.7:compile
[DEBUG] org.sonatype.sisu:sisu-inject-plexus:jar:1.4.2:compile
[DEBUG] org.sonatype.sisu:sisu-inject-bean:jar:1.4.2:compile
[DEBUG] org.sonatype.sisu:sisu-guice:jar:noaop:2.1.7:compile
[DEBUG] org.codehaus.plexus:plexus-interpolation:jar:1.14:compile
[DEBUG] org.codehaus.plexus:plexus-utils:jar:3.0.7:compile
[DEBUG] org.codehaus.plexus:plexus-classworlds:jar:2.2.3:compile
[DEBUG] org.codehaus.plexus:plexus-component-annotations:jar:1.5.5:compile
[DEBUG] org.sonatype.plexus:plexus-sec-dispatcher:jar:1.3:compile
[DEBUG] org.sonatype.plexus:plexus-cipher:jar:1.7:compile
[DEBUG] org.eclipse.tycho:sisu-equinox-api:jar:1.0.0:compile
[DEBUG] org.eclipse.tycho:org.eclipse.tycho.p2.resolver.shared:jar:1.0.0:compile
[DEBUG] org.eclipse.tycho:tycho-core:jar:1.0.0:compile
[DEBUG] org.codehaus.plexus:plexus-archiver:jar:2.9.1:compile
[DEBUG] org.codehaus.plexus:plexus-io:jar:2.4.1:compile
[DEBUG] commons-io:commons-io:jar:2.2:compile
[DEBUG] org.apache.commons:commons-compress:jar:1.9:compile
[DEBUG] org.eclipse.tycho:org.eclipse.osgi.compatibility.state:jar:1.0.200.v20160504-1419:compile
[DEBUG] org.eclipse.tycho:sisu-equinox-embedder:jar:1.0.0:compile
[DEBUG] org.eclipse.tycho:org.eclipse.osgi:jar:3.11.2.v20161107-1947:compile
[DEBUG] org.eclipse.tycho:tycho-metadata-model:jar:1.0.0:compile
[DEBUG] de.pdark:decentxml:jar:1.3:compile
[DEBUG] org.eclipse.tycho:tycho-embedder-api:jar:1.0.0:compile
[DEBUG] org.eclipse.tycho:org.eclipse.tycho.embedder.shared:jar:1.0.0:compile
[DEBUG] org.eclipse.tycho:org.eclipse.tycho.core.shared:jar:1.0.0:compile
[DEBUG] org.apache.maven:maven-compat:jar:3.0:compile
[DEBUG] org.apache.maven.wagon:wagon-provider-api:jar:1.0-beta-6:compile
[DEBUG] Created new class realm plugin>org.eclipse.tycho:target-platform-configuration:1.0.0
[DEBUG] Importing foreign packages into class realm plugin>org.eclipse.tycho:target-platform-configuration:1.0.0
[DEBUG] Imported: < project>org.openhab:pom-addons2:2.3.0-SNAPSHOT
[DEBUG] Populating class realm plugin>org.eclipse.tycho:target-platform-configuration:1.0.0
[DEBUG] Included: org.eclipse.tycho:target-platform-configuration:jar:1.0.0
[DEBUG] Included: org.sonatype.aether:aether-util:jar:1.7
[DEBUG] Included: org.sonatype.sisu:sisu-inject-bean:jar:1.4.2
[DEBUG] Included: org.sonatype.sisu:sisu-guice:jar:noaop:2.1.7
[DEBUG] Included: org.codehaus.plexus:plexus-interpolation:jar:1.14
[DEBUG] Included: org.codehaus.plexus:plexus-utils:jar:3.0.7
[DEBUG] Included: org.codehaus.plexus:plexus-component-annotations:jar:1.5.5
[DEBUG] Included: org.sonatype.plexus:plexus-sec-dispatcher:jar:1.3
[DEBUG] Included: org.sonatype.plexus:plexus-cipher:jar:1.7
[DEBUG] Included: org.codehaus.plexus:plexus-archiver:jar:2.9.1
[DEBUG] Included: org.codehaus.plexus:plexus-io:jar:2.4.1
[DEBUG] Included: commons-io:commons-io:jar:2.2
[DEBUG] Included: org.apache.commons:commons-compress:jar:1.9
[DEBUG] Included: org.eclipse.tycho:org.eclipse.osgi.compatibility.state:jar:1.0.200.v20160504-1419
[DEBUG] Configuring mojo org.eclipse.tycho:target-platform-configuration:1.0.0:target-platform from plugin realm ClassRealm[plugin>org.eclipse.tycho:target-platform-configuration:1.0.0, parent: sun.misc.Launcher$AppClassLoader@70dea4e]
[DEBUG] Configuring mojo 'org.eclipse.tycho:target-platform-configuration:1.0.0:target-platform' with basic configurator -->
[DEBUG] (f) project = MavenProject: org.openhab.binding:org.openhab.binding.eurothermostat:2.3.0-SNAPSHOT @ D:\Users\user\openhab\openhab2-master\git\openhab2-addons\addons\binding\org.openhab.binding.eurothermostat\pom.xml
[DEBUG] -- end configuration --
[INFO]
[INFO] --- tycho-packaging-plugin:1.0.0:package-plugin (default-package-plugin) @ org.openhab.binding.eurothermostat ---
[DEBUG] Configuring mojo org.eclipse.tycho:tycho-packaging-plugin:1.0.0:package-plugin from plugin realm ClassRealm[plugin>org.eclipse.tycho:tycho-packaging-plugin:1.0.0, parent: sun.misc.Launcher$AppClassLoader@70dea4e]
[DEBUG] Configuring mojo 'org.eclipse.tycho:tycho-packaging-plugin:1.0.0:package-plugin' with basic configurator -->
[DEBUG] (f) buildDirectory = D:\Users\user\openhab\openhab2-master\git\openhab2-addons\addons\binding\org.openhab.binding.eurothermostat\target
[DEBUG] (f) finalName = org.openhab.binding.eurothermostat-2.3.0-SNAPSHOT
[DEBUG] (f) project = MavenProject: org.openhab.binding:org.openhab.binding.eurothermostat:2.3.0-SNAPSHOT @ D:\Users\user\openhab\openhab2-master\git\openhab2-addons\addons\binding\org.openhab.binding.eurothermostat\pom.xml
[DEBUG] (f) qualifier = 201803111804
[DEBUG] (f) session = org.apache.maven.execution.MavenSession@69aa2adb
[DEBUG] (f) strictBinIncludes = true
[DEBUG] (f) useDefaultExcludes = true
[DEBUG] -- end configuration --
Sign up for free to join this conversation on GitHub. Already have an account? Sign in to comment