Skip to content

Instantly share code, notes, and snippets.

Embed
What would you like to do?
pmOS error log #5
>>> linux-asus-tf700t: Unpacking /var/cache/distfiles/linux-asus-tf700t-52800b9d40bde53830b73c34f59d16fd36d2d915.tar.gz...
>>> linux-asus-tf700t: Applying extern_inline_void.patch...
>>> linux-asus-tf700t: Applying Wno-error.patch...
'/home/user/build/src/compiler-gcc6.h' -> '/home/user/build/src/grimlock_kernel_asus_tegra3_unified-52800b9d40bde53830b73c34f59d16fd36d2d915/include/linux/compiler-gcc6.h'
make: Entering directory '/home/user/build/src/grimlock_kernel_asus_tegra3_unified-52800b9d40bde53830b73c34f59d16fd36d2d915'
GEN /home/user/build/src/build/Makefile
HOSTCC scripts/basic/fixdep
HOSTCC scripts/kconfig/conf.o
SHIPPED scripts/kconfig/zconf.tab.c
SHIPPED scripts/kconfig/zconf.lex.c
SHIPPED scripts/kconfig/zconf.hash.c
HOSTCC scripts/kconfig/zconf.tab.o
HOSTLD scripts/kconfig/conf
scripts/kconfig/conf --silentoldconfig Kconfig
drivers/misc/inv_mpu6050/Kconfig:22:warning: choice value used outside its choice group
drivers/misc/inv_mpu6050/Kconfig:31:warning: choice value used outside its choice group
drivers/misc/inv_mpu6050/Kconfig:40:warning: choice value used outside its choice group
drivers/misc/inv_mpu6050/Kconfig:56:warning: choice value used outside its choice group
drivers/misc/inv_mpu6050/Kconfig:60:warning: choice value used outside its choice group
make: Leaving directory '/home/user/build/src/grimlock_kernel_asus_tegra3_unified-52800b9d40bde53830b73c34f59d16fd36d2d915'
GEN /home/user/build/src/build/Makefile
CHK include/linux/version.h
UPD include/linux/version.h
Using /home/user/build/src/grimlock_kernel_asus_tegra3_unified-52800b9d40bde53830b73c34f59d16fd36d2d915 as source for kernel
CHK include/generated/utsrelease.h
UPD include/generated/utsrelease.h
HOSTCC scripts/kallsyms
Generating include/generated/mach-types.h
CC scripts/mod/empty.o
HOSTCC scripts/selinux/genheaders/genheaders
HOSTCC scripts/mod/mk_elfconfig
HOSTCC scripts/conmakehash
MKELF scripts/mod/elfconfig.h
HOSTCC scripts/mod/file2alias.o
HOSTCC scripts/selinux/mdp/mdp
HOSTCC scripts/mod/modpost.o
HOSTCC scripts/mod/sumversion.o
HOSTLD scripts/mod/modpost
HOSTCC scripts/bin2c
CC kernel/bounds.s
GEN include/generated/bounds.h
CC arch/arm/kernel/asm-offsets.s
GEN include/generated/asm-offsets.h
CALL /home/user/build/src/grimlock_kernel_asus_tegra3_unified-52800b9d40bde53830b73c34f59d16fd36d2d915/scripts/checksyscalls.sh
CC init/main.o
HOSTCC usr/gen_init_cpio
CC arch/arm/kernel/elf.o
CC arch/arm/vfp/vfpmodule.o
GEN usr/initramfs_data.cpio
AS usr/initramfs_data.o
AS arch/arm/kernel/entry-armv.o
AS arch/arm/kernel/entry-common.o
LD usr/built-in.o
CC arch/arm/mm/extable.o
CC arch/arm/kernel/irq.o
AS arch/arm/vfp/entry.o
AS arch/arm/vfp/vfphw.o
CC arch/arm/vfp/vfpsingle.o
CC arch/arm/mm/fault.o
CC arch/arm/kernel/process.o
CHK include/generated/compile.h
UPD include/generated/compile.h
CC init/do_mounts.o
CC arch/arm/vfp/vfpdouble.o
CC arch/arm/mm/init.o
CC arch/arm/kernel/ptrace.o
CC init/do_mounts_initrd.o
CC arch/arm/mm/iomap.o
LD arch/arm/vfp/vfp.o
LD arch/arm/vfp/built-in.o
CC arch/arm/common/gic.o
CC arch/arm/kernel/return_address.o
CC arch/arm/mm/dma-mapping.o
CC init/initramfs.o
AS arch/arm/common/fiq_glue.o
CC arch/arm/common/fiq_glue_setup.o
/home/user/build/src/grimlock_kernel_asus_tegra3_unified-52800b9d40bde53830b73c34f59d16fd36d2d915/arch/arm/kernel/return_address.c:62:2: warning: #warning "TODO: return_address should use unwind tables" [-Wcpp]
#warning "TODO: return_address should use unwind tables"
^~~~~~~
CC arch/arm/kernel/setup.o
CC arch/arm/common/fiq_debugger.o
CC arch/arm/mm/fault-armv.o
CC init/calibrate.o
CC init/version.o
CC arch/arm/kernel/signal.o
CC arch/arm/mm/flush.o
LD init/mounts.o
LD init/built-in.o
AS arch/arm/crypto/aes-armv4.o
CC arch/arm/crypto/aes_glue.o
LD arch/arm/common/built-in.o
CC arch/arm/mach-tegra/ahb.o
LD arch/arm/crypto/aes-arm.o
LD arch/arm/crypto/built-in.o
CC kernel/sched.o
CC arch/arm/mm/idmap.o
CC arch/arm/mach-tegra/apbio.o
CC arch/arm/kernel/sys_arm.o
CC arch/arm/mach-tegra/common.o
CC arch/arm/mm/ioremap.o
CC arch/arm/kernel/stacktrace.o
CC arch/arm/kernel/time.o
CC arch/arm/mm/mmap.o
CC arch/arm/mach-tegra/board-info.o
CC arch/arm/kernel/traps.o
CC arch/arm/mm/pgd.o
CC arch/arm/mach-tegra/common-t3.o
CC arch/arm/mm/mmu.o
CC arch/arm/kernel/fiq.o
CC arch/arm/mach-tegra/io.o
AS arch/arm/kernel/fiqasm.o
CC arch/arm/kernel/bios32.o
CC arch/arm/mach-tegra/irq.o
CC arch/arm/mm/vmregion.o
CC arch/arm/mach-tegra/clock.o
CC arch/arm/kernel/isa.o
CC arch/arm/mm/pageattr.o
AS arch/arm/kernel/sleep.o
CC arch/arm/kernel/sched_clock.o
CC arch/arm/kernel/smp.o
CC arch/arm/mm/alignment.o
CC arch/arm/mach-tegra/clock-common.o
CC arch/arm/kernel/smp_tlb.o
CC arch/arm/mach-tegra/timer.o
/home/user/build/src/grimlock_kernel_asus_tegra3_unified-52800b9d40bde53830b73c34f59d16fd36d2d915/arch/arm/mm/alignment.c: In function 'do_alignment':
/home/user/build/src/grimlock_kernel_asus_tegra3_unified-52800b9d40bde53830b73c34f59d16fd36d2d915/arch/arm/mm/alignment.c:326:15: warning: 'offset.un' may be used uninitialized in this function [-Wmaybe-uninitialized]
offset.un = -offset.un;
^~~~~~~~~~
/home/user/build/src/grimlock_kernel_asus_tegra3_unified-52800b9d40bde53830b73c34f59d16fd36d2d915/arch/arm/mm/alignment.c:748:21: note: 'offset.un' was declared here
union offset_union offset;
^~~~~~
CC arch/arm/mm/highmem.o
CC arch/arm/kernel/smp_scu.o
CC arch/arm/kernel/smp_twd.o
CC arch/arm/mach-tegra/timerinfo.o
AS arch/arm/mm/abort-ev7.o
AS arch/arm/mm/pabort-v7.o
AS arch/arm/mm/cache-v7.o
CC arch/arm/mm/copypage-v6.o
CC arch/arm/kernel/unwind.o
CC arch/arm/mach-tegra/tegra3_clocks.o
CC arch/arm/mm/context.o
CC arch/arm/kernel/swp_emulate.o
AS arch/arm/mm/tlb-v7.o
AS arch/arm/mm/proc-v7.o
CC arch/arm/mm/cache-l2x0.o
LD arch/arm/mm/built-in.o
CC mm/filemap.o
CC arch/arm/kernel/hw_breakpoint.o
CC arch/arm/kernel/pmu.o
/home/user/build/src/grimlock_kernel_asus_tegra3_unified-52800b9d40bde53830b73c34f59d16fd36d2d915/arch/arm/mach-tegra/tegra3_clocks.c: In function 'tegra3_cpu_clk_init':
/home/user/build/src/grimlock_kernel_asus_tegra3_unified-52800b9d40bde53830b73c34f59d16fd36d2d915/arch/arm/mach-tegra/tegra3_clocks.c:823:31: warning: logical not is only applied to the left hand side of comparison [-Wlogical-not-parentheses]
c->state = (!is_lp_cluster() == (c->u.cpu.mode == MODE_G))? ON : OFF;
^~
/home/user/build/src/grimlock_kernel_asus_tegra3_unified-52800b9d40bde53830b73c34f59d16fd36d2d915/arch/arm/mach-tegra/tegra3_clocks.c: In function 'tegra3_pll_clk_set_rate':
/home/user/build/src/grimlock_kernel_asus_tegra3_unified-52800b9d40bde53830b73c34f59d16fd36d2d915/arch/arm/mach-tegra/tegra3_clocks.c:1725:4: warning: ISO C90 forbids mixed declarations and code [-Wdeclaration-after-statement]
unsigned long output_real = input*divN/divM;
^~~~~~~~
CC arch/arm/mach-tegra/clocks_stats.o
CC arch/arm/kernel/perf_event.o
CC arch/arm/mach-tegra/timer-t3.o
CC kernel/fork.o
CC mm/mempool.o
CC arch/arm/mach-tegra/pinmux.o
CC arch/arm/kernel/cpu_pm.o
CC arch/arm/kernel/io.o
CC mm/oom_kill.o
AS arch/arm/kernel/head.o
CC arch/arm/kernel/init_task.o
CC arch/arm/mach-tegra/devices.o
CC kernel/exec_domain.o
LDS arch/arm/kernel/vmlinux.lds
LD arch/arm/kernel/built-in.o
CC fs/open.o
CC mm/fadvise.o
AS arch/arm/mach-tegra/delay.o
CC arch/arm/mach-tegra/powergate.o
CC kernel/panic.o
CC mm/maccess.o
CC arch/arm/mach-tegra/pm.o
CC mm/page_alloc.o
CC kernel/printk.o
CC fs/read_write.o
CC arch/arm/mach-tegra/pm-irq.o
CC fs/file_table.o
CC kernel/cpu.o
In file included from /home/user/build/src/grimlock_kernel_asus_tegra3_unified-52800b9d40bde53830b73c34f59d16fd36d2d915/arch/arm/include/asm/byteorder.h:21:0,
from /home/user/build/src/grimlock_kernel_asus_tegra3_unified-52800b9d40bde53830b73c34f59d16fd36d2d915/include/asm-generic/bitops/le.h:5,
from /home/user/build/src/grimlock_kernel_asus_tegra3_unified-52800b9d40bde53830b73c34f59d16fd36d2d915/arch/arm/include/asm/bitops.h:308,
from /home/user/build/src/grimlock_kernel_asus_tegra3_unified-52800b9d40bde53830b73c34f59d16fd36d2d915/include/linux/bitops.h:22,
from /home/user/build/src/grimlock_kernel_asus_tegra3_unified-52800b9d40bde53830b73c34f59d16fd36d2d915/include/linux/kernel.h:17,
from /home/user/build/src/grimlock_kernel_asus_tegra3_unified-52800b9d40bde53830b73c34f59d16fd36d2d915/arch/arm/mach-tegra/pm-irq.c:18:
/home/user/build/src/grimlock_kernel_asus_tegra3_unified-52800b9d40bde53830b73c34f59d16fd36d2d915/arch/arm/mach-tegra/pm-irq.c:121:21: warning: 'pmc' is static but used in inline function 'read_pmc_wake_status' which is not static
reg |= ((u64)readl(pmc + PMC_WAKE2_STATUS)) << 32;
^
/home/user/build/src/grimlock_kernel_asus_tegra3_unified-52800b9d40bde53830b73c34f59d16fd36d2d915/include/linux/byteorder/little_endian.h:33:51: note: in definition of macro '__le32_to_cpu'
#define __le32_to_cpu(x) ((__force __u32)(__le32)(x))
^
/home/user/build/src/grimlock_kernel_asus_tegra3_unified-52800b9d40bde53830b73c34f59d16fd36d2d915/arch/arm/include/asm/io.h:196:6: note: in expansion of macro '__raw_readl'
__raw_readl(__mem_pci(c))); __v; })
^~~~~~~~~~~
/home/user/build/src/grimlock_kernel_asus_tegra3_unified-52800b9d40bde53830b73c34f59d16fd36d2d915/arch/arm/include/asm/io.h:196:18: note: in expansion of macro '__mem_pci'
__raw_readl(__mem_pci(c))); __v; })
^~~~~~~~~
/home/user/build/src/grimlock_kernel_asus_tegra3_unified-52800b9d40bde53830b73c34f59d16fd36d2d915/arch/arm/include/asm/io.h:206:32: note: in expansion of macro 'readl_relaxed'
#define readl(c) ({ u32 __v = readl_relaxed(c); __iormb(); __v; })
^~~~~~~~~~~~~
/home/user/build/src/grimlock_kernel_asus_tegra3_unified-52800b9d40bde53830b73c34f59d16fd36d2d915/arch/arm/mach-tegra/pm-irq.c:121:15: note: in expansion of macro 'readl'
reg |= ((u64)readl(pmc + PMC_WAKE2_STATUS)) << 32;
^~~~~
In file included from /home/user/build/src/grimlock_kernel_asus_tegra3_unified-52800b9d40bde53830b73c34f59d16fd36d2d915/include/linux/io.h:22:0,
from /home/user/build/src/grimlock_kernel_asus_tegra3_unified-52800b9d40bde53830b73c34f59d16fd36d2d915/arch/arm/mach-tegra/pm-irq.c:24:
/home/user/build/src/grimlock_kernel_asus_tegra3_unified-52800b9d40bde53830b73c34f59d16fd36d2d915/arch/arm/mach-tegra/pm-irq.c:120:20: warning: 'pmc' is static but used in inline function 'read_pmc_wake_status' which is not static
reg = __raw_readl(pmc + PMC_WAKE_STATUS);
^
/home/user/build/src/grimlock_kernel_asus_tegra3_unified-52800b9d40bde53830b73c34f59d16fd36d2d915/arch/arm/include/asm/io.h:56:80: note: in definition of macro '__raw_readl'
#define __raw_readl(a) (__chk_io_ptr(a), *(volatile unsigned int __force *)(a))
^
CC arch/arm/mach-tegra/gic.o
AS arch/arm/mach-tegra/sleep.o
AS arch/arm/mach-tegra/sleep-t3.o
CC arch/arm/mach-tegra/fuse.o
CC fs/super.o
CC kernel/exit.o
CC arch/arm/mach-tegra/kfuse.o
CC mm/page-writeback.o
CC arch/arm/mach-tegra/csi.o
CC arch/arm/mach-tegra/tegra_odm_fuses.o
CC fs/char_dev.o
CC arch/arm/mach-tegra/i2c_error_recovery.o
CC fs/stat.o
CC kernel/itimer.o
CC mm/readahead.o
CC arch/arm/mach-tegra/mc.o
CC arch/arm/mach-tegra/usb_phy.o
TIMEC kernel/timeconst.h
Can't use 'defined(@array)' (Maybe you should just omit the defined()?) at /home/user/build/src/grimlock_kernel_asus_tegra3_unified-52800b9d40bde53830b73c34f59d16fd36d2d915/kernel/timeconst.pl line 373.
make[3]: *** [/home/user/build/src/grimlock_kernel_asus_tegra3_unified-52800b9d40bde53830b73c34f59d16fd36d2d915/kernel/Makefile:140: kernel/timeconst.h] Error 255
make[2]: *** [/home/user/build/src/grimlock_kernel_asus_tegra3_unified-52800b9d40bde53830b73c34f59d16fd36d2d915/Makefile:944: kernel] Error 2
make[2]: *** Waiting for unfinished jobs....
CC arch/arm/mach-tegra/tegra3_usb_phy.o
CC fs/exec.o
CC mm/swap.o
CC arch/arm/mach-tegra/tegra2_usb_phy.o
CC mm/truncate.o
CC arch/arm/mach-tegra/fiq.o
/home/user/build/src/grimlock_kernel_asus_tegra3_unified-52800b9d40bde53830b73c34f59d16fd36d2d915/arch/arm/mach-tegra/tegra3_usb_phy.c: In function 'uhsic_phy_open':
/home/user/build/src/grimlock_kernel_asus_tegra3_unified-52800b9d40bde53830b73c34f59d16fd36d2d915/arch/arm/mach-tegra/tegra3_usb_phy.c:2196:6: warning: unused variable 'ret' [-Wunused-variable]
int ret;
^~~
/home/user/build/src/grimlock_kernel_asus_tegra3_unified-52800b9d40bde53830b73c34f59d16fd36d2d915/arch/arm/mach-tegra/tegra3_usb_phy.c: In function 'uhsic_phy_close':
/home/user/build/src/grimlock_kernel_asus_tegra3_unified-52800b9d40bde53830b73c34f59d16fd36d2d915/arch/arm/mach-tegra/tegra3_usb_phy.c:2230:6: warning: unused variable 'ret' [-Wunused-variable]
int ret;
^~~
At top level:
/home/user/build/src/grimlock_kernel_asus_tegra3_unified-52800b9d40bde53830b73c34f59d16fd36d2d915/arch/arm/mach-tegra/tegra3_usb_phy.c:2174:12: warning: 'hsic_rail_disable' defined but not used [-Wunused-function]
static int hsic_rail_disable(struct tegra_usb_phy *phy)
^~~~~~~~~~~~~~~~~
/home/user/build/src/grimlock_kernel_asus_tegra3_unified-52800b9d40bde53830b73c34f59d16fd36d2d915/arch/arm/mach-tegra/tegra3_usb_phy.c:2152:12: warning: 'hsic_rail_enable' defined but not used [-Wunused-function]
static int hsic_rail_enable(struct tegra_usb_phy *phy)
^~~~~~~~~~~~~~~~
CC arch/arm/mach-tegra/tegra_fiq_debugger.o
CC fs/pipe.o
CC arch/arm/mach-tegra/pwm.o
CC arch/arm/mach-tegra/dvfs.o
CC mm/vmscan.o
CC arch/arm/mach-tegra/tegra3_dvfs.o
CC fs/namei.o
/home/user/build/src/grimlock_kernel_asus_tegra3_unified-52800b9d40bde53830b73c34f59d16fd36d2d915/arch/arm/mach-tegra/tegra3_dvfs.c:239:17: warning: initialization discards 'const' qualifier from pointer target type [-Wdiscarded-qualifiers]
.millivolts = core_millivolts, \
^
/home/user/build/src/grimlock_kernel_asus_tegra3_unified-52800b9d40bde53830b73c34f59d16fd36d2d915/arch/arm/mach-tegra/tegra3_dvfs.c:247:2: note: in expansion of macro 'CORE_DVFS'
CORE_DVFS("cpu_lp", 0, 1, KHZ, 1, 294000, 342000, 427000, 475000, 500000, 500000, 500000, 500000),
^~~~~~~~~
/home/user/build/src/grimlock_kernel_asus_tegra3_unified-52800b9d40bde53830b73c34f59d16fd36d2d915/arch/arm/mach-tegra/tegra3_dvfs.c:239:17: warning: initialization discards 'const' qualifier from pointer target type [-Wdiscarded-qualifiers]
.millivolts = core_millivolts, \
^
/home/user/build/src/grimlock_kernel_asus_tegra3_unified-52800b9d40bde53830b73c34f59d16fd36d2d915/arch/arm/mach-tegra/tegra3_dvfs.c:248:2: note: in expansion of macro 'CORE_DVFS'
CORE_DVFS("cpu_lp", 1, 1, KHZ, 204000, 294000, 342000, 427000, 475000, 500000, 500000, 500000, 500000),
^~~~~~~~~
/home/user/build/src/grimlock_kernel_asus_tegra3_unified-52800b9d40bde53830b73c34f59d16fd36d2d915/arch/arm/mach-tegra/tegra3_dvfs.c:239:17: warning: initialization discards 'const' qualifier from pointer target type [-Wdiscarded-qualifiers]
.millivolts = core_millivolts, \
^
/home/user/build/src/grimlock_kernel_asus_tegra3_unified-52800b9d40bde53830b73c34f59d16fd36d2d915/arch/arm/mach-tegra/tegra3_dvfs.c:249:2: note: in expansion of macro 'CORE_DVFS'
CORE_DVFS("cpu_lp", 2, 1, KHZ, 204000, 295000, 370000, 428000, 475000, 513000, 579000, 620000, 620000),
^~~~~~~~~
/home/user/build/src/grimlock_kernel_asus_tegra3_unified-52800b9d40bde53830b73c34f59d16fd36d2d915/arch/arm/mach-tegra/tegra3_dvfs.c:239:17: warning: initialization discards 'const' qualifier from pointer target type [-Wdiscarded-qualifiers]
.millivolts = core_millivolts, \
^
/home/user/build/src/grimlock_kernel_asus_tegra3_unified-52800b9d40bde53830b73c34f59d16fd36d2d915/arch/arm/mach-tegra/tegra3_dvfs.c:250:2: note: in expansion of macro 'CORE_DVFS'
CORE_DVFS("cpu_lp", 3, 1, KHZ, 1, 1, 1, 1, 1, 1, 450000, 450000, 450000),
^~~~~~~~~
/home/user/build/src/grimlock_kernel_asus_tegra3_unified-52800b9d40bde53830b73c34f59d16fd36d2d915/arch/arm/mach-tegra/tegra3_dvfs.c:239:17: warning: initialization discards 'const' qualifier from pointer target type [-Wdiscarded-qualifiers]
.millivolts = core_millivolts, \
^
/home/user/build/src/grimlock_kernel_asus_tegra3_unified-52800b9d40bde53830b73c34f59d16fd36d2d915/arch/arm/mach-tegra/tegra3_dvfs.c:252:2: note: in expansion of macro 'CORE_DVFS'
CORE_DVFS("emc", 0, 1, KHZ, 1, 266500, 266500, 266500, 266500, 533000, 533000, 533000, 533000),
^~~~~~~~~
/home/user/build/src/grimlock_kernel_asus_tegra3_unified-52800b9d40bde53830b73c34f59d16fd36d2d915/arch/arm/mach-tegra/tegra3_dvfs.c:239:17: warning: initialization discards 'const' qualifier from pointer target type [-Wdiscarded-qualifiers]
.millivolts = core_millivolts, \
^
/home/user/build/src/grimlock_kernel_asus_tegra3_unified-52800b9d40bde53830b73c34f59d16fd36d2d915/arch/arm/mach-tegra/tegra3_dvfs.c:253:2: note: in expansion of macro 'CORE_DVFS'
CORE_DVFS("emc", 1, 1, KHZ, 102000, 408000, 408000, 408000, 408000, 667000, 667000, 667000, 667000),
^~~~~~~~~
/home/user/build/src/grimlock_kernel_asus_tegra3_unified-52800b9d40bde53830b73c34f59d16fd36d2d915/arch/arm/mach-tegra/tegra3_dvfs.c:239:17: warning: initialization discards 'const' qualifier from pointer target type [-Wdiscarded-qualifiers]
.millivolts = core_millivolts, \
^
/home/user/build/src/grimlock_kernel_asus_tegra3_unified-52800b9d40bde53830b73c34f59d16fd36d2d915/arch/arm/mach-tegra/tegra3_dvfs.c:254:2: note: in expansion of macro 'CORE_DVFS'
CORE_DVFS("emc", 2, 1, KHZ, 102000, 450000, 450000, 450000, 450000, 667000, 667000, 800000, 900000),
^~~~~~~~~
/home/user/build/src/grimlock_kernel_asus_tegra3_unified-52800b9d40bde53830b73c34f59d16fd36d2d915/arch/arm/mach-tegra/tegra3_dvfs.c:239:17: warning: initialization discards 'const' qualifier from pointer target type [-Wdiscarded-qualifiers]
.millivolts = core_millivolts, \
^
/home/user/build/src/grimlock_kernel_asus_tegra3_unified-52800b9d40bde53830b73c34f59d16fd36d2d915/arch/arm/mach-tegra/tegra3_dvfs.c:255:2: note: in expansion of macro 'CORE_DVFS'
CORE_DVFS("emc", 3, 1, KHZ, 1, 1, 1, 1, 1, 1, 625000, 625000, 625000),
^~~~~~~~~
/home/user/build/src/grimlock_kernel_asus_tegra3_unified-52800b9d40bde53830b73c34f59d16fd36d2d915/arch/arm/mach-tegra/tegra3_dvfs.c:239:17: warning: initialization discards 'const' qualifier from pointer target type [-Wdiscarded-qualifiers]
.millivolts = core_millivolts, \
^
/home/user/build/src/grimlock_kernel_asus_tegra3_unified-52800b9d40bde53830b73c34f59d16fd36d2d915/arch/arm/mach-tegra/tegra3_dvfs.c:257:2: note: in expansion of macro 'CORE_DVFS'
CORE_DVFS("sbus", 0, 1, KHZ, 1, 136000, 164000, 191000, 216000, 216000, 216000, 216000, 216000),
^~~~~~~~~
/home/user/build/src/grimlock_kernel_asus_tegra3_unified-52800b9d40bde53830b73c34f59d16fd36d2d915/arch/arm/mach-tegra/tegra3_dvfs.c:239:17: warning: initialization discards 'const' qualifier from pointer target type [-Wdiscarded-qualifiers]
.millivolts = core_millivolts, \
^
/home/user/build/src/grimlock_kernel_asus_tegra3_unified-52800b9d40bde53830b73c34f59d16fd36d2d915/arch/arm/mach-tegra/tegra3_dvfs.c:258:2: note: in expansion of macro 'CORE_DVFS'
CORE_DVFS("sbus", 1, 1, KHZ, 102000, 205000, 205000, 227000, 227000, 267000, 267000, 267000, 267000),
^~~~~~~~~
/home/user/build/src/grimlock_kernel_asus_tegra3_unified-52800b9d40bde53830b73c34f59d16fd36d2d915/arch/arm/mach-tegra/tegra3_dvfs.c:239:17: warning: initialization discards 'const' qualifier from pointer target type [-Wdiscarded-qualifiers]
.millivolts = core_millivolts, \
^
/home/user/build/src/grimlock_kernel_asus_tegra3_unified-52800b9d40bde53830b73c34f59d16fd36d2d915/arch/arm/mach-tegra/tegra3_dvfs.c:259:2: note: in expansion of macro 'CORE_DVFS'
CORE_DVFS("sbus", 2, 1, KHZ, 102000, 205000, 205000, 227000, 227000, 267000, 334000, 334000, 334000),
^~~~~~~~~
/home/user/build/src/grimlock_kernel_asus_tegra3_unified-52800b9d40bde53830b73c34f59d16fd36d2d915/arch/arm/mach-tegra/tegra3_dvfs.c:239:17: warning: initialization discards 'const' qualifier from pointer target type [-Wdiscarded-qualifiers]
.millivolts = core_millivolts, \
^
/home/user/build/src/grimlock_kernel_asus_tegra3_unified-52800b9d40bde53830b73c34f59d16fd36d2d915/arch/arm/mach-tegra/tegra3_dvfs.c:260:2: note: in expansion of macro 'CORE_DVFS'
CORE_DVFS("sbus", 3, 1, KHZ, 1, 1, 1, 1, 1, 1, 334000, 334000, 334000),
^~~~~~~~~
/home/user/build/src/grimlock_kernel_asus_tegra3_unified-52800b9d40bde53830b73c34f59d16fd36d2d915/arch/arm/mach-tegra/tegra3_dvfs.c:239:17: warning: initialization discards 'const' qualifier from pointer target type [-Wdiscarded-qualifiers]
.millivolts = core_millivolts, \
^
/home/user/build/src/grimlock_kernel_asus_tegra3_unified-52800b9d40bde53830b73c34f59d16fd36d2d915/arch/arm/mach-tegra/tegra3_dvfs.c:262:2: note: in expansion of macro 'CORE_DVFS'
CORE_DVFS("vi", 0, 1, KHZ, 1, 216000, 285000, 300000, 300000, 300000, 300000, 300000, 300000),
^~~~~~~~~
/home/user/build/src/grimlock_kernel_asus_tegra3_unified-52800b9d40bde53830b73c34f59d16fd36d2d915/arch/arm/mach-tegra/tegra3_dvfs.c:239:17: warning: initialization discards 'const' qualifier from pointer target type [-Wdiscarded-qualifiers]
.millivolts = core_millivolts, \
^
/home/user/build/src/grimlock_kernel_asus_tegra3_unified-52800b9d40bde53830b73c34f59d16fd36d2d915/arch/arm/mach-tegra/tegra3_dvfs.c:263:2: note: in expansion of macro 'CORE_DVFS'
CORE_DVFS("vi", 1, 1, KHZ, 1, 216000, 267000, 300000, 371000, 409000, 409000, 409000, 409000),
^~~~~~~~~
/home/user/build/src/grimlock_kernel_asus_tegra3_unified-52800b9d40bde53830b73c34f59d16fd36d2d915/arch/arm/mach-tegra/tegra3_dvfs.c:239:17: warning: initialization discards 'const' qualifier from pointer target type [-Wdiscarded-qualifiers]
.millivolts = core_millivolts, \
^
/home/user/build/src/grimlock_kernel_asus_tegra3_unified-52800b9d40bde53830b73c34f59d16fd36d2d915/arch/arm/mach-tegra/tegra3_dvfs.c:264:2: note: in expansion of macro 'CORE_DVFS'
CORE_DVFS("vi", 2, 1, KHZ, 1, 219000, 267000, 300000, 371000, 409000, 425000, 425000, 425000),
^~~~~~~~~
/home/user/build/src/grimlock_kernel_asus_tegra3_unified-52800b9d40bde53830b73c34f59d16fd36d2d915/arch/arm/mach-tegra/tegra3_dvfs.c:239:17: warning: initialization discards 'const' qualifier from pointer target type [-Wdiscarded-qualifiers]
.millivolts = core_millivolts, \
^
/home/user/build/src/grimlock_kernel_asus_tegra3_unified-52800b9d40bde53830b73c34f59d16fd36d2d915/arch/arm/mach-tegra/tegra3_dvfs.c:265:2: note: in expansion of macro 'CORE_DVFS'
CORE_DVFS("vi", 3, 1, KHZ, 1, 1, 1, 1, 1, 1, 470000, 470000, 470000),
^~~~~~~~~
/home/user/build/src/grimlock_kernel_asus_tegra3_unified-52800b9d40bde53830b73c34f59d16fd36d2d915/arch/arm/mach-tegra/tegra3_dvfs.c:239:17: warning: initialization discards 'const' qualifier from pointer target type [-Wdiscarded-qualifiers]
.millivolts = core_millivolts, \
^
/home/user/build/src/grimlock_kernel_asus_tegra3_unified-52800b9d40bde53830b73c34f59d16fd36d2d915/arch/arm/mach-tegra/tegra3_dvfs.c:267:2: note: in expansion of macro 'CORE_DVFS'
CORE_DVFS("vde", 0, 1, KHZ, 200000, 247000, 304000, 352000, 400000, 437000, 484000, 520000, 650000),
^~~~~~~~~
/home/user/build/src/grimlock_kernel_asus_tegra3_unified-52800b9d40bde53830b73c34f59d16fd36d2d915/arch/arm/mach-tegra/tegra3_dvfs.c:239:17: warning: initialization discards 'const' qualifier from pointer target type [-Wdiscarded-qualifiers]
.millivolts = core_millivolts, \
^
/home/user/build/src/grimlock_kernel_asus_tegra3_unified-52800b9d40bde53830b73c34f59d16fd36d2d915/arch/arm/mach-tegra/tegra3_dvfs.c:268:2: note: in expansion of macro 'CORE_DVFS'
CORE_DVFS("mpe", 0, 1, KHZ, 200000, 247000, 304000, 361000, 408000, 446000, 484000, 520000, 650000),
^~~~~~~~~
/home/user/build/src/grimlock_kernel_asus_tegra3_unified-52800b9d40bde53830b73c34f59d16fd36d2d915/arch/arm/mach-tegra/tegra3_dvfs.c:239:17: warning: initialization discards 'const' qualifier from pointer target type [-Wdiscarded-qualifiers]
.millivolts = core_millivolts, \
^
/home/user/build/src/grimlock_kernel_asus_tegra3_unified-52800b9d40bde53830b73c34f59d16fd36d2d915/arch/arm/mach-tegra/tegra3_dvfs.c:269:2: note: in expansion of macro 'CORE_DVFS'
CORE_DVFS("2d", 0, 1, KHZ, 200000, 267000, 304000, 361000, 408000, 446000, 484000, 520000, 650000),
^~~~~~~~~
/home/user/build/src/grimlock_kernel_asus_tegra3_unified-52800b9d40bde53830b73c34f59d16fd36d2d915/arch/arm/mach-tegra/tegra3_dvfs.c:239:17: warning: initialization discards 'const' qualifier from pointer target type [-Wdiscarded-qualifiers]
.millivolts = core_millivolts, \
^
/home/user/build/src/grimlock_kernel_asus_tegra3_unified-52800b9d40bde53830b73c34f59d16fd36d2d915/arch/arm/mach-tegra/tegra3_dvfs.c:270:2: note: in expansion of macro 'CORE_DVFS'
CORE_DVFS("epp", 0, 1, KHZ, 200000, 267000, 304000, 361000, 408000, 446000, 484000, 520000, 650000),
^~~~~~~~~
/home/user/build/src/grimlock_kernel_asus_tegra3_unified-52800b9d40bde53830b73c34f59d16fd36d2d915/arch/arm/mach-tegra/tegra3_dvfs.c:239:17: warning: initialization discards 'const' qualifier from pointer target type [-Wdiscarded-qualifiers]
.millivolts = core_millivolts, \
^
/home/user/build/src/grimlock_kernel_asus_tegra3_unified-52800b9d40bde53830b73c34f59d16fd36d2d915/arch/arm/mach-tegra/tegra3_dvfs.c:271:2: note: in expansion of macro 'CORE_DVFS'
CORE_DVFS("3d", 0, 1, KHZ, 200000, 267000, 304000, 361000, 408000, 446000, 484000, 520000, 650000),
^~~~~~~~~
/home/user/build/src/grimlock_kernel_asus_tegra3_unified-52800b9d40bde53830b73c34f59d16fd36d2d915/arch/arm/mach-tegra/tegra3_dvfs.c:239:17: warning: initialization discards 'const' qualifier from pointer target type [-Wdiscarded-qualifiers]
.millivolts = core_millivolts, \
^
/home/user/build/src/grimlock_kernel_asus_tegra3_unified-52800b9d40bde53830b73c34f59d16fd36d2d915/arch/arm/mach-tegra/tegra3_dvfs.c:272:2: note: in expansion of macro 'CORE_DVFS'
CORE_DVFS("3d2", 0, 1, KHZ, 200000, 267000, 304000, 361000, 408000, 446000, 484000, 520000, 650000),
^~~~~~~~~
/home/user/build/src/grimlock_kernel_asus_tegra3_unified-52800b9d40bde53830b73c34f59d16fd36d2d915/arch/arm/mach-tegra/tegra3_dvfs.c:239:17: warning: initialization discards 'const' qualifier from pointer target type [-Wdiscarded-qualifiers]
.millivolts = core_millivolts, \
^
/home/user/build/src/grimlock_kernel_asus_tegra3_unified-52800b9d40bde53830b73c34f59d16fd36d2d915/arch/arm/mach-tegra/tegra3_dvfs.c:273:2: note: in expansion of macro 'CORE_DVFS'
CORE_DVFS("se", 0, 1, KHZ, 200000, 267000, 304000, 361000, 408000, 446000, 484000, 520000, 650000),
^~~~~~~~~
/home/user/build/src/grimlock_kernel_asus_tegra3_unified-52800b9d40bde53830b73c34f59d16fd36d2d915/arch/arm/mach-tegra/tegra3_dvfs.c:239:17: warning: initialization discards 'const' qualifier from pointer target type [-Wdiscarded-qualifiers]
.millivolts = core_millivolts, \
^
/home/user/build/src/grimlock_kernel_asus_tegra3_unified-52800b9d40bde53830b73c34f59d16fd36d2d915/arch/arm/mach-tegra/tegra3_dvfs.c:275:2: note: in expansion of macro 'CORE_DVFS'
CORE_DVFS("vde", 1, 1, KHZ, 200000, 247000, 304000, 352000, 400000, 437000, 484000, 520000, 650000),
^~~~~~~~~
/home/user/build/src/grimlock_kernel_asus_tegra3_unified-52800b9d40bde53830b73c34f59d16fd36d2d915/arch/arm/mach-tegra/tegra3_dvfs.c:239:17: warning: initialization discards 'const' qualifier from pointer target type [-Wdiscarded-qualifiers]
.millivolts = core_millivolts, \
^
/home/user/build/src/grimlock_kernel_asus_tegra3_unified-52800b9d40bde53830b73c34f59d16fd36d2d915/arch/arm/mach-tegra/tegra3_dvfs.c:276:2: note: in expansion of macro 'CORE_DVFS'
CORE_DVFS("mpe", 1, 1, KHZ, 200000, 247000, 304000, 361000, 408000, 446000, 484000, 520000, 650000),
^~~~~~~~~
/home/user/build/src/grimlock_kernel_asus_tegra3_unified-52800b9d40bde53830b73c34f59d16fd36d2d915/arch/arm/mach-tegra/tegra3_dvfs.c:239:17: warning: initialization discards 'const' qualifier from pointer target type [-Wdiscarded-qualifiers]
.millivolts = core_millivolts, \
^
/home/user/build/src/grimlock_kernel_asus_tegra3_unified-52800b9d40bde53830b73c34f59d16fd36d2d915/arch/arm/mach-tegra/tegra3_dvfs.c:277:2: note: in expansion of macro 'CORE_DVFS'
CORE_DVFS("2d", 1, 1, KHZ, 200000, 267000, 304000, 361000, 408000, 446000, 484000, 520000, 650000),
^~~~~~~~~
/home/user/build/src/grimlock_kernel_asus_tegra3_unified-52800b9d40bde53830b73c34f59d16fd36d2d915/arch/arm/mach-tegra/tegra3_dvfs.c:239:17: warning: initialization discards 'const' qualifier from pointer target type [-Wdiscarded-qualifiers]
.millivolts = core_millivolts, \
^
/home/user/build/src/grimlock_kernel_asus_tegra3_unified-52800b9d40bde53830b73c34f59d16fd36d2d915/arch/arm/mach-tegra/tegra3_dvfs.c:278:2: note: in expansion of macro 'CORE_DVFS'
CORE_DVFS("epp", 1, 1, KHZ, 200000, 267000, 304000, 361000, 408000, 446000, 484000, 520000, 650000),
^~~~~~~~~
/home/user/build/src/grimlock_kernel_asus_tegra3_unified-52800b9d40bde53830b73c34f59d16fd36d2d915/arch/arm/mach-tegra/tegra3_dvfs.c:239:17: warning: initialization discards 'const' qualifier from pointer target type [-Wdiscarded-qualifiers]
.millivolts = core_millivolts, \
^
/home/user/build/src/grimlock_kernel_asus_tegra3_unified-52800b9d40bde53830b73c34f59d16fd36d2d915/arch/arm/mach-tegra/tegra3_dvfs.c:279:2: note: in expansion of macro 'CORE_DVFS'
CORE_DVFS("3d", 1, 1, KHZ, 200000, 247000, 304000, 361000, 408000, 446000, 484000, 520000, 650000),
^~~~~~~~~
/home/user/build/src/grimlock_kernel_asus_tegra3_unified-52800b9d40bde53830b73c34f59d16fd36d2d915/arch/arm/mach-tegra/tegra3_dvfs.c:239:17: warning: initialization discards 'const' qualifier from pointer target type [-Wdiscarded-qualifiers]
.millivolts = core_millivolts, \
^
/home/user/build/src/grimlock_kernel_asus_tegra3_unified-52800b9d40bde53830b73c34f59d16fd36d2d915/arch/arm/mach-tegra/tegra3_dvfs.c:280:2: note: in expansion of macro 'CORE_DVFS'
CORE_DVFS("3d2", 1, 1, KHZ, 200000, 247000, 304000, 361000, 408000, 446000, 484000, 520000, 650000),
^~~~~~~~~
/home/user/build/src/grimlock_kernel_asus_tegra3_unified-52800b9d40bde53830b73c34f59d16fd36d2d915/arch/arm/mach-tegra/tegra3_dvfs.c:239:17: warning: initialization discards 'const' qualifier from pointer target type [-Wdiscarded-qualifiers]
.millivolts = core_millivolts, \
^
/home/user/build/src/grimlock_kernel_asus_tegra3_unified-52800b9d40bde53830b73c34f59d16fd36d2d915/arch/arm/mach-tegra/tegra3_dvfs.c:281:2: note: in expansion of macro 'CORE_DVFS'
CORE_DVFS("se", 1, 1, KHZ, 200000, 267000, 304000, 361000, 408000, 446000, 484000, 520000, 650000),
^~~~~~~~~
/home/user/build/src/grimlock_kernel_asus_tegra3_unified-52800b9d40bde53830b73c34f59d16fd36d2d915/arch/arm/mach-tegra/tegra3_dvfs.c:239:17: warning: initialization discards 'const' qualifier from pointer target type [-Wdiscarded-qualifiers]
.millivolts = core_millivolts, \
^
/home/user/build/src/grimlock_kernel_asus_tegra3_unified-52800b9d40bde53830b73c34f59d16fd36d2d915/arch/arm/mach-tegra/tegra3_dvfs.c:283:2: note: in expansion of macro 'CORE_DVFS'
CORE_DVFS("vde", 2, 1, KHZ, 200000, 247000, 304000, 352000, 400000, 437000, 484000, 520000, 650000),
^~~~~~~~~
/home/user/build/src/grimlock_kernel_asus_tegra3_unified-52800b9d40bde53830b73c34f59d16fd36d2d915/arch/arm/mach-tegra/tegra3_dvfs.c:239:17: warning: initialization discards 'const' qualifier from pointer target type [-Wdiscarded-qualifiers]
.millivolts = core_millivolts, \
^
/home/user/build/src/grimlock_kernel_asus_tegra3_unified-52800b9d40bde53830b73c34f59d16fd36d2d915/arch/arm/mach-tegra/tegra3_dvfs.c:284:2: note: in expansion of macro 'CORE_DVFS'
CORE_DVFS("mpe", 2, 1, KHZ, 200000, 247000, 304000, 361000, 408000, 446000, 484000, 520000, 650000),
^~~~~~~~~
/home/user/build/src/grimlock_kernel_asus_tegra3_unified-52800b9d40bde53830b73c34f59d16fd36d2d915/arch/arm/mach-tegra/tegra3_dvfs.c:239:17: warning: initialization discards 'const' qualifier from pointer target type [-Wdiscarded-qualifiers]
.millivolts = core_millivolts, \
^
/home/user/build/src/grimlock_kernel_asus_tegra3_unified-52800b9d40bde53830b73c34f59d16fd36d2d915/arch/arm/mach-tegra/tegra3_dvfs.c:285:2: note: in expansion of macro 'CORE_DVFS'
CORE_DVFS("2d", 2, 1, KHZ, 200000, 267000, 304000, 361000, 408000, 446000, 484000, 520000, 650000),
^~~~~~~~~
/home/user/build/src/grimlock_kernel_asus_tegra3_unified-52800b9d40bde53830b73c34f59d16fd36d2d915/arch/arm/mach-tegra/tegra3_dvfs.c:239:17: warning: initialization discards 'const' qualifier from pointer target type [-Wdiscarded-qualifiers]
.millivolts = core_millivolts, \
^
/home/user/build/src/grimlock_kernel_asus_tegra3_unified-52800b9d40bde53830b73c34f59d16fd36d2d915/arch/arm/mach-tegra/tegra3_dvfs.c:286:2: note: in expansion of macro 'CORE_DVFS'
CORE_DVFS("epp", 2, 1, KHZ, 200000, 267000, 304000, 361000, 408000, 446000, 484000, 520000, 650000),
^~~~~~~~~
/home/user/build/src/grimlock_kernel_asus_tegra3_unified-52800b9d40bde53830b73c34f59d16fd36d2d915/arch/arm/mach-tegra/tegra3_dvfs.c:239:17: warning: initialization discards 'const' qualifier from pointer target type [-Wdiscarded-qualifiers]
.millivolts = core_millivolts, \
^
/home/user/build/src/grimlock_kernel_asus_tegra3_unified-52800b9d40bde53830b73c34f59d16fd36d2d915/arch/arm/mach-tegra/tegra3_dvfs.c:287:2: note: in expansion of macro 'CORE_DVFS'
CORE_DVFS("3d", 2, 1, KHZ, 200000, 247000, 304000, 361000, 408000, 446000, 484000, 520000, 650000),
^~~~~~~~~
/home/user/build/src/grimlock_kernel_asus_tegra3_unified-52800b9d40bde53830b73c34f59d16fd36d2d915/arch/arm/mach-tegra/tegra3_dvfs.c:239:17: warning: initialization discards 'const' qualifier from pointer target type [-Wdiscarded-qualifiers]
.millivolts = core_millivolts, \
^
/home/user/build/src/grimlock_kernel_asus_tegra3_unified-52800b9d40bde53830b73c34f59d16fd36d2d915/arch/arm/mach-tegra/tegra3_dvfs.c:288:2: note: in expansion of macro 'CORE_DVFS'
CORE_DVFS("3d2", 2, 1, KHZ, 200000, 247000, 304000, 361000, 408000, 446000, 484000, 520000, 650000),
^~~~~~~~~
/home/user/build/src/grimlock_kernel_asus_tegra3_unified-52800b9d40bde53830b73c34f59d16fd36d2d915/arch/arm/mach-tegra/tegra3_dvfs.c:239:17: warning: initialization discards 'const' qualifier from pointer target type [-Wdiscarded-qualifiers]
.millivolts = core_millivolts, \
^
/home/user/build/src/grimlock_kernel_asus_tegra3_unified-52800b9d40bde53830b73c34f59d16fd36d2d915/arch/arm/mach-tegra/tegra3_dvfs.c:289:2: note: in expansion of macro 'CORE_DVFS'
CORE_DVFS("se", 2, 1, KHZ, 200000, 267000, 304000, 361000, 408000, 446000, 484000, 520000, 650000),
^~~~~~~~~
/home/user/build/src/grimlock_kernel_asus_tegra3_unified-52800b9d40bde53830b73c34f59d16fd36d2d915/arch/arm/mach-tegra/tegra3_dvfs.c:239:17: warning: initialization discards 'const' qualifier from pointer target type [-Wdiscarded-qualifiers]
.millivolts = core_millivolts, \
^
/home/user/build/src/grimlock_kernel_asus_tegra3_unified-52800b9d40bde53830b73c34f59d16fd36d2d915/arch/arm/mach-tegra/tegra3_dvfs.c:291:2: note: in expansion of macro 'CORE_DVFS'
CORE_DVFS("vde", 3, 1, KHZ, 1, 1, 1, 1, 1, 1, 484000, 484000, 484000),
^~~~~~~~~
/home/user/build/src/grimlock_kernel_asus_tegra3_unified-52800b9d40bde53830b73c34f59d16fd36d2d915/arch/arm/mach-tegra/tegra3_dvfs.c:239:17: warning: initialization discards 'const' qualifier from pointer target type [-Wdiscarded-qualifiers]
.millivolts = core_millivolts, \
^
/home/user/build/src/grimlock_kernel_asus_tegra3_unified-52800b9d40bde53830b73c34f59d16fd36d2d915/arch/arm/mach-tegra/tegra3_dvfs.c:292:2: note: in expansion of macro 'CORE_DVFS'
CORE_DVFS("mpe", 3, 1, KHZ, 1, 1, 1, 1, 1, 1, 484000, 484000, 484000),
^~~~~~~~~
/home/user/build/src/grimlock_kernel_asus_tegra3_unified-52800b9d40bde53830b73c34f59d16fd36d2d915/arch/arm/mach-tegra/tegra3_dvfs.c:239:17: warning: initialization discards 'const' qualifier from pointer target type [-Wdiscarded-qualifiers]
.millivolts = core_millivolts, \
^
/home/user/build/src/grimlock_kernel_asus_tegra3_unified-52800b9d40bde53830b73c34f59d16fd36d2d915/arch/arm/mach-tegra/tegra3_dvfs.c:293:2: note: in expansion of macro 'CORE_DVFS'
CORE_DVFS("2d", 3, 1, KHZ, 1, 1, 1, 1, 1, 1, 484000, 484000, 484000),
^~~~~~~~~
/home/user/build/src/grimlock_kernel_asus_tegra3_unified-52800b9d40bde53830b73c34f59d16fd36d2d915/arch/arm/mach-tegra/tegra3_dvfs.c:239:17: warning: initialization discards 'const' qualifier from pointer target type [-Wdiscarded-qualifiers]
.millivolts = core_millivolts, \
^
/home/user/build/src/grimlock_kernel_asus_tegra3_unified-52800b9d40bde53830b73c34f59d16fd36d2d915/arch/arm/mach-tegra/tegra3_dvfs.c:294:2: note: in expansion of macro 'CORE_DVFS'
CORE_DVFS("epp", 3, 1, KHZ, 1, 1, 1, 1, 1, 1, 484000, 484000, 484000),
^~~~~~~~~
/home/user/build/src/grimlock_kernel_asus_tegra3_unified-52800b9d40bde53830b73c34f59d16fd36d2d915/arch/arm/mach-tegra/tegra3_dvfs.c:239:17: warning: initialization discards 'const' qualifier from pointer target type [-Wdiscarded-qualifiers]
.millivolts = core_millivolts, \
^
/home/user/build/src/grimlock_kernel_asus_tegra3_unified-52800b9d40bde53830b73c34f59d16fd36d2d915/arch/arm/mach-tegra/tegra3_dvfs.c:295:2: note: in expansion of macro 'CORE_DVFS'
CORE_DVFS("3d", 3, 1, KHZ, 1, 1, 1, 1, 1, 1, 484000, 484000, 484000),
^~~~~~~~~
/home/user/build/src/grimlock_kernel_asus_tegra3_unified-52800b9d40bde53830b73c34f59d16fd36d2d915/arch/arm/mach-tegra/tegra3_dvfs.c:239:17: warning: initialization discards 'const' qualifier from pointer target type [-Wdiscarded-qualifiers]
.millivolts = core_millivolts, \
^
/home/user/build/src/grimlock_kernel_asus_tegra3_unified-52800b9d40bde53830b73c34f59d16fd36d2d915/arch/arm/mach-tegra/tegra3_dvfs.c:296:2: note: in expansion of macro 'CORE_DVFS'
CORE_DVFS("3d2", 3, 1, KHZ, 1, 1, 1, 1, 1, 1, 484000, 484000, 484000),
^~~~~~~~~
/home/user/build/src/grimlock_kernel_asus_tegra3_unified-52800b9d40bde53830b73c34f59d16fd36d2d915/arch/arm/mach-tegra/tegra3_dvfs.c:239:17: warning: initialization discards 'const' qualifier from pointer target type [-Wdiscarded-qualifiers]
.millivolts = core_millivolts, \
^
/home/user/build/src/grimlock_kernel_asus_tegra3_unified-52800b9d40bde53830b73c34f59d16fd36d2d915/arch/arm/mach-tegra/tegra3_dvfs.c:297:2: note: in expansion of macro 'CORE_DVFS'
CORE_DVFS("se", 3, 1, KHZ, 1, 1, 1, 1, 1, 1, 625000, 625000, 625000),
^~~~~~~~~
/home/user/build/src/grimlock_kernel_asus_tegra3_unified-52800b9d40bde53830b73c34f59d16fd36d2d915/arch/arm/mach-tegra/tegra3_dvfs.c:239:17: warning: initialization discards 'const' qualifier from pointer target type [-Wdiscarded-qualifiers]
.millivolts = core_millivolts, \
^
/home/user/build/src/grimlock_kernel_asus_tegra3_unified-52800b9d40bde53830b73c34f59d16fd36d2d915/arch/arm/mach-tegra/tegra3_dvfs.c:299:2: note: in expansion of macro 'CORE_DVFS'
CORE_DVFS("host1x", 0, 1, KHZ, 100000, 152000, 188000, 222000, 254000, 267000, 267000, 267000, 350000),
^~~~~~~~~
/home/user/build/src/grimlock_kernel_asus_tegra3_unified-52800b9d40bde53830b73c34f59d16fd36d2d915/arch/arm/mach-tegra/tegra3_dvfs.c:239:17: warning: initialization discards 'const' qualifier from pointer target type [-Wdiscarded-qualifiers]
.millivolts = core_millivolts, \
^
/home/user/build/src/grimlock_kernel_asus_tegra3_unified-52800b9d40bde53830b73c34f59d16fd36d2d915/arch/arm/mach-tegra/tegra3_dvfs.c:300:2: note: in expansion of macro 'CORE_DVFS'
CORE_DVFS("host1x", 1, 1, KHZ, 100000, 152000, 188000, 222000, 254000, 267000, 267000, 267000, 350000),
^~~~~~~~~
/home/user/build/src/grimlock_kernel_asus_tegra3_unified-52800b9d40bde53830b73c34f59d16fd36d2d915/arch/arm/mach-tegra/tegra3_dvfs.c:239:17: warning: initialization discards 'const' qualifier from pointer target type [-Wdiscarded-qualifiers]
.millivolts = core_millivolts, \
^
/home/user/build/src/grimlock_kernel_asus_tegra3_unified-52800b9d40bde53830b73c34f59d16fd36d2d915/arch/arm/mach-tegra/tegra3_dvfs.c:301:2: note: in expansion of macro 'CORE_DVFS'
CORE_DVFS("host1x", 2, 1, KHZ, 100000, 152000, 188000, 222000, 254000, 267000, 267000, 267000, 350000),
^~~~~~~~~
/home/user/build/src/grimlock_kernel_asus_tegra3_unified-52800b9d40bde53830b73c34f59d16fd36d2d915/arch/arm/mach-tegra/tegra3_dvfs.c:239:17: warning: initialization discards 'const' qualifier from pointer target type [-Wdiscarded-qualifiers]
.millivolts = core_millivolts, \
^
/home/user/build/src/grimlock_kernel_asus_tegra3_unified-52800b9d40bde53830b73c34f59d16fd36d2d915/arch/arm/mach-tegra/tegra3_dvfs.c:302:2: note: in expansion of macro 'CORE_DVFS'
CORE_DVFS("host1x", 3, 1, KHZ, 1, 1, 1, 1, 1, 1, 242000, 242000, 242000),
^~~~~~~~~
/home/user/build/src/grimlock_kernel_asus_tegra3_unified-52800b9d40bde53830b73c34f59d16fd36d2d915/arch/arm/mach-tegra/tegra3_dvfs.c:239:17: warning: initialization discards 'const' qualifier from pointer target type [-Wdiscarded-qualifiers]
.millivolts = core_millivolts, \
^
/home/user/build/src/grimlock_kernel_asus_tegra3_unified-52800b9d40bde53830b73c34f59d16fd36d2d915/arch/arm/mach-tegra/tegra3_dvfs.c:304:2: note: in expansion of macro 'CORE_DVFS'
CORE_DVFS("cbus", 0, 1, KHZ, 200000, 247000, 304000, 352000, 400000, 437000, 484000, 520000, 650000),
^~~~~~~~~
/home/user/build/src/grimlock_kernel_asus_tegra3_unified-52800b9d40bde53830b73c34f59d16fd36d2d915/arch/arm/mach-tegra/tegra3_dvfs.c:239:17: warning: initialization discards 'const' qualifier from pointer target type [-Wdiscarded-qualifiers]
.millivolts = core_millivolts, \
^
/home/user/build/src/grimlock_kernel_asus_tegra3_unified-52800b9d40bde53830b73c34f59d16fd36d2d915/arch/arm/mach-tegra/tegra3_dvfs.c:305:2: note: in expansion of macro 'CORE_DVFS'
CORE_DVFS("cbus", 1, 1, KHZ, 200000, 247000, 304000, 352000, 400000, 437000, 484000, 520000, 650000),
^~~~~~~~~
/home/user/build/src/grimlock_kernel_asus_tegra3_unified-52800b9d40bde53830b73c34f59d16fd36d2d915/arch/arm/mach-tegra/tegra3_dvfs.c:239:17: warning: initialization discards 'const' qualifier from pointer target type [-Wdiscarded-qualifiers]
.millivolts = core_millivolts, \
^
/home/user/build/src/grimlock_kernel_asus_tegra3_unified-52800b9d40bde53830b73c34f59d16fd36d2d915/arch/arm/mach-tegra/tegra3_dvfs.c:306:2: note: in expansion of macro 'CORE_DVFS'
CORE_DVFS("cbus", 2, 1, KHZ, 200000, 247000, 304000, 352000, 400000, 437000, 484000, 520000, 650000),
^~~~~~~~~
/home/user/build/src/grimlock_kernel_asus_tegra3_unified-52800b9d40bde53830b73c34f59d16fd36d2d915/arch/arm/mach-tegra/tegra3_dvfs.c:239:17: warning: initialization discards 'const' qualifier from pointer target type [-Wdiscarded-qualifiers]
.millivolts = core_millivolts, \
^
/home/user/build/src/grimlock_kernel_asus_tegra3_unified-52800b9d40bde53830b73c34f59d16fd36d2d915/arch/arm/mach-tegra/tegra3_dvfs.c:307:2: note: in expansion of macro 'CORE_DVFS'
CORE_DVFS("cbus", 3, 1, KHZ, 1, 1, 1, 1, 1, 1, 484000, 484000, 484000),
^~~~~~~~~
/home/user/build/src/grimlock_kernel_asus_tegra3_unified-52800b9d40bde53830b73c34f59d16fd36d2d915/arch/arm/mach-tegra/tegra3_dvfs.c:239:17: warning: initialization discards 'const' qualifier from pointer target type [-Wdiscarded-qualifiers]
.millivolts = core_millivolts, \
^
/home/user/build/src/grimlock_kernel_asus_tegra3_unified-52800b9d40bde53830b73c34f59d16fd36d2d915/arch/arm/mach-tegra/tegra3_dvfs.c:309:2: note: in expansion of macro 'CORE_DVFS'
CORE_DVFS("pll_c", -1, 1, KHZ, 533000, 667000, 667000, 800000, 800000, 1066000, 1066000, 1066000, 1300000),
^~~~~~~~~
/home/user/build/src/grimlock_kernel_asus_tegra3_unified-52800b9d40bde53830b73c34f59d16fd36d2d915/arch/arm/mach-tegra/tegra3_dvfs.c:239:17: warning: initialization discards 'const' qualifier from pointer target type [-Wdiscarded-qualifiers]
.millivolts = core_millivolts, \
^
/home/user/build/src/grimlock_kernel_asus_tegra3_unified-52800b9d40bde53830b73c34f59d16fd36d2d915/arch/arm/mach-tegra/tegra3_dvfs.c:317:2: note: in expansion of macro 'CORE_DVFS'
CORE_DVFS("pll_m", -1, 1, KHZ, 533000, 667000, 667000, 800000, 800000, 1066000, 1066000, 1066000, 1066000),
^~~~~~~~~
/home/user/build/src/grimlock_kernel_asus_tegra3_unified-52800b9d40bde53830b73c34f59d16fd36d2d915/arch/arm/mach-tegra/tegra3_dvfs.c:239:17: warning: initialization discards 'const' qualifier from pointer target type [-Wdiscarded-qualifiers]
.millivolts = core_millivolts, \
^
/home/user/build/src/grimlock_kernel_asus_tegra3_unified-52800b9d40bde53830b73c34f59d16fd36d2d915/arch/arm/mach-tegra/tegra3_dvfs.c:319:2: note: in expansion of macro 'CORE_DVFS'
CORE_DVFS("pll_m", 2, 1, KHZ, 533000, 900000, 900000, 900000, 900000, 1066000, 1066000, 1066000, 1066000),
^~~~~~~~~
/home/user/build/src/grimlock_kernel_asus_tegra3_unified-52800b9d40bde53830b73c34f59d16fd36d2d915/arch/arm/mach-tegra/tegra3_dvfs.c:239:17: warning: initialization discards 'const' qualifier from pointer target type [-Wdiscarded-qualifiers]
.millivolts = core_millivolts, \
^
/home/user/build/src/grimlock_kernel_asus_tegra3_unified-52800b9d40bde53830b73c34f59d16fd36d2d915/arch/arm/mach-tegra/tegra3_dvfs.c:323:2: note: in expansion of macro 'CORE_DVFS'
CORE_DVFS("mipi", 0, 1, KHZ, 1, 1, 1, 1, 1, 1, 1, 1, 1),
^~~~~~~~~
/home/user/build/src/grimlock_kernel_asus_tegra3_unified-52800b9d40bde53830b73c34f59d16fd36d2d915/arch/arm/mach-tegra/tegra3_dvfs.c:239:17: warning: initialization discards 'const' qualifier from pointer target type [-Wdiscarded-qualifiers]
.millivolts = core_millivolts, \
^
/home/user/build/src/grimlock_kernel_asus_tegra3_unified-52800b9d40bde53830b73c34f59d16fd36d2d915/arch/arm/mach-tegra/tegra3_dvfs.c:324:2: note: in expansion of macro 'CORE_DVFS'
CORE_DVFS("mipi", 1, 1, KHZ, 1, 1, 1, 1, 1, 60000, 60000, 60000, 60000),
^~~~~~~~~
/home/user/build/src/grimlock_kernel_asus_tegra3_unified-52800b9d40bde53830b73c34f59d16fd36d2d915/arch/arm/mach-tegra/tegra3_dvfs.c:239:17: warning: initialization discards 'const' qualifier from pointer target type [-Wdiscarded-qualifiers]
.millivolts = core_millivolts, \
^
/home/user/build/src/grimlock_kernel_asus_tegra3_unified-52800b9d40bde53830b73c34f59d16fd36d2d915/arch/arm/mach-tegra/tegra3_dvfs.c:325:2: note: in expansion of macro 'CORE_DVFS'
CORE_DVFS("mipi", 2, 1, KHZ, 1, 1, 1, 1, 1, 60000, 60000, 60000, 60000),
^~~~~~~~~
/home/user/build/src/grimlock_kernel_asus_tegra3_unified-52800b9d40bde53830b73c34f59d16fd36d2d915/arch/arm/mach-tegra/tegra3_dvfs.c:239:17: warning: initialization discards 'const' qualifier from pointer target type [-Wdiscarded-qualifiers]
.millivolts = core_millivolts, \
^
/home/user/build/src/grimlock_kernel_asus_tegra3_unified-52800b9d40bde53830b73c34f59d16fd36d2d915/arch/arm/mach-tegra/tegra3_dvfs.c:326:2: note: in expansion of macro 'CORE_DVFS'
CORE_DVFS("mipi", 3, 1, KHZ, 1, 1, 1, 1, 1, 1, 1, 1, 1),
^~~~~~~~~
/home/user/build/src/grimlock_kernel_asus_tegra3_unified-52800b9d40bde53830b73c34f59d16fd36d2d915/arch/arm/mach-tegra/tegra3_dvfs.c:239:17: warning: initialization discards 'const' qualifier from pointer target type [-Wdiscarded-qualifiers]
.millivolts = core_millivolts, \
^
/home/user/build/src/grimlock_kernel_asus_tegra3_unified-52800b9d40bde53830b73c34f59d16fd36d2d915/arch/arm/mach-tegra/tegra3_dvfs.c:328:2: note: in expansion of macro 'CORE_DVFS'
CORE_DVFS("fuse_burn", -1, 1, KHZ, 1, 1, 1, 1, 26000, 26000, 26000, 26000, 26000),
^~~~~~~~~
/home/user/build/src/grimlock_kernel_asus_tegra3_unified-52800b9d40bde53830b73c34f59d16fd36d2d915/arch/arm/mach-tegra/tegra3_dvfs.c:239:17: warning: initialization discards 'const' qualifier from pointer target type [-Wdiscarded-qualifiers]
.millivolts = core_millivolts, \
^
/home/user/build/src/grimlock_kernel_asus_tegra3_unified-52800b9d40bde53830b73c34f59d16fd36d2d915/arch/arm/mach-tegra/tegra3_dvfs.c:329:2: note: in expansion of macro 'CORE_DVFS'
CORE_DVFS("sdmmc1", -1, 1, KHZ, 104000, 104000, 104000, 104000, 104000, 208000, 208000, 208000, 208000),
^~~~~~~~~
/home/user/build/src/grimlock_kernel_asus_tegra3_unified-52800b9d40bde53830b73c34f59d16fd36d2d915/arch/arm/mach-tegra/tegra3_dvfs.c:239:17: warning: initialization discards 'const' qualifier from pointer target type [-Wdiscarded-qualifiers]
.millivolts = core_millivolts, \
^
/home/user/build/src/grimlock_kernel_asus_tegra3_unified-52800b9d40bde53830b73c34f59d16fd36d2d915/arch/arm/mach-tegra/tegra3_dvfs.c:330:2: note: in expansion of macro 'CORE_DVFS'
CORE_DVFS("sdmmc3", -1, 1, KHZ, 104000, 104000, 104000, 104000, 104000, 208000, 208000, 208000, 208000),
^~~~~~~~~
/home/user/build/src/grimlock_kernel_asus_tegra3_unified-52800b9d40bde53830b73c34f59d16fd36d2d915/arch/arm/mach-tegra/tegra3_dvfs.c:239:17: warning: initialization discards 'const' qualifier from pointer target type [-Wdiscarded-qualifiers]
.millivolts = core_millivolts, \
^
/home/user/build/src/grimlock_kernel_asus_tegra3_unified-52800b9d40bde53830b73c34f59d16fd36d2d915/arch/arm/mach-tegra/tegra3_dvfs.c:331:2: note: in expansion of macro 'CORE_DVFS'
CORE_DVFS("sdmmc4", -1, 1, KHZ, 51000, 102000, 102000, 102000, 102000, 102000, 102000, 102000, 102000),
^~~~~~~~~
/home/user/build/src/grimlock_kernel_asus_tegra3_unified-52800b9d40bde53830b73c34f59d16fd36d2d915/arch/arm/mach-tegra/tegra3_dvfs.c:239:17: warning: initialization discards 'const' qualifier from pointer target type [-Wdiscarded-qualifiers]
.millivolts = core_millivolts, \
^
/home/user/build/src/grimlock_kernel_asus_tegra3_unified-52800b9d40bde53830b73c34f59d16fd36d2d915/arch/arm/mach-tegra/tegra3_dvfs.c:332:2: note: in expansion of macro 'CORE_DVFS'
CORE_DVFS("ndflash", -1, 1, KHZ, 120000, 120000, 120000, 120000, 200000, 200000, 200000, 200000, 200000),
^~~~~~~~~
/home/user/build/src/grimlock_kernel_asus_tegra3_unified-52800b9d40bde53830b73c34f59d16fd36d2d915/arch/arm/mach-tegra/tegra3_dvfs.c:239:17: warning: initialization discards 'const' qualifier from pointer target type [-Wdiscarded-qualifiers]
.millivolts = core_millivolts, \
^
/home/user/build/src/grimlock_kernel_asus_tegra3_unified-52800b9d40bde53830b73c34f59d16fd36d2d915/arch/arm/mach-tegra/tegra3_dvfs.c:334:2: note: in expansion of macro 'CORE_DVFS'
CORE_DVFS("nor", 0, 1, KHZ, 1, 115000, 130000, 130000, 133000, 133000, 133000, 133000, 133000),
^~~~~~~~~
/home/user/build/src/grimlock_kernel_asus_tegra3_unified-52800b9d40bde53830b73c34f59d16fd36d2d915/arch/arm/mach-tegra/tegra3_dvfs.c:239:17: warning: initialization discards 'const' qualifier from pointer target type [-Wdiscarded-qualifiers]
.millivolts = core_millivolts, \
^
/home/user/build/src/grimlock_kernel_asus_tegra3_unified-52800b9d40bde53830b73c34f59d16fd36d2d915/arch/arm/mach-tegra/tegra3_dvfs.c:335:2: note: in expansion of macro 'CORE_DVFS'
CORE_DVFS("nor", 1, 1, KHZ, 102000, 115000, 130000, 130000, 133000, 133000, 133000, 133000, 133000),
^~~~~~~~~
/home/user/build/src/grimlock_kernel_asus_tegra3_unified-52800b9d40bde53830b73c34f59d16fd36d2d915/arch/arm/mach-tegra/tegra3_dvfs.c:239:17: warning: initialization discards 'const' qualifier from pointer target type [-Wdiscarded-qualifiers]
.millivolts = core_millivolts, \
^
/home/user/build/src/grimlock_kernel_asus_tegra3_unified-52800b9d40bde53830b73c34f59d16fd36d2d915/arch/arm/mach-tegra/tegra3_dvfs.c:336:2: note: in expansion of macro 'CORE_DVFS'
CORE_DVFS("nor", 2, 1, KHZ, 102000, 115000, 130000, 130000, 133000, 133000, 133000, 133000, 133000),
^~~~~~~~~
/home/user/build/src/grimlock_kernel_asus_tegra3_unified-52800b9d40bde53830b73c34f59d16fd36d2d915/arch/arm/mach-tegra/tegra3_dvfs.c:239:17: warning: initialization discards 'const' qualifier from pointer target type [-Wdiscarded-qualifiers]
.millivolts = core_millivolts, \
^
/home/user/build/src/grimlock_kernel_asus_tegra3_unified-52800b9d40bde53830b73c34f59d16fd36d2d915/arch/arm/mach-tegra/tegra3_dvfs.c:337:2: note: in expansion of macro 'CORE_DVFS'
CORE_DVFS("nor", 3, 1, KHZ, 1, 1, 1, 1, 1, 1, 108000, 108000, 108000),
^~~~~~~~~
/home/user/build/src/grimlock_kernel_asus_tegra3_unified-52800b9d40bde53830b73c34f59d16fd36d2d915/arch/arm/mach-tegra/tegra3_dvfs.c:239:17: warning: initialization discards 'const' qualifier from pointer target type [-Wdiscarded-qualifiers]
.millivolts = core_millivolts, \
^
/home/user/build/src/grimlock_kernel_asus_tegra3_unified-52800b9d40bde53830b73c34f59d16fd36d2d915/arch/arm/mach-tegra/tegra3_dvfs.c:339:2: note: in expansion of macro 'CORE_DVFS'
CORE_DVFS("sbc1", -1, 1, KHZ, 36000, 52000, 60000, 60000, 60000, 100000, 100000, 100000, 100000),
^~~~~~~~~
/home/user/build/src/grimlock_kernel_asus_tegra3_unified-52800b9d40bde53830b73c34f59d16fd36d2d915/arch/arm/mach-tegra/tegra3_dvfs.c:239:17: warning: initialization discards 'const' qualifier from pointer target type [-Wdiscarded-qualifiers]
.millivolts = core_millivolts, \
^
/home/user/build/src/grimlock_kernel_asus_tegra3_unified-52800b9d40bde53830b73c34f59d16fd36d2d915/arch/arm/mach-tegra/tegra3_dvfs.c:340:2: note: in expansion of macro 'CORE_DVFS'
CORE_DVFS("sbc2", -1, 1, KHZ, 36000, 52000, 60000, 60000, 60000, 100000, 100000, 100000, 100000),
^~~~~~~~~
/home/user/build/src/grimlock_kernel_asus_tegra3_unified-52800b9d40bde53830b73c34f59d16fd36d2d915/arch/arm/mach-tegra/tegra3_dvfs.c:239:17: warning: initialization discards 'const' qualifier from pointer target type [-Wdiscarded-qualifiers]
.millivolts = core_millivolts, \
^
/home/user/build/src/grimlock_kernel_asus_tegra3_unified-52800b9d40bde53830b73c34f59d16fd36d2d915/arch/arm/mach-tegra/tegra3_dvfs.c:341:2: note: in expansion of macro 'CORE_DVFS'
CORE_DVFS("sbc3", -1, 1, KHZ, 36000, 52000, 60000, 60000, 60000, 100000, 100000, 100000, 100000),
^~~~~~~~~
/home/user/build/src/grimlock_kernel_asus_tegra3_unified-52800b9d40bde53830b73c34f59d16fd36d2d915/arch/arm/mach-tegra/tegra3_dvfs.c:239:17: warning: initialization discards 'const' qualifier from pointer target type [-Wdiscarded-qualifiers]
.millivolts = core_millivolts, \
^
/home/user/build/src/grimlock_kernel_asus_tegra3_unified-52800b9d40bde53830b73c34f59d16fd36d2d915/arch/arm/mach-tegra/tegra3_dvfs.c:342:2: note: in expansion of macro 'CORE_DVFS'
CORE_DVFS("sbc4", -1, 1, KHZ, 36000, 52000, 60000, 60000, 60000, 100000, 100000, 100000, 100000),
^~~~~~~~~
/home/user/build/src/grimlock_kernel_asus_tegra3_unified-52800b9d40bde53830b73c34f59d16fd36d2d915/arch/arm/mach-tegra/tegra3_dvfs.c:239:17: warning: initialization discards 'const' qualifier from pointer target type [-Wdiscarded-qualifiers]
.millivolts = core_millivolts, \
^
/home/user/build/src/grimlock_kernel_asus_tegra3_unified-52800b9d40bde53830b73c34f59d16fd36d2d915/arch/arm/mach-tegra/tegra3_dvfs.c:343:2: note: in expansion of macro 'CORE_DVFS'
CORE_DVFS("sbc5", -1, 1, KHZ, 36000, 52000, 60000, 60000, 60000, 100000, 100000, 100000, 100000),
^~~~~~~~~
/home/user/build/src/grimlock_kernel_asus_tegra3_unified-52800b9d40bde53830b73c34f59d16fd36d2d915/arch/arm/mach-tegra/tegra3_dvfs.c:239:17: warning: initialization discards 'const' qualifier from pointer target type [-Wdiscarded-qualifiers]
.millivolts = core_millivolts, \
^
/home/user/build/src/grimlock_kernel_asus_tegra3_unified-52800b9d40bde53830b73c34f59d16fd36d2d915/arch/arm/mach-tegra/tegra3_dvfs.c:344:2: note: in expansion of macro 'CORE_DVFS'
CORE_DVFS("sbc6", -1, 1, KHZ, 36000, 52000, 60000, 60000, 60000, 100000, 100000, 100000, 100000),
^~~~~~~~~
/home/user/build/src/grimlock_kernel_asus_tegra3_unified-52800b9d40bde53830b73c34f59d16fd36d2d915/arch/arm/mach-tegra/tegra3_dvfs.c:239:17: warning: initialization discards 'const' qualifier from pointer target type [-Wdiscarded-qualifiers]
.millivolts = core_millivolts, \
^
/home/user/build/src/grimlock_kernel_asus_tegra3_unified-52800b9d40bde53830b73c34f59d16fd36d2d915/arch/arm/mach-tegra/tegra3_dvfs.c:346:2: note: in expansion of macro 'CORE_DVFS'
CORE_DVFS("sata", -1, 1, KHZ, 1, 216000, 216000, 216000, 216000, 216000, 216000, 216000, 216000),
^~~~~~~~~
/home/user/build/src/grimlock_kernel_asus_tegra3_unified-52800b9d40bde53830b73c34f59d16fd36d2d915/arch/arm/mach-tegra/tegra3_dvfs.c:239:17: warning: initialization discards 'const' qualifier from pointer target type [-Wdiscarded-qualifiers]
.millivolts = core_millivolts, \
^
/home/user/build/src/grimlock_kernel_asus_tegra3_unified-52800b9d40bde53830b73c34f59d16fd36d2d915/arch/arm/mach-tegra/tegra3_dvfs.c:347:2: note: in expansion of macro 'CORE_DVFS'
CORE_DVFS("sata_oob", -1, 1, KHZ, 1, 216000, 216000, 216000, 216000, 216000, 216000, 216000, 216000),
^~~~~~~~~
/home/user/build/src/grimlock_kernel_asus_tegra3_unified-52800b9d40bde53830b73c34f59d16fd36d2d915/arch/arm/mach-tegra/tegra3_dvfs.c:239:17: warning: initialization discards 'const' qualifier from pointer target type [-Wdiscarded-qualifiers]
.millivolts = core_millivolts, \
^
/home/user/build/src/grimlock_kernel_asus_tegra3_unified-52800b9d40bde53830b73c34f59d16fd36d2d915/arch/arm/mach-tegra/tegra3_dvfs.c:349:2: note: in expansion of macro 'CORE_DVFS'
CORE_DVFS("tvo", -1, 1, KHZ, 1, 1, 297000, 297000, 297000, 297000, 297000, 297000, 297000),
^~~~~~~~~
/home/user/build/src/grimlock_kernel_asus_tegra3_unified-52800b9d40bde53830b73c34f59d16fd36d2d915/arch/arm/mach-tegra/tegra3_dvfs.c:239:17: warning: initialization discards 'const' qualifier from pointer target type [-Wdiscarded-qualifiers]
.millivolts = core_millivolts, \
^
/home/user/build/src/grimlock_kernel_asus_tegra3_unified-52800b9d40bde53830b73c34f59d16fd36d2d915/arch/arm/mach-tegra/tegra3_dvfs.c:350:2: note: in expansion of macro 'CORE_DVFS'
CORE_DVFS("cve", -1, 1, KHZ, 1, 1, 297000, 297000, 297000, 297000, 297000, 297000, 297000),
^~~~~~~~~
/home/user/build/src/grimlock_kernel_asus_tegra3_unified-52800b9d40bde53830b73c34f59d16fd36d2d915/arch/arm/mach-tegra/tegra3_dvfs.c:239:17: warning: initialization discards 'const' qualifier from pointer target type [-Wdiscarded-qualifiers]
.millivolts = core_millivolts, \
^
/home/user/build/src/grimlock_kernel_asus_tegra3_unified-52800b9d40bde53830b73c34f59d16fd36d2d915/arch/arm/mach-tegra/tegra3_dvfs.c:351:2: note: in expansion of macro 'CORE_DVFS'
CORE_DVFS("dsia", -1, 1, KHZ, 432500, 432500, 432500, 432500, 432500, 432500, 432500, 432500, 432500),
^~~~~~~~~
/home/user/build/src/grimlock_kernel_asus_tegra3_unified-52800b9d40bde53830b73c34f59d16fd36d2d915/arch/arm/mach-tegra/tegra3_dvfs.c:239:17: warning: initialization discards 'const' qualifier from pointer target type [-Wdiscarded-qualifiers]
.millivolts = core_millivolts, \
^
/home/user/build/src/grimlock_kernel_asus_tegra3_unified-52800b9d40bde53830b73c34f59d16fd36d2d915/arch/arm/mach-tegra/tegra3_dvfs.c:352:2: note: in expansion of macro 'CORE_DVFS'
CORE_DVFS("dsib", -1, 1, KHZ, 432500, 432500, 432500, 432500, 432500, 432500, 432500, 432500, 432500),
^~~~~~~~~
/home/user/build/src/grimlock_kernel_asus_tegra3_unified-52800b9d40bde53830b73c34f59d16fd36d2d915/arch/arm/mach-tegra/tegra3_dvfs.c:239:17: warning: initialization discards 'const' qualifier from pointer target type [-Wdiscarded-qualifiers]
.millivolts = core_millivolts, \
^
/home/user/build/src/grimlock_kernel_asus_tegra3_unified-52800b9d40bde53830b73c34f59d16fd36d2d915/arch/arm/mach-tegra/tegra3_dvfs.c:360:2: note: in expansion of macro 'CORE_DVFS'
CORE_DVFS("disp1", 0, 0, KHZ, 1, 120000, 120000, 120000, 120000, 190000, 190000, 190000, 190000),
^~~~~~~~~
/home/user/build/src/grimlock_kernel_asus_tegra3_unified-52800b9d40bde53830b73c34f59d16fd36d2d915/arch/arm/mach-tegra/tegra3_dvfs.c:239:17: warning: initialization discards 'const' qualifier from pointer target type [-Wdiscarded-qualifiers]
.millivolts = core_millivolts, \
^
/home/user/build/src/grimlock_kernel_asus_tegra3_unified-52800b9d40bde53830b73c34f59d16fd36d2d915/arch/arm/mach-tegra/tegra3_dvfs.c:361:2: note: in expansion of macro 'CORE_DVFS'
CORE_DVFS("disp1", 1, 0, KHZ, 155000, 155000, 268000, 268000, 268000, 268000, 268000, 268000, 268000),
^~~~~~~~~
/home/user/build/src/grimlock_kernel_asus_tegra3_unified-52800b9d40bde53830b73c34f59d16fd36d2d915/arch/arm/mach-tegra/tegra3_dvfs.c:239:17: warning: initialization discards 'const' qualifier from pointer target type [-Wdiscarded-qualifiers]
.millivolts = core_millivolts, \
^
/home/user/build/src/grimlock_kernel_asus_tegra3_unified-52800b9d40bde53830b73c34f59d16fd36d2d915/arch/arm/mach-tegra/tegra3_dvfs.c:362:2: note: in expansion of macro 'CORE_DVFS'
CORE_DVFS("disp1", 2, 0, KHZ, 155000, 155000, 268000, 268000, 268000, 268000, 268000, 268000, 268000),
^~~~~~~~~
/home/user/build/src/grimlock_kernel_asus_tegra3_unified-52800b9d40bde53830b73c34f59d16fd36d2d915/arch/arm/mach-tegra/tegra3_dvfs.c:239:17: warning: initialization discards 'const' qualifier from pointer target type [-Wdiscarded-qualifiers]
.millivolts = core_millivolts, \
^
/home/user/build/src/grimlock_kernel_asus_tegra3_unified-52800b9d40bde53830b73c34f59d16fd36d2d915/arch/arm/mach-tegra/tegra3_dvfs.c:363:2: note: in expansion of macro 'CORE_DVFS'
CORE_DVFS("disp1", 3, 0, KHZ, 1, 120000, 120000, 120000, 120000, 190000, 190000, 190000, 190000),
^~~~~~~~~
/home/user/build/src/grimlock_kernel_asus_tegra3_unified-52800b9d40bde53830b73c34f59d16fd36d2d915/arch/arm/mach-tegra/tegra3_dvfs.c:239:17: warning: initialization discards 'const' qualifier from pointer target type [-Wdiscarded-qualifiers]
.millivolts = core_millivolts, \
^
/home/user/build/src/grimlock_kernel_asus_tegra3_unified-52800b9d40bde53830b73c34f59d16fd36d2d915/arch/arm/mach-tegra/tegra3_dvfs.c:365:2: note: in expansion of macro 'CORE_DVFS'
CORE_DVFS("disp2", 0, 0, KHZ, 1, 120000, 120000, 120000, 120000, 190000, 190000, 190000, 190000),
^~~~~~~~~
/home/user/build/src/grimlock_kernel_asus_tegra3_unified-52800b9d40bde53830b73c34f59d16fd36d2d915/arch/arm/mach-tegra/tegra3_dvfs.c:239:17: warning: initialization discards 'const' qualifier from pointer target type [-Wdiscarded-qualifiers]
.millivolts = core_millivolts, \
^
/home/user/build/src/grimlock_kernel_asus_tegra3_unified-52800b9d40bde53830b73c34f59d16fd36d2d915/arch/arm/mach-tegra/tegra3_dvfs.c:366:2: note: in expansion of macro 'CORE_DVFS'
CORE_DVFS("disp2", 1, 0, KHZ, 155000, 155000, 268000, 268000, 268000, 268000, 268000, 268000, 268000),
^~~~~~~~~
/home/user/build/src/grimlock_kernel_asus_tegra3_unified-52800b9d40bde53830b73c34f59d16fd36d2d915/arch/arm/mach-tegra/tegra3_dvfs.c:239:17: warning: initialization discards 'const' qualifier from pointer target type [-Wdiscarded-qualifiers]
.millivolts = core_millivolts, \
^
/home/user/build/src/grimlock_kernel_asus_tegra3_unified-52800b9d40bde53830b73c34f59d16fd36d2d915/arch/arm/mach-tegra/tegra3_dvfs.c:367:2: note: in expansion of macro 'CORE_DVFS'
CORE_DVFS("disp2", 2, 0, KHZ, 155000, 155000, 268000, 268000, 268000, 268000, 268000, 268000, 268000),
^~~~~~~~~
/home/user/build/src/grimlock_kernel_asus_tegra3_unified-52800b9d40bde53830b73c34f59d16fd36d2d915/arch/arm/mach-tegra/tegra3_dvfs.c:239:17: warning: initialization discards 'const' qualifier from pointer target type [-Wdiscarded-qualifiers]
.millivolts = core_millivolts, \
^
/home/user/build/src/grimlock_kernel_asus_tegra3_unified-52800b9d40bde53830b73c34f59d16fd36d2d915/arch/arm/mach-tegra/tegra3_dvfs.c:368:2: note: in expansion of macro 'CORE_DVFS'
CORE_DVFS("disp2", 3, 0, KHZ, 1, 120000, 120000, 120000, 120000, 190000, 190000, 190000, 190000),
^~~~~~~~~
/home/user/build/src/grimlock_kernel_asus_tegra3_unified-52800b9d40bde53830b73c34f59d16fd36d2d915/arch/arm/mach-tegra/tegra3_dvfs.c:239:17: warning: initialization discards 'const' qualifier from pointer target type [-Wdiscarded-qualifiers]
.millivolts = core_millivolts, \
^
/home/user/build/src/grimlock_kernel_asus_tegra3_unified-52800b9d40bde53830b73c34f59d16fd36d2d915/arch/arm/mach-tegra/tegra3_dvfs.c:370:2: note: in expansion of macro 'CORE_DVFS'
CORE_DVFS("pwm", -1, 1, KHZ, 204000, 408000, 408000, 408000, 408000, 408000, 408000, 408000, 408000),
^~~~~~~~~
CC arch/arm/mach-tegra/latency_allowance.o
CC arch/arm/mach-tegra/edp.o
CC arch/arm/mach-tegra/tegra3_speedo.o
CC arch/arm/mach-tegra/tegra3_actmon.o
CC arch/arm/mach-tegra/tegra3_emc.o
CC arch/arm/mach-tegra/wakeups-t3.o
CC arch/arm/mach-tegra/wakeups.o
CC arch/arm/mach-tegra/pm-t3.o
CC fs/fcntl.o
CC arch/arm/mach-tegra/pinmux-t3-tables.o
CC mm/shmem.o
CC arch/arm/mach-tegra/localtimer.o
CC arch/arm/mach-tegra/platsmp.o
CC arch/arm/mach-tegra/hotplug.o
AS arch/arm/mach-tegra/headsmp.o
CC arch/arm/mach-tegra/reset.o
CC arch/arm/mach-tegra/dma.o
CC fs/ioctl.o
CC arch/arm/mach-tegra/cpu-tegra.o
CC arch/arm/mach-tegra/cpu-tegra3.o
CC fs/readdir.o
CC mm/prio_tree.o
/home/user/build/src/grimlock_kernel_asus_tegra3_unified-52800b9d40bde53830b73c34f59d16fd36d2d915/arch/arm/mach-tegra/cpu-tegra.c: In function 'tegra_target':
/home/user/build/src/grimlock_kernel_asus_tegra3_unified-52800b9d40bde53830b73c34f59d16fd36d2d915/arch/arm/mach-tegra/cpu-tegra.c:854:6: warning: unused variable 'cpu' [-Wunused-variable]
int cpu = 0;
^~~
/home/user/build/src/grimlock_kernel_asus_tegra3_unified-52800b9d40bde53830b73c34f59d16fd36d2d915/arch/arm/mach-tegra/cpu-tegra.c: In function 'tegra_cpufreq_init':
/home/user/build/src/grimlock_kernel_asus_tegra3_unified-52800b9d40bde53830b73c34f59d16fd36d2d915/arch/arm/mach-tegra/cpu-tegra.c:1035:6: warning: unused variable 'i' [-Wunused-variable]
int i = 0;
^
CC arch/arm/mach-tegra/pcie.o
CC mm/util.o
CC fs/select.o
CC arch/arm/mach-tegra/cpuidle.o
CC arch/arm/mach-tegra/cpuidle-t3.o
CC arch/arm/mach-tegra/tegra3_throttle.o
CC mm/mmzone.o
CC fs/fifo.o
CC mm/vmstat.o
CC arch/arm/mach-tegra/tegra3_thermal.o
CC fs/dcache.o
CC arch/arm/mach-tegra/iovmm.o
CC arch/arm/mach-tegra/iovmm-smmu.o
CC mm/backing-dev.o
CC arch/arm/mach-tegra/sysfs-cluster.o
CC arch/arm/mach-tegra/tegra3_tsensor.o
CC mm/page_isolation.o
CC arch/arm/mach-tegra/powerdetect.o
CC arch/arm/mach-tegra/board-cardhu.o
CC fs/inode.o
CC mm/mm_init.o
CC arch/arm/mach-tegra/board-cardhu-kbc.o
CC mm/mmu_context.o
CC arch/arm/mach-tegra/board-cardhu-irda.o
CC mm/percpu.o
/home/user/build/src/grimlock_kernel_asus_tegra3_unified-52800b9d40bde53830b73c34f59d16fd36d2d915/arch/arm/mach-tegra/board-cardhu.c: In function 'tegra_usb3_utmip_host_register':
/home/user/build/src/grimlock_kernel_asus_tegra3_unified-52800b9d40bde53830b73c34f59d16fd36d2d915/arch/arm/mach-tegra/board-cardhu.c:1563:8: warning: unused variable 'platform_data' [-Wunused-variable]
void *platform_data;
^~~~~~~~~~~~~
At top level:
/home/user/build/src/grimlock_kernel_asus_tegra3_unified-52800b9d40bde53830b73c34f59d16fd36d2d915/arch/arm/mach-tegra/board-cardhu.c:1082:47: warning: 'spi_clk_init_table' defined but not used [-Wunused-variable]
static __initdata struct tegra_clk_init_table spi_clk_init_table[] = {
^~~~~~~~~~~~~~~~~~
/home/user/build/src/grimlock_kernel_asus_tegra3_unified-52800b9d40bde53830b73c34f59d16fd36d2d915/arch/arm/mach-tegra/board-cardhu.c:906:31: warning: 'cardhu_audio_aic326x_device' defined but not used [-Wunused-variable]
static struct platform_device cardhu_audio_aic326x_device = {
^~~~~~~~~~~~~~~~~~~~~~~~~~~
/home/user/build/src/grimlock_kernel_asus_tegra3_unified-52800b9d40bde53830b73c34f59d16fd36d2d915/arch/arm/mach-tegra/board-cardhu.c:877:31: warning: 'cardhu_audio_max98095_device' defined but not used [-Wunused-variable]
static struct platform_device cardhu_audio_max98095_device = {
^~~~~~~~~~~~~~~~~~~~~~~~~~~~
/home/user/build/src/grimlock_kernel_asus_tegra3_unified-52800b9d40bde53830b73c34f59d16fd36d2d915/arch/arm/mach-tegra/board-cardhu.c:869:31: warning: 'cardhu_audio_wm8903_device' defined but not used [-Wunused-variable]
static struct platform_device cardhu_audio_wm8903_device = {
^~~~~~~~~~~~~~~~~~~~~~~~~~
/home/user/build/src/grimlock_kernel_asus_tegra3_unified-52800b9d40bde53830b73c34f59d16fd36d2d915/arch/arm/mach-tegra/board-cardhu.c:478:41: warning: 'cardhu_codec_max98095_info' defined but not used [-Wunused-variable]
static struct i2c_board_info __initdata cardhu_codec_max98095_info = {
^~~~~~~~~~~~~~~~~~~~~~~~~~
/home/user/build/src/grimlock_kernel_asus_tegra3_unified-52800b9d40bde53830b73c34f59d16fd36d2d915/arch/arm/mach-tegra/board-cardhu.c:473:41: warning: 'cardhu_codec_aic326x_info' defined but not used [-Wunused-variable]
static struct i2c_board_info __initdata cardhu_codec_aic326x_info = {
^~~~~~~~~~~~~~~~~~~~~~~~~
/home/user/build/src/grimlock_kernel_asus_tegra3_unified-52800b9d40bde53830b73c34f59d16fd36d2d915/arch/arm/mach-tegra/board-cardhu.c:467:41: warning: 'cardhu_codec_wm8903_info' defined but not used [-Wunused-variable]
static struct i2c_board_info __initdata cardhu_codec_wm8903_info = {
^~~~~~~~~~~~~~~~~~~~~~~~
CC arch/arm/mach-tegra/board-cardhu-panel.o
CC arch/arm/mach-tegra/board-cardhu-pinmux.o
CC fs/attr.o
/home/user/build/src/grimlock_kernel_asus_tegra3_unified-52800b9d40bde53830b73c34f59d16fd36d2d915/arch/arm/mach-tegra/board-cardhu-pinmux.c:1022:34: warning: 'cardhu_unused_gpio_pins_e1506' defined but not used [-Wunused-variable]
static struct gpio_init_pin_info cardhu_unused_gpio_pins_e1506[] = {
^~~~~~~~~~~~~~~~~~~~~~~~~~~~~
/home/user/build/src/grimlock_kernel_asus_tegra3_unified-52800b9d40bde53830b73c34f59d16fd36d2d915/arch/arm/mach-tegra/board-cardhu-pinmux.c: In function 'cardhu_pinmux_init':
/home/user/build/src/grimlock_kernel_asus_tegra3_unified-52800b9d40bde53830b73c34f59d16fd36d2d915/arch/arm/mach-tegra/board-cardhu-pinmux.c:811:29: warning: 'pins_info' may be used uninitialized in this function [-Wmaybe-uninitialized]
struct gpio_init_pin_info *pins_info;
^~~~~~~~~
/home/user/build/src/grimlock_kernel_asus_tegra3_unified-52800b9d40bde53830b73c34f59d16fd36d2d915/arch/arm/mach-tegra/board-cardhu-pinmux.c:809:6: warning: 'len' may be used uninitialized in this function [-Wmaybe-uninitialized]
int len;
^~~
CC arch/arm/mach-tegra/board-cardhu-power.o
/home/user/build/src/grimlock_kernel_asus_tegra3_unified-52800b9d40bde53830b73c34f59d16fd36d2d915/arch/arm/mach-tegra/board-cardhu-panel.c:964:29: warning: 'cardhu_hdmi_fb_data_800_1280' defined but not used [-Wunused-variable]
static struct tegra_fb_data cardhu_hdmi_fb_data_800_1280 = {
^~~~~~~~~~~~~~~~~~~~~~~~~~~~
CC fs/bad_inode.o
CC arch/arm/mach-tegra/board-cardhu-pm298-power-rails.o
CC mm/fremap.o
CC fs/file.o
/home/user/build/src/grimlock_kernel_asus_tegra3_unified-52800b9d40bde53830b73c34f59d16fd36d2d915/arch/arm/mach-tegra/board-cardhu-power.c:718:32: warning: 'fixed_reg_en_vddio_vid_oc_pm269_dev' defined but not used [-Wunused-variable]
static struct platform_device fixed_reg_##_var##_dev = { \
^
/home/user/build/src/grimlock_kernel_asus_tegra3_unified-52800b9d40bde53830b73c34f59d16fd36d2d915/arch/arm/mach-tegra/board-cardhu-power.c:778:1: note: in expansion of macro 'FIXED_REG_OD'
FIXED_REG_OD(17, en_vddio_vid_oc_pm269, en_vddio_vid_oc, FIXED_SUPPLY(dis_5v_switch), 0, 0, TEGRA_GPIO_PP2, true, 0, 5000, true);
^~~~~~~~~~~~
/home/user/build/src/grimlock_kernel_asus_tegra3_unified-52800b9d40bde53830b73c34f59d16fd36d2d915/arch/arm/mach-tegra/board-cardhu-power.c:625:41: warning: 'fixed_reg_cam2_ldo_en_supply' defined but not used [-Wunused-variable]
static struct regulator_consumer_supply fixed_reg_cam2_ldo_en_supply[] = {
^~~~~~~~~~~~~~~~~~~~~~~~~~~~
CC arch/arm/mach-tegra/board-cardhu-pm299-power-rails.o
CC arch/arm/mach-tegra/board-cardhu-sdhci.o
CC mm/highmem.o
CC fs/filesystems.o
CC arch/arm/mach-tegra/board-cardhu-sensors.o
CC arch/arm/mach-tegra/board-cardhu-memory.o
/home/user/build/src/grimlock_kernel_asus_tegra3_unified-52800b9d40bde53830b73c34f59d16fd36d2d915/arch/arm/mach-tegra/board-cardhu-sensors.c: In function 'cardhu_ov2710_power_on':
/home/user/build/src/grimlock_kernel_asus_tegra3_unified-52800b9d40bde53830b73c34f59d16fd36d2d915/arch/arm/mach-tegra/board-cardhu-sensors.c:878:6: error: 'cardhu_1v8_cam3' undeclared (first use in this function)
if (cardhu_1v8_cam3 == NULL) {
^~~~~~~~~~~~~~~
/home/user/build/src/grimlock_kernel_asus_tegra3_unified-52800b9d40bde53830b73c34f59d16fd36d2d915/arch/arm/mach-tegra/board-cardhu-sensors.c:878:6: note: each undeclared identifier is reported only once for each function it appears in
/home/user/build/src/grimlock_kernel_asus_tegra3_unified-52800b9d40bde53830b73c34f59d16fd36d2d915/arch/arm/mach-tegra/board-cardhu-sensors.c:892:7: error: 'cardhu_vdd_cam3' undeclared (first use in this function)
if (cardhu_vdd_cam3 == NULL) {
^~~~~~~~~~~~~~~
/home/user/build/src/grimlock_kernel_asus_tegra3_unified-52800b9d40bde53830b73c34f59d16fd36d2d915/arch/arm/mach-tegra/board-cardhu-sensors.c: In function 'cardhu_ov2710_power_off':
/home/user/build/src/grimlock_kernel_asus_tegra3_unified-52800b9d40bde53830b73c34f59d16fd36d2d915/arch/arm/mach-tegra/board-cardhu-sensors.c:940:7: error: 'cardhu_vdd_cam3' undeclared (first use in this function)
if (cardhu_vdd_cam3)
^~~~~~~~~~~~~~~
/home/user/build/src/grimlock_kernel_asus_tegra3_unified-52800b9d40bde53830b73c34f59d16fd36d2d915/arch/arm/mach-tegra/board-cardhu-sensors.c:944:6: error: 'cardhu_1v8_cam3' undeclared (first use in this function)
if (cardhu_1v8_cam3)
^~~~~~~~~~~~~~~
/home/user/build/src/grimlock_kernel_asus_tegra3_unified-52800b9d40bde53830b73c34f59d16fd36d2d915/arch/arm/mach-tegra/board-cardhu-sensors.c: In function 'cardhu_ov5640_power_on':
/home/user/build/src/grimlock_kernel_asus_tegra3_unified-52800b9d40bde53830b73c34f59d16fd36d2d915/arch/arm/mach-tegra/board-cardhu-sensors.c:970:7: error: 'cardhu_vdd_cam3' undeclared (first use in this function)
if (cardhu_vdd_cam3 == NULL) {
^~~~~~~~~~~~~~~
/home/user/build/src/grimlock_kernel_asus_tegra3_unified-52800b9d40bde53830b73c34f59d16fd36d2d915/arch/arm/mach-tegra/board-cardhu-sensors.c:982:6: error: 'cardhu_1v8_cam3' undeclared (first use in this function)
if (cardhu_1v8_cam3 == NULL) {
^~~~~~~~~~~~~~~
/home/user/build/src/grimlock_kernel_asus_tegra3_unified-52800b9d40bde53830b73c34f59d16fd36d2d915/arch/arm/mach-tegra/board-cardhu-sensors.c: In function 'cardhu_ov5640_power_off':
/home/user/build/src/grimlock_kernel_asus_tegra3_unified-52800b9d40bde53830b73c34f59d16fd36d2d915/arch/arm/mach-tegra/board-cardhu-sensors.c:1022:6: error: 'cardhu_1v8_cam3' undeclared (first use in this function)
if (cardhu_1v8_cam3)
^~~~~~~~~~~~~~~
/home/user/build/src/grimlock_kernel_asus_tegra3_unified-52800b9d40bde53830b73c34f59d16fd36d2d915/arch/arm/mach-tegra/board-cardhu-sensors.c:1024:6: error: 'cardhu_vdd_cam3' undeclared (first use in this function)
if (cardhu_vdd_cam3)
^~~~~~~~~~~~~~~
/home/user/build/src/grimlock_kernel_asus_tegra3_unified-52800b9d40bde53830b73c34f59d16fd36d2d915/arch/arm/mach-tegra/board-cardhu-sensors.c: At top level:
/home/user/build/src/grimlock_kernel_asus_tegra3_unified-52800b9d40bde53830b73c34f59d16fd36d2d915/arch/arm/mach-tegra/board-cardhu-sensors.c:1030:8: error: variable 'cardhu_ov5640_data' has initializer but incomplete type
struct ov5640_platform_data cardhu_ov5640_data = {
^~~~~~~~~~~~~~~~~~~~
/home/user/build/src/grimlock_kernel_asus_tegra3_unified-52800b9d40bde53830b73c34f59d16fd36d2d915/arch/arm/mach-tegra/board-cardhu-sensors.c:1031:2: error: unknown field 'power_on' specified in initializer
.power_on = cardhu_ov5640_power_on,
^
/home/user/build/src/grimlock_kernel_asus_tegra3_unified-52800b9d40bde53830b73c34f59d16fd36d2d915/arch/arm/mach-tegra/board-cardhu-sensors.c:1031:14: warning: excess elements in struct initializer
.power_on = cardhu_ov5640_power_on,
^~~~~~~~~~~~~~~~~~~~~~
/home/user/build/src/grimlock_kernel_asus_tegra3_unified-52800b9d40bde53830b73c34f59d16fd36d2d915/arch/arm/mach-tegra/board-cardhu-sensors.c:1031:14: note: (near initialization for 'cardhu_ov5640_data')
/home/user/build/src/grimlock_kernel_asus_tegra3_unified-52800b9d40bde53830b73c34f59d16fd36d2d915/arch/arm/mach-tegra/board-cardhu-sensors.c:1032:2: error: unknown field 'power_off' specified in initializer
.power_off = cardhu_ov5640_power_off,
^
/home/user/build/src/grimlock_kernel_asus_tegra3_unified-52800b9d40bde53830b73c34f59d16fd36d2d915/arch/arm/mach-tegra/board-cardhu-sensors.c:1032:15: warning: excess elements in struct initializer
.power_off = cardhu_ov5640_power_off,
^~~~~~~~~~~~~~~~~~~~~~~
/home/user/build/src/grimlock_kernel_asus_tegra3_unified-52800b9d40bde53830b73c34f59d16fd36d2d915/arch/arm/mach-tegra/board-cardhu-sensors.c:1032:15: note: (near initialization for 'cardhu_ov5640_data')
/home/user/build/src/grimlock_kernel_asus_tegra3_unified-52800b9d40bde53830b73c34f59d16fd36d2d915/arch/arm/mach-tegra/board-cardhu-sensors.c:1043:30: error: array type has incomplete element type 'struct nvc_gpio_pdata'
static struct nvc_gpio_pdata sh532u_gpio_pdata[] = {
^~~~~~~~~~~~~~~~~
/home/user/build/src/grimlock_kernel_asus_tegra3_unified-52800b9d40bde53830b73c34f59d16fd36d2d915/arch/arm/mach-tegra/board-cardhu-sensors.c:1044:4: error: 'SH532U_GPIO_RESET' undeclared here (not in a function)
{ SH532U_GPIO_RESET, TEGRA_GPIO_PBB0, false, 0, },
^~~~~~~~~~~~~~~~~
/home/user/build/src/grimlock_kernel_asus_tegra3_unified-52800b9d40bde53830b73c34f59d16fd36d2d915/arch/arm/mach-tegra/board-cardhu-sensors.c:1047:15: error: variable 'sh532u_left_pdata' has initializer but incomplete type
static struct sh532u_platform_data sh532u_left_pdata = {
^~~~~~~~~~~~~~~~~~~~
/home/user/build/src/grimlock_kernel_asus_tegra3_unified-52800b9d40bde53830b73c34f59d16fd36d2d915/arch/arm/mach-tegra/board-cardhu-sensors.c:1048:2: error: unknown field 'cfg' specified in initializer
.cfg = NVC_CFG_NODEV,
^
/home/user/build/src/grimlock_kernel_asus_tegra3_unified-52800b9d40bde53830b73c34f59d16fd36d2d915/arch/arm/mach-tegra/board-cardhu-sensors.c:1048:10: error: 'NVC_CFG_NODEV' undeclared here (not in a function)
.cfg = NVC_CFG_NODEV,
^~~~~~~~~~~~~
/home/user/build/src/grimlock_kernel_asus_tegra3_unified-52800b9d40bde53830b73c34f59d16fd36d2d915/arch/arm/mach-tegra/board-cardhu-sensors.c:1048:10: warning: excess elements in struct initializer
/home/user/build/src/grimlock_kernel_asus_tegra3_unified-52800b9d40bde53830b73c34f59d16fd36d2d915/arch/arm/mach-tegra/board-cardhu-sensors.c:1048:10: note: (near initialization for 'sh532u_left_pdata')
/home/user/build/src/grimlock_kernel_asus_tegra3_unified-52800b9d40bde53830b73c34f59d16fd36d2d915/arch/arm/mach-tegra/board-cardhu-sensors.c:1049:2: error: unknown field 'num' specified in initializer
.num = 1,
^
/home/user/build/src/grimlock_kernel_asus_tegra3_unified-52800b9d40bde53830b73c34f59d16fd36d2d915/arch/arm/mach-tegra/board-cardhu-sensors.c:1049:10: warning: excess elements in struct initializer
.num = 1,
^
/home/user/build/src/grimlock_kernel_asus_tegra3_unified-52800b9d40bde53830b73c34f59d16fd36d2d915/arch/arm/mach-tegra/board-cardhu-sensors.c:1049:10: note: (near initialization for 'sh532u_left_pdata')
/home/user/build/src/grimlock_kernel_asus_tegra3_unified-52800b9d40bde53830b73c34f59d16fd36d2d915/arch/arm/mach-tegra/board-cardhu-sensors.c:1050:2: error: unknown field 'sync' specified in initializer
.sync = 2,
^
/home/user/build/src/grimlock_kernel_asus_tegra3_unified-52800b9d40bde53830b73c34f59d16fd36d2d915/arch/arm/mach-tegra/board-cardhu-sensors.c:1050:11: warning: excess elements in struct initializer
.sync = 2,
^
/home/user/build/src/grimlock_kernel_asus_tegra3_unified-52800b9d40bde53830b73c34f59d16fd36d2d915/arch/arm/mach-tegra/board-cardhu-sensors.c:1050:11: note: (near initialization for 'sh532u_left_pdata')
/home/user/build/src/grimlock_kernel_asus_tegra3_unified-52800b9d40bde53830b73c34f59d16fd36d2d915/arch/arm/mach-tegra/board-cardhu-sensors.c:1051:2: error: unknown field 'dev_name' specified in initializer
.dev_name = "focuser",
^
/home/user/build/src/grimlock_kernel_asus_tegra3_unified-52800b9d40bde53830b73c34f59d16fd36d2d915/arch/arm/mach-tegra/board-cardhu-sensors.c:1051:14: warning: excess elements in struct initializer
.dev_name = "focuser",
^~~~~~~~~
/home/user/build/src/grimlock_kernel_asus_tegra3_unified-52800b9d40bde53830b73c34f59d16fd36d2d915/arch/arm/mach-tegra/board-cardhu-sensors.c:1051:14: note: (near initialization for 'sh532u_left_pdata')
/home/user/build/src/grimlock_kernel_asus_tegra3_unified-52800b9d40bde53830b73c34f59d16fd36d2d915/arch/arm/mach-tegra/board-cardhu-sensors.c:1052:2: error: unknown field 'gpio_count' specified in initializer
.gpio_count = ARRAY_SIZE(sh532u_gpio_pdata),
^
In file included from /home/user/build/src/grimlock_kernel_asus_tegra3_unified-52800b9d40bde53830b73c34f59d16fd36d2d915/include/linux/cache.h:4:0,
from /home/user/build/src/grimlock_kernel_asus_tegra3_unified-52800b9d40bde53830b73c34f59d16fd36d2d915/include/linux/time.h:7,
from /home/user/build/src/grimlock_kernel_asus_tegra3_unified-52800b9d40bde53830b73c34f59d16fd36d2d915/include/linux/stat.h:60,
from /home/user/build/src/grimlock_kernel_asus_tegra3_unified-52800b9d40bde53830b73c34f59d16fd36d2d915/include/linux/module.h:10,
from /home/user/build/src/grimlock_kernel_asus_tegra3_unified-52800b9d40bde53830b73c34f59d16fd36d2d915/include/linux/i2c.h:31,
from /home/user/build/src/grimlock_kernel_asus_tegra3_unified-52800b9d40bde53830b73c34f59d16fd36d2d915/arch/arm/mach-tegra/board-cardhu-sensors.c:34:
/home/user/build/src/grimlock_kernel_asus_tegra3_unified-52800b9d40bde53830b73c34f59d16fd36d2d915/include/linux/kernel.h:672:45: error: bit-field '<anonymous>' width not an integer constant
#define BUILD_BUG_ON_ZERO(e) (sizeof(struct { int:-!!(e); }))
^
/home/user/build/src/grimlock_kernel_asus_tegra3_unified-52800b9d40bde53830b73c34f59d16fd36d2d915/include/linux/compiler-gcc.h:41:28: note: in expansion of macro 'BUILD_BUG_ON_ZERO'
#define __must_be_array(a) BUILD_BUG_ON_ZERO(__same_type((a), &(a)[0]))
^~~~~~~~~~~~~~~~~
/home/user/build/src/grimlock_kernel_asus_tegra3_unified-52800b9d40bde53830b73c34f59d16fd36d2d915/include/linux/kernel.h:45:59: note: in expansion of macro '__must_be_array'
#define ARRAY_SIZE(arr) (sizeof(arr) / sizeof((arr)[0]) + __must_be_array(arr))
^~~~~~~~~~~~~~~
/home/user/build/src/grimlock_kernel_asus_tegra3_unified-52800b9d40bde53830b73c34f59d16fd36d2d915/arch/arm/mach-tegra/board-cardhu-sensors.c:1052:16: note: in expansion of macro 'ARRAY_SIZE'
.gpio_count = ARRAY_SIZE(sh532u_gpio_pdata),
^~~~~~~~~~
In file included from /home/user/build/src/grimlock_kernel_asus_tegra3_unified-52800b9d40bde53830b73c34f59d16fd36d2d915/include/linux/cache.h:4:0,
from /home/user/build/src/grimlock_kernel_asus_tegra3_unified-52800b9d40bde53830b73c34f59d16fd36d2d915/include/linux/time.h:7,
from /home/user/build/src/grimlock_kernel_asus_tegra3_unified-52800b9d40bde53830b73c34f59d16fd36d2d915/include/linux/stat.h:60,
from /home/user/build/src/grimlock_kernel_asus_tegra3_unified-52800b9d40bde53830b73c34f59d16fd36d2d915/include/linux/module.h:10,
from /home/user/build/src/grimlock_kernel_asus_tegra3_unified-52800b9d40bde53830b73c34f59d16fd36d2d915/include/linux/i2c.h:31,
from /home/user/build/src/grimlock_kernel_asus_tegra3_unified-52800b9d40bde53830b73c34f59d16fd36d2d915/arch/arm/mach-tegra/board-cardhu-sensors.c:34:
/home/user/build/src/grimlock_kernel_asus_tegra3_unified-52800b9d40bde53830b73c34f59d16fd36d2d915/include/linux/kernel.h:45:25: warning: excess elements in struct initializer
#define ARRAY_SIZE(arr) (sizeof(arr) / sizeof((arr)[0]) + __must_be_array(arr))
^
/home/user/build/src/grimlock_kernel_asus_tegra3_unified-52800b9d40bde53830b73c34f59d16fd36d2d915/arch/arm/mach-tegra/board-cardhu-sensors.c:1052:16: note: in expansion of macro 'ARRAY_SIZE'
.gpio_count = ARRAY_SIZE(sh532u_gpio_pdata),
^~~~~~~~~~
/home/user/build/src/grimlock_kernel_asus_tegra3_unified-52800b9d40bde53830b73c34f59d16fd36d2d915/include/linux/kernel.h:45:25: note: (near initialization for 'sh532u_left_pdata')
#define ARRAY_SIZE(arr) (sizeof(arr) / sizeof((arr)[0]) + __must_be_array(arr))
^
/home/user/build/src/grimlock_kernel_asus_tegra3_unified-52800b9d40bde53830b73c34f59d16fd36d2d915/arch/arm/mach-tegra/board-cardhu-sensors.c:1052:16: note: in expansion of macro 'ARRAY_SIZE'
.gpio_count = ARRAY_SIZE(sh532u_gpio_pdata),
^~~~~~~~~~
/home/user/build/src/grimlock_kernel_asus_tegra3_unified-52800b9d40bde53830b73c34f59d16fd36d2d915/arch/arm/mach-tegra/board-cardhu-sensors.c:1053:2: error: unknown field 'gpio' specified in initializer
.gpio = sh532u_gpio_pdata,
^
/home/user/build/src/grimlock_kernel_asus_tegra3_unified-52800b9d40bde53830b73c34f59d16fd36d2d915/arch/arm/mach-tegra/board-cardhu-sensors.c:1053:11: warning: excess elements in struct initializer
.gpio = sh532u_gpio_pdata,
^~~~~~~~~~~~~~~~~
/home/user/build/src/grimlock_kernel_asus_tegra3_unified-52800b9d40bde53830b73c34f59d16fd36d2d915/arch/arm/mach-tegra/board-cardhu-sensors.c:1053:11: note: (near initialization for 'sh532u_left_pdata')
/home/user/build/src/grimlock_kernel_asus_tegra3_unified-52800b9d40bde53830b73c34f59d16fd36d2d915/arch/arm/mach-tegra/board-cardhu-sensors.c:1056:15: error: variable 'sh532u_right_pdata' has initializer but incomplete type
static struct sh532u_platform_data sh532u_right_pdata = {
^~~~~~~~~~~~~~~~~~~~
/home/user/build/src/grimlock_kernel_asus_tegra3_unified-52800b9d40bde53830b73c34f59d16fd36d2d915/arch/arm/mach-tegra/board-cardhu-sensors.c:1057:2: error: unknown field 'cfg' specified in initializer
.cfg = NVC_CFG_NODEV,
^
/home/user/build/src/grimlock_kernel_asus_tegra3_unified-52800b9d40bde53830b73c34f59d16fd36d2d915/arch/arm/mach-tegra/board-cardhu-sensors.c:1057:10: warning: excess elements in struct initializer
.cfg = NVC_CFG_NODEV,
^~~~~~~~~~~~~
/home/user/build/src/grimlock_kernel_asus_tegra3_unified-52800b9d40bde53830b73c34f59d16fd36d2d915/arch/arm/mach-tegra/board-cardhu-sensors.c:1057:10: note: (near initialization for 'sh532u_right_pdata')
/home/user/build/src/grimlock_kernel_asus_tegra3_unified-52800b9d40bde53830b73c34f59d16fd36d2d915/arch/arm/mach-tegra/board-cardhu-sensors.c:1058:2: error: unknown field 'num' specified in initializer
.num = 2,
^
/home/user/build/src/grimlock_kernel_asus_tegra3_unified-52800b9d40bde53830b73c34f59d16fd36d2d915/arch/arm/mach-tegra/board-cardhu-sensors.c:1058:10: warning: excess elements in struct initializer
.num = 2,
^
/home/user/build/src/grimlock_kernel_asus_tegra3_unified-52800b9d40bde53830b73c34f59d16fd36d2d915/arch/arm/mach-tegra/board-cardhu-sensors.c:1058:10: note: (near initialization for 'sh532u_right_pdata')
/home/user/build/src/grimlock_kernel_asus_tegra3_unified-52800b9d40bde53830b73c34f59d16fd36d2d915/arch/arm/mach-tegra/board-cardhu-sensors.c:1059:2: error: unknown field 'sync' specified in initializer
.sync = 1,
^
/home/user/build/src/grimlock_kernel_asus_tegra3_unified-52800b9d40bde53830b73c34f59d16fd36d2d915/arch/arm/mach-tegra/board-cardhu-sensors.c:1059:11: warning: excess elements in struct initializer
.sync = 1,
^
/home/user/build/src/grimlock_kernel_asus_tegra3_unified-52800b9d40bde53830b73c34f59d16fd36d2d915/arch/arm/mach-tegra/board-cardhu-sensors.c:1059:11: note: (near initialization for 'sh532u_right_pdata')
/home/user/build/src/grimlock_kernel_asus_tegra3_unified-52800b9d40bde53830b73c34f59d16fd36d2d915/arch/arm/mach-tegra/board-cardhu-sensors.c:1060:2: error: unknown field 'dev_name' specified in initializer
.dev_name = "focuser",
^
/home/user/build/src/grimlock_kernel_asus_tegra3_unified-52800b9d40bde53830b73c34f59d16fd36d2d915/arch/arm/mach-tegra/board-cardhu-sensors.c:1060:14: warning: excess elements in struct initializer
.dev_name = "focuser",
^~~~~~~~~
/home/user/build/src/grimlock_kernel_asus_tegra3_unified-52800b9d40bde53830b73c34f59d16fd36d2d915/arch/arm/mach-tegra/board-cardhu-sensors.c:1060:14: note: (near initialization for 'sh532u_right_pdata')
/home/user/build/src/grimlock_kernel_asus_tegra3_unified-52800b9d40bde53830b73c34f59d16fd36d2d915/arch/arm/mach-tegra/board-cardhu-sensors.c:1061:2: error: unknown field 'gpio_count' specified in initializer
.gpio_count = ARRAY_SIZE(sh532u_gpio_pdata),
^
In file included from /home/user/build/src/grimlock_kernel_asus_tegra3_unified-52800b9d40bde53830b73c34f59d16fd36d2d915/include/linux/cache.h:4:0,
from /home/user/build/src/grimlock_kernel_asus_tegra3_unified-52800b9d40bde53830b73c34f59d16fd36d2d915/include/linux/time.h:7,
from /home/user/build/src/grimlock_kernel_asus_tegra3_unified-52800b9d40bde53830b73c34f59d16fd36d2d915/include/linux/stat.h:60,
from /home/user/build/src/grimlock_kernel_asus_tegra3_unified-52800b9d40bde53830b73c34f59d16fd36d2d915/include/linux/module.h:10,
from /home/user/build/src/grimlock_kernel_asus_tegra3_unified-52800b9d40bde53830b73c34f59d16fd36d2d915/include/linux/i2c.h:31,
from /home/user/build/src/grimlock_kernel_asus_tegra3_unified-52800b9d40bde53830b73c34f59d16fd36d2d915/arch/arm/mach-tegra/board-cardhu-sensors.c:34:
/home/user/build/src/grimlock_kernel_asus_tegra3_unified-52800b9d40bde53830b73c34f59d16fd36d2d915/include/linux/kernel.h:672:45: error: bit-field '<anonymous>' width not an integer constant
#define BUILD_BUG_ON_ZERO(e) (sizeof(struct { int:-!!(e); }))
^
/home/user/build/src/grimlock_kernel_asus_tegra3_unified-52800b9d40bde53830b73c34f59d16fd36d2d915/include/linux/compiler-gcc.h:41:28: note: in expansion of macro 'BUILD_BUG_ON_ZERO'
#define __must_be_array(a) BUILD_BUG_ON_ZERO(__same_type((a), &(a)[0]))
^~~~~~~~~~~~~~~~~
/home/user/build/src/grimlock_kernel_asus_tegra3_unified-52800b9d40bde53830b73c34f59d16fd36d2d915/include/linux/kernel.h:45:59: note: in expansion of macro '__must_be_array'
#define ARRAY_SIZE(arr) (sizeof(arr) / sizeof((arr)[0]) + __must_be_array(arr))
^~~~~~~~~~~~~~~
/home/user/build/src/grimlock_kernel_asus_tegra3_unified-52800b9d40bde53830b73c34f59d16fd36d2d915/arch/arm/mach-tegra/board-cardhu-sensors.c:1061:16: note: in expansion of macro 'ARRAY_SIZE'
.gpio_count = ARRAY_SIZE(sh532u_gpio_pdata),
^~~~~~~~~~
In file included from /home/user/build/src/grimlock_kernel_asus_tegra3_unified-52800b9d40bde53830b73c34f59d16fd36d2d915/include/linux/cache.h:4:0,
from /home/user/build/src/grimlock_kernel_asus_tegra3_unified-52800b9d40bde53830b73c34f59d16fd36d2d915/include/linux/time.h:7,
from /home/user/build/src/grimlock_kernel_asus_tegra3_unified-52800b9d40bde53830b73c34f59d16fd36d2d915/include/linux/stat.h:60,
from /home/user/build/src/grimlock_kernel_asus_tegra3_unified-52800b9d40bde53830b73c34f59d16fd36d2d915/include/linux/module.h:10,
from /home/user/build/src/grimlock_kernel_asus_tegra3_unified-52800b9d40bde53830b73c34f59d16fd36d2d915/include/linux/i2c.h:31,
from /home/user/build/src/grimlock_kernel_asus_tegra3_unified-52800b9d40bde53830b73c34f59d16fd36d2d915/arch/arm/mach-tegra/board-cardhu-sensors.c:34:
/home/user/build/src/grimlock_kernel_asus_tegra3_unified-52800b9d40bde53830b73c34f59d16fd36d2d915/include/linux/kernel.h:45:25: warning: excess elements in struct initializer
#define ARRAY_SIZE(arr) (sizeof(arr) / sizeof((arr)[0]) + __must_be_array(arr))
^
/home/user/build/src/grimlock_kernel_asus_tegra3_unified-52800b9d40bde53830b73c34f59d16fd36d2d915/arch/arm/mach-tegra/board-cardhu-sensors.c:1061:16: note: in expansion of macro 'ARRAY_SIZE'
.gpio_count = ARRAY_SIZE(sh532u_gpio_pdata),
^~~~~~~~~~
/home/user/build/src/grimlock_kernel_asus_tegra3_unified-52800b9d40bde53830b73c34f59d16fd36d2d915/include/linux/kernel.h:45:25: note: (near initialization for 'sh532u_right_pdata')
#define ARRAY_SIZE(arr) (sizeof(arr) / sizeof((arr)[0]) + __must_be_array(arr))
^
/home/user/build/src/grimlock_kernel_asus_tegra3_unified-52800b9d40bde53830b73c34f59d16fd36d2d915/arch/arm/mach-tegra/board-cardhu-sensors.c:1061:16: note: in expansion of macro 'ARRAY_SIZE'
.gpio_count = ARRAY_SIZE(sh532u_gpio_pdata),
^~~~~~~~~~
/home/user/build/src/grimlock_kernel_asus_tegra3_unified-52800b9d40bde53830b73c34f59d16fd36d2d915/arch/arm/mach-tegra/board-cardhu-sensors.c:1062:2: error: unknown field 'gpio' specified in initializer
.gpio = sh532u_gpio_pdata,
^
/home/user/build/src/grimlock_kernel_asus_tegra3_unified-52800b9d40bde53830b73c34f59d16fd36d2d915/arch/arm/mach-tegra/board-cardhu-sensors.c:1062:11: warning: excess elements in struct initializer
.gpio = sh532u_gpio_pdata,
^~~~~~~~~~~~~~~~~
/home/user/build/src/grimlock_kernel_asus_tegra3_unified-52800b9d40bde53830b73c34f59d16fd36d2d915/arch/arm/mach-tegra/board-cardhu-sensors.c:1062:11: note: (near initialization for 'sh532u_right_pdata')
/home/user/build/src/grimlock_kernel_asus_tegra3_unified-52800b9d40bde53830b73c34f59d16fd36d2d915/arch/arm/mach-tegra/board-cardhu-sensors.c:1065:30: error: array type has incomplete element type 'struct nvc_gpio_pdata'
static struct nvc_gpio_pdata pm269_sh532u_left_gpio_pdata[] = {
^~~~~~~~~~~~~~~~~~~~~~~~~~~~
/home/user/build/src/grimlock_kernel_asus_tegra3_unified-52800b9d40bde53830b73c34f59d16fd36d2d915/arch/arm/mach-tegra/board-cardhu-sensors.c:1069:15: error: variable 'pm269_sh532u_left_pdata' has initializer but incomplete type
static struct sh532u_platform_data pm269_sh532u_left_pdata = {
^~~~~~~~~~~~~~~~~~~~
/home/user/build/src/grimlock_kernel_asus_tegra3_unified-52800b9d40bde53830b73c34f59d16fd36d2d915/arch/arm/mach-tegra/board-cardhu-sensors.c:1070:2: error: unknown field 'cfg' specified in initializer
.cfg = 0,
^
/home/user/build/src/grimlock_kernel_asus_tegra3_unified-52800b9d40bde53830b73c34f59d16fd36d2d915/arch/arm/mach-tegra/board-cardhu-sensors.c:1070:10: warning: excess elements in struct initializer
.cfg = 0,
^
/home/user/build/src/grimlock_kernel_asus_tegra3_unified-52800b9d40bde53830b73c34f59d16fd36d2d915/arch/arm/mach-tegra/board-cardhu-sensors.c:1070:10: note: (near initialization for 'pm269_sh532u_left_pdata')
/home/user/build/src/grimlock_kernel_asus_tegra3_unified-52800b9d40bde53830b73c34f59d16fd36d2d915/arch/arm/mach-tegra/board-cardhu-sensors.c:1071:2: error: unknown field 'num' specified in initializer
.num = 1,
^
/home/user/build/src/grimlock_kernel_asus_tegra3_unified-52800b9d40bde53830b73c34f59d16fd36d2d915/arch/arm/mach-tegra/board-cardhu-sensors.c:1071:10: warning: excess elements in struct initializer
.num = 1,
^
/home/user/build/src/grimlock_kernel_asus_tegra3_unified-52800b9d40bde53830b73c34f59d16fd36d2d915/arch/arm/mach-tegra/board-cardhu-sensors.c:1071:10: note: (near initialization for 'pm269_sh532u_left_pdata')
/home/user/build/src/grimlock_kernel_asus_tegra3_unified-52800b9d40bde53830b73c34f59d16fd36d2d915/arch/arm/mach-tegra/board-cardhu-sensors.c:1072:2: error: unknown field 'sync' specified in initializer
.sync = 2,
^
/home/user/build/src/grimlock_kernel_asus_tegra3_unified-52800b9d40bde53830b73c34f59d16fd36d2d915/arch/arm/mach-tegra/board-cardhu-sensors.c:1072:11: warning: excess elements in struct initializer
.sync = 2,
^
/home/user/build/src/grimlock_kernel_asus_tegra3_unified-52800b9d40bde53830b73c34f59d16fd36d2d915/arch/arm/mach-tegra/board-cardhu-sensors.c:1072:11: note: (near initialization for 'pm269_sh532u_left_pdata')
/home/user/build/src/grimlock_kernel_asus_tegra3_unified-52800b9d40bde53830b73c34f59d16fd36d2d915/arch/arm/mach-tegra/board-cardhu-sensors.c:1073:2: error: unknown field 'dev_name' specified in initializer
.dev_name = "focuser",
^
/home/user/build/src/grimlock_kernel_asus_tegra3_unified-52800b9d40bde53830b73c34f59d16fd36d2d915/arch/arm/mach-tegra/board-cardhu-sensors.c:1073:14: warning: excess elements in struct initializer
.dev_name = "focuser",
^~~~~~~~~
/home/user/build/src/grimlock_kernel_asus_tegra3_unified-52800b9d40bde53830b73c34f59d16fd36d2d915/arch/arm/mach-tegra/board-cardhu-sensors.c:1073:14: note: (near initialization for 'pm269_sh532u_left_pdata')
/home/user/build/src/grimlock_kernel_asus_tegra3_unified-52800b9d40bde53830b73c34f59d16fd36d2d915/arch/arm/mach-tegra/board-cardhu-sensors.c:1074:2: error: unknown field 'gpio_count' specified in initializer
.gpio_count = ARRAY_SIZE(pm269_sh532u_left_gpio_pdata),
^
In file included from /home/user/build/src/grimlock_kernel_asus_tegra3_unified-52800b9d40bde53830b73c34f59d16fd36d2d915/include/linux/cache.h:4:0,
from /home/user/build/src/grimlock_kernel_asus_tegra3_unified-52800b9d40bde53830b73c34f59d16fd36d2d915/include/linux/time.h:7,
from /home/user/build/src/grimlock_kernel_asus_tegra3_unified-52800b9d40bde53830b73c34f59d16fd36d2d915/include/linux/stat.h:60,
from /home/user/build/src/grimlock_kernel_asus_tegra3_unified-52800b9d40bde53830b73c34f59d16fd36d2d915/include/linux/module.h:10,
from /home/user/build/src/grimlock_kernel_asus_tegra3_unified-52800b9d40bde53830b73c34f59d16fd36d2d915/include/linux/i2c.h:31,
from /home/user/build/src/grimlock_kernel_asus_tegra3_unified-52800b9d40bde53830b73c34f59d16fd36d2d915/arch/arm/mach-tegra/board-cardhu-sensors.c:34:
/home/user/build/src/grimlock_kernel_asus_tegra3_unified-52800b9d40bde53830b73c34f59d16fd36d2d915/include/linux/kernel.h:672:45: error: bit-field '<anonymous>' width not an integer constant
#define BUILD_BUG_ON_ZERO(e) (sizeof(struct { int:-!!(e); }))
^
/home/user/build/src/grimlock_kernel_asus_tegra3_unified-52800b9d40bde53830b73c34f59d16fd36d2d915/include/linux/compiler-gcc.h:41:28: note: in expansion of macro 'BUILD_BUG_ON_ZERO'
#define __must_be_array(a) BUILD_BUG_ON_ZERO(__same_type((a), &(a)[0]))
^~~~~~~~~~~~~~~~~
/home/user/build/src/grimlock_kernel_asus_tegra3_unified-52800b9d40bde53830b73c34f59d16fd36d2d915/include/linux/kernel.h:45:59: note: in expansion of macro '__must_be_array'
#define ARRAY_SIZE(arr) (sizeof(arr) / sizeof((arr)[0]) + __must_be_array(arr))
^~~~~~~~~~~~~~~
/home/user/build/src/grimlock_kernel_asus_tegra3_unified-52800b9d40bde53830b73c34f59d16fd36d2d915/arch/arm/mach-tegra/board-cardhu-sensors.c:1074:16: note: in expansion of macro 'ARRAY_SIZE'
.gpio_count = ARRAY_SIZE(pm269_sh532u_left_gpio_pdata),
^~~~~~~~~~
In file included from /home/user/build/src/grimlock_kernel_asus_tegra3_unified-52800b9d40bde53830b73c34f59d16fd36d2d915/include/linux/cache.h:4:0,
from /home/user/build/src/grimlock_kernel_asus_tegra3_unified-52800b9d40bde53830b73c34f59d16fd36d2d915/include/linux/time.h:7,
from /home/user/build/src/grimlock_kernel_asus_tegra3_unified-52800b9d40bde53830b73c34f59d16fd36d2d915/include/linux/stat.h:60,
from /home/user/build/src/grimlock_kernel_asus_tegra3_unified-52800b9d40bde53830b73c34f59d16fd36d2d915/include/linux/module.h:10,
from /home/user/build/src/grimlock_kernel_asus_tegra3_unified-52800b9d40bde53830b73c34f59d16fd36d2d915/include/linux/i2c.h:31,
from /home/user/build/src/grimlock_kernel_asus_tegra3_unified-52800b9d40bde53830b73c34f59d16fd36d2d915/arch/arm/mach-tegra/board-cardhu-sensors.c:34:
/home/user/build/src/grimlock_kernel_asus_tegra3_unified-52800b9d40bde53830b73c34f59d16fd36d2d915/include/linux/kernel.h:45:25: warning: excess elements in struct initializer
#define ARRAY_SIZE(arr) (sizeof(arr) / sizeof((arr)[0]) + __must_be_array(arr))
^
/home/user/build/src/grimlock_kernel_asus_tegra3_unified-52800b9d40bde53830b73c34f59d16fd36d2d915/arch/arm/mach-tegra/board-cardhu-sensors.c:1074:16: note: in expansion of macro 'ARRAY_SIZE'
.gpio_count = ARRAY_SIZE(pm269_sh532u_left_gpio_pdata),
^~~~~~~~~~
/home/user/build/src/grimlock_kernel_asus_tegra3_unified-52800b9d40bde53830b73c34f59d16fd36d2d915/include/linux/kernel.h:45:25: note: (near initialization for 'pm269_sh532u_left_pdata')
#define ARRAY_SIZE(arr) (sizeof(arr) / sizeof((arr)[0]) + __must_be_array(arr))
^
/home/user/build/src/grimlock_kernel_asus_tegra3_unified-52800b9d40bde53830b73c34f59d16fd36d2d915/arch/arm/mach-tegra/board-cardhu-sensors.c:1074:16: note: in expansion of macro 'ARRAY_SIZE'
.gpio_count = ARRAY_SIZE(pm269_sh532u_left_gpio_pdata),
^~~~~~~~~~
/home/user/build/src/grimlock_kernel_asus_tegra3_unified-52800b9d40bde53830b73c34f59d16fd36d2d915/arch/arm/mach-tegra/board-cardhu-sensors.c:1075:2: error: unknown field 'gpio' specified in initializer
.gpio = pm269_sh532u_left_gpio_pdata,
^
/home/user/build/src/grimlock_kernel_asus_tegra3_unified-52800b9d40bde53830b73c34f59d16fd36d2d915/arch/arm/mach-tegra/board-cardhu-sensors.c:1075:11: warning: excess elements in struct initializer
.gpio = pm269_sh532u_left_gpio_pdata,
^~~~~~~~~~~~~~~~~~~~~~~~~~~~
/home/user/build/src/grimlock_kernel_asus_tegra3_unified-52800b9d40bde53830b73c34f59d16fd36d2d915/arch/arm/mach-tegra/board-cardhu-sensors.c:1075:11: note: (near initialization for 'pm269_sh532u_left_pdata')
/home/user/build/src/grimlock_kernel_asus_tegra3_unified-52800b9d40bde53830b73c34f59d16fd36d2d915/arch/arm/mach-tegra/board-cardhu-sensors.c:1078:30: error: array type has incomplete element type 'struct nvc_gpio_pdata'
static struct nvc_gpio_pdata pm269_sh532u_right_gpio_pdata[] = {
^~~~~~~~~~~~~~~~~~~~~~~~~~~~~
/home/user/build/src/grimlock_kernel_asus_tegra3_unified-52800b9d40bde53830b73c34f59d16fd36d2d915/arch/arm/mach-tegra/board-cardhu-sensors.c:1082:15: error: variable 'pm269_sh532u_right_pdata' has initializer but incomplete type
static struct sh532u_platform_data pm269_sh532u_right_pdata = {
^~~~~~~~~~~~~~~~~~~~
/home/user/build/src/grimlock_kernel_asus_tegra3_unified-52800b9d40bde53830b73c34f59d16fd36d2d915/arch/arm/mach-tegra/board-cardhu-sensors.c:1083:2: error: unknown field 'cfg' specified in initializer
.cfg = 0,
^
/home/user/build/src/grimlock_kernel_asus_tegra3_unified-52800b9d40bde53830b73c34f59d16fd36d2d915/arch/arm/mach-tegra/board-cardhu-sensors.c:1083:10: warning: excess elements in struct initializer
.cfg = 0,
^
/home/user/build/src/grimlock_kernel_asus_tegra3_unified-52800b9d40bde53830b73c34f59d16fd36d2d915/arch/arm/mach-tegra/board-cardhu-sensors.c:1083:10: note: (near initialization for 'pm269_sh532u_right_pdata')
/home/user/build/src/grimlock_kernel_asus_tegra3_unified-52800b9d40bde53830b73c34f59d16fd36d2d915/arch/arm/mach-tegra/board-cardhu-sensors.c:1084:2: error: unknown field 'num' specified in initializer
.num = 2,
^
/home/user/build/src/grimlock_kernel_asus_tegra3_unified-52800b9d40bde53830b73c34f59d16fd36d2d915/arch/arm/mach-tegra/board-cardhu-sensors.c:1084:10: warning: excess elements in struct initializer
.num = 2,
^
/home/user/build/src/grimlock_kernel_asus_tegra3_unified-52800b9d40bde53830b73c34f59d16fd36d2d915/arch/arm/mach-tegra/board-cardhu-sensors.c:1084:10: note: (near initialization for 'pm269_sh532u_right_pdata')
/home/user/build/src/grimlock_kernel_asus_tegra3_unified-52800b9d40bde53830b73c34f59d16fd36d2d915/arch/arm/mach-tegra/board-cardhu-sensors.c:1085:2: error: unknown field 'sync' specified in initializer
.sync = 1,
^
/home/user/build/src/grimlock_kernel_asus_tegra3_unified-52800b9d40bde53830b73c34f59d16fd36d2d915/arch/arm/mach-tegra/board-cardhu-sensors.c:1085:11: warning: excess elements in struct initializer
.sync = 1,
^
/home/user/build/src/grimlock_kernel_asus_tegra3_unified-52800b9d40bde53830b73c34f59d16fd36d2d915/arch/arm/mach-tegra/board-cardhu-sensors.c:1085:11: note: (near initialization for 'pm269_sh532u_right_pdata')
/home/user/build/src/grimlock_kernel_asus_tegra3_unified-52800b9d40bde53830b73c34f59d16fd36d2d915/arch/arm/mach-tegra/board-cardhu-sensors.c:1086:2: error: unknown field 'dev_name' specified in initializer
.dev_name = "focuser",
^
/home/user/build/src/grimlock_kernel_asus_tegra3_unified-52800b9d40bde53830b73c34f59d16fd36d2d915/arch/arm/mach-tegra/board-cardhu-sensors.c:1086:14: warning: excess elements in struct initializer
.dev_name = "focuser",
^~~~~~~~~
/home/user/build/src/grimlock_kernel_asus_tegra3_unified-52800b9d40bde53830b73c34f59d16fd36d2d915/arch/arm/mach-tegra/board-cardhu-sensors.c:1086:14: note: (near initialization for 'pm269_sh532u_right_pdata')
/home/user/build/src/grimlock_kernel_asus_tegra3_unified-52800b9d40bde53830b73c34f59d16fd36d2d915/arch/arm/mach-tegra/board-cardhu-sensors.c:1087:2: error: unknown field 'gpio_count' specified in initializer
.gpio_count = ARRAY_SIZE(pm269_sh532u_right_gpio_pdata),
^
In file included from /home/user/build/src/grimlock_kernel_asus_tegra3_unified-52800b9d40bde53830b73c34f59d16fd36d2d915/include/linux/cache.h:4:0,
from /home/user/build/src/grimlock_kernel_asus_tegra3_unified-52800b9d40bde53830b73c34f59d16fd36d2d915/include/linux/time.h:7,
from /home/user/build/src/grimlock_kernel_asus_tegra3_unified-52800b9d40bde53830b73c34f59d16fd36d2d915/include/linux/stat.h:60,
from /home/user/build/src/grimlock_kernel_asus_tegra3_unified-52800b9d40bde53830b73c34f59d16fd36d2d915/include/linux/module.h:10,
from /home/user/build/src/grimlock_kernel_asus_tegra3_unified-52800b9d40bde53830b73c34f59d16fd36d2d915/include/linux/i2c.h:31,
from /home/user/build/src/grimlock_kernel_asus_tegra3_unified-52800b9d40bde53830b73c34f59d16fd36d2d915/arch/arm/mach-tegra/board-cardhu-sensors.c:34:
/home/user/build/src/grimlock_kernel_asus_tegra3_unified-52800b9d40bde53830b73c34f59d16fd36d2d915/include/linux/kernel.h:672:45: error: bit-field '<anonymous>' width not an integer constant
#define BUILD_BUG_ON_ZERO(e) (sizeof(struct { int:-!!(e); }))
^
/home/user/build/src/grimlock_kernel_asus_tegra3_unified-52800b9d40bde53830b73c34f59d16fd36d2d915/include/linux/compiler-gcc.h:41:28: note: in expansion of macro 'BUILD_BUG_ON_ZERO'
#define __must_be_array(a) BUILD_BUG_ON_ZERO(__same_type((a), &(a)[0]))
^~~~~~~~~~~~~~~~~
/home/user/build/src/grimlock_kernel_asus_tegra3_unified-52800b9d40bde53830b73c34f59d16fd36d2d915/include/linux/kernel.h:45:59: note: in expansion of macro '__must_be_array'
#define ARRAY_SIZE(arr) (sizeof(arr) / sizeof((arr)[0]) + __must_be_array(arr))
^~~~~~~~~~~~~~~
/home/user/build/src/grimlock_kernel_asus_tegra3_unified-52800b9d40bde53830b73c34f59d16fd36d2d915/arch/arm/mach-tegra/board-cardhu-sensors.c:1087:16: note: in expansion of macro 'ARRAY_SIZE'
.gpio_count = ARRAY_SIZE(pm269_sh532u_right_gpio_pdata),
^~~~~~~~~~
In file included from /home/user/build/src/grimlock_kernel_asus_tegra3_unified-52800b9d40bde53830b73c34f59d16fd36d2d915/include/linux/cache.h:4:0,
from /home/user/build/src/grimlock_kernel_asus_tegra3_unified-52800b9d40bde53830b73c34f59d16fd36d2d915/include/linux/time.h:7,
from /home/user/build/src/grimlock_kernel_asus_tegra3_unified-52800b9d40bde53830b73c34f59d16fd36d2d915/include/linux/stat.h:60,
from /home/user/build/src/grimlock_kernel_asus_tegra3_unified-52800b9d40bde53830b73c34f59d16fd36d2d915/include/linux/module.h:10,
from /home/user/build/src/grimlock_kernel_asus_tegra3_unified-52800b9d40bde53830b73c34f59d16fd36d2d915/include/linux/i2c.h:31,
from /home/user/build/src/grimlock_kernel_asus_tegra3_unified-52800b9d40bde53830b73c34f59d16fd36d2d915/arch/arm/mach-tegra/board-cardhu-sensors.c:34:
/home/user/build/src/grimlock_kernel_asus_tegra3_unified-52800b9d40bde53830b73c34f59d16fd36d2d915/include/linux/kernel.h:45:25: warning: excess elements in struct initializer
#define ARRAY_SIZE(arr) (sizeof(arr) / sizeof((arr)[0]) + __must_be_array(arr))
^
/home/user/build/src/grimlock_kernel_asus_tegra3_unified-52800b9d40bde53830b73c34f59d16fd36d2d915/arch/arm/mach-tegra/board-cardhu-sensors.c:1087:16: note: in expansion of macro 'ARRAY_SIZE'
.gpio_count = ARRAY_SIZE(pm269_sh532u_right_gpio_pdata),
^~~~~~~~~~
/home/user/build/src/grimlock_kernel_asus_tegra3_unified-52800b9d40bde53830b73c34f59d16fd36d2d915/include/linux/kernel.h:45:25: note: (near initialization for 'pm269_sh532u_right_pdata')
#define ARRAY_SIZE(arr) (sizeof(arr) / sizeof((arr)[0]) + __must_be_array(arr))
^
/home/user/build/src/grimlock_kernel_asus_tegra3_unified-52800b9d40bde53830b73c34f59d16fd36d2d915/arch/arm/mach-tegra/board-cardhu-sensors.c:1087:16: note: in expansion of macro 'ARRAY_SIZE'
.gpio_count = ARRAY_SIZE(pm269_sh532u_right_gpio_pdata),
^~~~~~~~~~
/home/user/build/src/grimlock_kernel_asus_tegra3_unified-52800b9d40bde53830b73c34f59d16fd36d2d915/arch/arm/mach-tegra/board-cardhu-sensors.c:1088:2: error: unknown field 'gpio' specified in initializer
.gpio = pm269_sh532u_right_gpio_pdata,
^
/home/user/build/src/grimlock_kernel_asus_tegra3_unified-52800b9d40bde53830b73c34f59d16fd36d2d915/arch/arm/mach-tegra/board-cardhu-sensors.c:1088:11: warning: excess elements in struct initializer
.gpio = pm269_sh532u_right_gpio_pdata,
^~~~~~~~~~~~~~~~~~~~~~~~~~~~~
/home/user/build/src/grimlock_kernel_asus_tegra3_unified-52800b9d40bde53830b73c34f59d16fd36d2d915/arch/arm/mach-tegra/board-cardhu-sensors.c:1088:11: note: (near initialization for 'pm269_sh532u_right_pdata')
/home/user/build/src/grimlock_kernel_asus_tegra3_unified-52800b9d40bde53830b73c34f59d16fd36d2d915/arch/arm/mach-tegra/board-cardhu-sensors.c: In function 'kxtj9_init':
/home/user/build/src/grimlock_kernel_asus_tegra3_unified-52800b9d40bde53830b73c34f59d16fd36d2d915/arch/arm/mach-tegra/board-cardhu-sensors.c:1696:2: warning: ISO C90 forbids mixed declarations and code [-Wdeclaration-after-statement]
int ret = 0;
^~~
/home/user/build/src/grimlock_kernel_asus_tegra3_unified-52800b9d40bde53830b73c34f59d16fd36d2d915/arch/arm/mach-tegra/board-cardhu-sensors.c: In function 'cardhu_sensors_init':
/home/user/build/src/grimlock_kernel_asus_tegra3_unified-52800b9d40bde53830b73c34f59d16fd36d2d915/arch/arm/mach-tegra/board-cardhu-sensors.c:1737:29: error: 'cardhu_i2c_board_info_tps61050' undeclared (first use in this function)
i2c_register_board_info(2, cardhu_i2c_board_info_tps61050,
^~~~~~~~~~~~~~~~~~~~~~~~~~~~~~
In file included from /home/user/build/src/grimlock_kernel_asus_tegra3_unified-52800b9d40bde53830b73c34f59d16fd36d2d915/include/linux/cache.h:4:0,
from /home/user/build/src/grimlock_kernel_asus_tegra3_unified-52800b9d40bde53830b73c34f59d16fd36d2d915/include/linux/time.h:7,
from /home/user/build/src/grimlock_kernel_asus_tegra3_unified-52800b9d40bde53830b73c34f59d16fd36d2d915/include/linux/stat.h:60,
from /home/user/build/src/grimlock_kernel_asus_tegra3_unified-52800b9d40bde53830b73c34f59d16fd36d2d915/include/linux/module.h:10,
from /home/user/build/src/grimlock_kernel_asus_tegra3_unified-52800b9d40bde53830b73c34f59d16fd36d2d915/include/linux/i2c.h:31,
from /home/user/build/src/grimlock_kernel_asus_tegra3_unified-52800b9d40bde53830b73c34f59d16fd36d2d915/arch/arm/mach-tegra/board-cardhu-sensors.c:34:
/home/user/build/src/grimlock_kernel_asus_tegra3_unified-52800b9d40bde53830b73c34f59d16fd36d2d915/include/linux/kernel.h:672:45: error: bit-field '<anonymous>' width not an integer constant
#define BUILD_BUG_ON_ZERO(e) (sizeof(struct { int:-!!(e); }))
^
/home/user/build/src/grimlock_kernel_asus_tegra3_unified-52800b9d40bde53830b73c34f59d16fd36d2d915/include/linux/compiler-gcc.h:41:28: note: in expansion of macro 'BUILD_BUG_ON_ZERO'
#define __must_be_array(a) BUILD_BUG_ON_ZERO(__same_type((a), &(a)[0]))
^~~~~~~~~~~~~~~~~
/home/user/build/src/grimlock_kernel_asus_tegra3_unified-52800b9d40bde53830b73c34f59d16fd36d2d915/include/linux/kernel.h:45:59: note: in expansion of macro '__must_be_array'
#define ARRAY_SIZE(arr) (sizeof(arr) / sizeof((arr)[0]) + __must_be_array(arr))
^~~~~~~~~~~~~~~
/home/user/build/src/grimlock_kernel_asus_tegra3_unified-52800b9d40bde53830b73c34f59d16fd36d2d915/arch/arm/mach-tegra/board-cardhu-sensors.c:1738:3: note: in expansion of macro 'ARRAY_SIZE'
ARRAY_SIZE(cardhu_i2c_board_info_tps61050));
^~~~~~~~~~
/home/user/build/src/grimlock_kernel_asus_tegra3_unified-52800b9d40bde53830b73c34f59d16fd36d2d915/arch/arm/mach-tegra/board-cardhu-sensors.c:1746:29: error: 'cardhu_i2c_board_info_e1214' undeclared (first use in this function)
i2c_register_board_info(2, cardhu_i2c_board_info_e1214,
^~~~~~~~~~~~~~~~~~~~~~~~~~~
In file included from /home/user/build/src/grimlock_kernel_asus_tegra3_unified-52800b9d40bde53830b73c34f59d16fd36d2d915/include/linux/cache.h:4:0,
from /home/user/build/src/grimlock_kernel_asus_tegra3_unified-52800b9d40bde53830b73c34f59d16fd36d2d915/include/linux/time.h:7,
from /home/user/build/src/grimlock_kernel_asus_tegra3_unified-52800b9d40bde53830b73c34f59d16fd36d2d915/include/linux/stat.h:60,
from /home/user/build/src/grimlock_kernel_asus_tegra3_unified-52800b9d40bde53830b73c34f59d16fd36d2d915/include/linux/module.h:10,
from /home/user/build/src/grimlock_kernel_asus_tegra3_unified-52800b9d40bde53830b73c34f59d16fd36d2d915/include/linux/i2c.h:31,
from /home/user/build/src/grimlock_kernel_asus_tegra3_unified-52800b9d40bde53830b73c34f59d16fd36d2d915/arch/arm/mach-tegra/board-cardhu-sensors.c:34:
/home/user/build/src/grimlock_kernel_asus_tegra3_unified-52800b9d40bde53830b73c34f59d16fd36d2d915/include/linux/kernel.h:672:45: error: bit-field '<anonymous>' width not an integer constant
#define BUILD_BUG_ON_ZERO(e) (sizeof(struct { int:-!!(e); }))
^
/home/user/build/src/grimlock_kernel_asus_tegra3_unified-52800b9d40bde53830b73c34f59d16fd36d2d915/include/linux/compiler-gcc.h:41:28: note: in expansion of macro 'BUILD_BUG_ON_ZERO'
#define __must_be_array(a) BUILD_BUG_ON_ZERO(__same_type((a), &(a)[0]))
^~~~~~~~~~~~~~~~~
/home/user/build/src/grimlock_kernel_asus_tegra3_unified-52800b9d40bde53830b73c34f59d16fd36d2d915/include/linux/kernel.h:45:59: note: in expansion of macro '__must_be_array'
#define ARRAY_SIZE(arr) (sizeof(arr) / sizeof((arr)[0]) + __must_be_array(arr))
^~~~~~~~~~~~~~~
/home/user/build/src/grimlock_kernel_asus_tegra3_unified-52800b9d40bde53830b73c34f59d16fd36d2d915/arch/arm/mach-tegra/board-cardhu-sensors.c:1747:3: note: in expansion of macro 'ARRAY_SIZE'
ARRAY_SIZE(cardhu_i2c_board_info_e1214));
^~~~~~~~~~
/home/user/build/src/grimlock_kernel_asus_tegra3_unified-52800b9d40bde53830b73c34f59d16fd36d2d915/arch/arm/mach-tegra/board-cardhu-sensors.c:1753:6: error: 'cardhu_i2c6_board_info' undeclared (first use in this function)
cardhu_i2c6_board_info,
^~~~~~~~~~~~~~~~~~~~~~
In file included from /home/user/build/src/grimlock_kernel_asus_tegra3_unified-52800b9d40bde53830b73c34f59d16fd36d2d915/include/linux/cache.h:4:0,
from /home/user/build/src/grimlock_kernel_asus_tegra3_unified-52800b9d40bde53830b73c34f59d16fd36d2d915/include/linux/time.h:7,
from /home/user/build/src/grimlock_kernel_asus_tegra3_unified-52800b9d40bde53830b73c34f59d16fd36d2d915/include/linux/stat.h:60,
from /home/user/build/src/grimlock_kernel_asus_tegra3_unified-52800b9d40bde53830b73c34f59d16fd36d2d915/include/linux/module.h:10,
from /home/user/build/src/grimlock_kernel_asus_tegra3_unified-52800b9d40bde53830b73c34f59d16fd36d2d915/include/linux/i2c.h:31,
from /home/user/build/src/grimlock_kernel_asus_tegra3_unified-52800b9d40bde53830b73c34f59d16fd36d2d915/arch/arm/mach-tegra/board-cardhu-sensors.c:34:
/home/user/build/src/grimlock_kernel_asus_tegra3_unified-52800b9d40bde53830b73c34f59d16fd36d2d915/include/linux/kernel.h:672:45: error: bit-field '<anonymous>' width not an integer constant
#define BUILD_BUG_ON_ZERO(e) (sizeof(struct { int:-!!(e); }))
^
/home/user/build/src/grimlock_kernel_asus_tegra3_unified-52800b9d40bde53830b73c34f59d16fd36d2d915/include/linux/compiler-gcc.h:41:28: note: in expansion of macro 'BUILD_BUG_ON_ZERO'
#define __must_be_array(a) BUILD_BUG_ON_ZERO(__same_type((a), &(a)[0]))
^~~~~~~~~~~~~~~~~
/home/user/build/src/grimlock_kernel_asus_tegra3_unified-52800b9d40bde53830b73c34f59d16fd36d2d915/include/linux/kernel.h:45:59: note: in expansion of macro '__must_be_array'
#define ARRAY_SIZE(arr) (sizeof(arr) / sizeof((arr)[0]) + __must_be_array(arr))
^~~~~~~~~~~~~~~
/home/user/build/src/grimlock_kernel_asus_tegra3_unified-52800b9d40bde53830b73c34f59d16fd36d2d915/arch/arm/mach-tegra/board-cardhu-sensors.c:1754:6: note: in expansion of macro 'ARRAY_SIZE'
ARRAY_SIZE(cardhu_i2c6_board_info));
^~~~~~~~~~
/home/user/build/src/grimlock_kernel_asus_tegra3_unified-52800b9d40bde53830b73c34f59d16fd36d2d915/arch/arm/mach-tegra/board-cardhu-sensors.c:1757:6: error: 'cardhu_i2c7_board_info' undeclared (first use in this function)
cardhu_i2c7_board_info,
^~~~~~~~~~~~~~~~~~~~~~
In file included from /home/user/build/src/grimlock_kernel_asus_tegra3_unified-52800b9d40bde53830b73c34f59d16fd36d2d915/include/linux/cache.h:4:0,
from /home/user/build/src/grimlock_kernel_asus_tegra3_unified-52800b9d40bde53830b73c34f59d16fd36d2d915/include/linux/time.h:7,
from /home/user/build/src/grimlock_kernel_asus_tegra3_unified-52800b9d40bde53830b73c34f59d16fd36d2d915/include/linux/stat.h:60,
from /home/user/build/src/grimlock_kernel_asus_tegra3_unified-52800b9d40bde53830b73c34f59d16fd36d2d915/include/linux/module.h:10,
from /home/user/build/src/grimlock_kernel_asus_tegra3_unified-52800b9d40bde53830b73c34f59d16fd36d2d915/include/linux/i2c.h:31,
from /home/user/build/src/grimlock_kernel_asus_tegra3_unified-52800b9d40bde53830b73c34f59d16fd36d2d915/arch/arm/mach-tegra/board-cardhu-sensors.c:34:
/home/user/build/src/grimlock_kernel_asus_tegra3_unified-52800b9d40bde53830b73c34f59d16fd36d2d915/include/linux/kernel.h:672:45: error: bit-field '<anonymous>' width not an integer constant
#define BUILD_BUG_ON_ZERO(e) (sizeof(struct { int:-!!(e); }))
^
/home/user/build/src/grimlock_kernel_asus_tegra3_unified-52800b9d40bde53830b73c34f59d16fd36d2d915/include/linux/compiler-gcc.h:41:28: note: in expansion of macro 'BUILD_BUG_ON_ZERO'
#define __must_be_array(a) BUILD_BUG_ON_ZERO(__same_type((a), &(a)[0]))
^~~~~~~~~~~~~~~~~
/home/user/build/src/grimlock_kernel_asus_tegra3_unified-52800b9d40bde53830b73c34f59d16fd36d2d915/include/linux/kernel.h:45:59: note: in expansion of macro '__must_be_array'
#define ARRAY_SIZE(arr) (sizeof(arr) / sizeof((arr)[0]) + __must_be_array(arr))
^~~~~~~~~~~~~~~
/home/user/build/src/grimlock_kernel_asus_tegra3_unified-52800b9d40bde53830b73c34f59d16fd36d2d915/arch/arm/mach-tegra/board-cardhu-sensors.c:1758:6: note: in expansion of macro 'ARRAY_SIZE'
ARRAY_SIZE(cardhu_i2c7_board_info));
^~~~~~~~~~
/home/user/build/src/grimlock_kernel_asus_tegra3_unified-52800b9d40bde53830b73c34f59d16fd36d2d915/arch/arm/mach-tegra/board-cardhu-sensors.c:1761:6: error: 'pm269_i2c6_board_info' undeclared (first use in this function)
pm269_i2c6_board_info,
^~~~~~~~~~~~~~~~~~~~~
In file included from /home/user/build/src/grimlock_kernel_asus_tegra3_unified-52800b9d40bde53830b73c34f59d16fd36d2d915/include/linux/cache.h:4:0,
from /home/user/build/src/grimlock_kernel_asus_tegra3_unified-52800b9d40bde53830b73c34f59d16fd36d2d915/include/linux/time.h:7,
from /home/user/build/src/grimlock_kernel_asus_tegra3_unified-52800b9d40bde53830b73c34f59d16fd36d2d915/include/linux/stat.h:60,
from /home/user/build/src/grimlock_kernel_asus_tegra3_unified-52800b9d40bde53830b73c34f59d16fd36d2d915/include/linux/module.h:10,
from /home/user/build/src/grimlock_kernel_asus_tegra3_unified-52800b9d40bde53830b73c34f59d16fd36d2d915/include/linux/i2c.h:31,
from /home/user/build/src/grimlock_kernel_asus_tegra3_unified-52800b9d40bde53830b73c34f59d16fd36d2d915/arch/arm/mach-tegra/board-cardhu-sensors.c:34:
/home/user/build/src/grimlock_kernel_asus_tegra3_unified-52800b9d40bde53830b73c34f59d16fd36d2d915/include/linux/kernel.h:672:45: error: bit-field '<anonymous>' width not an integer constant
#define BUILD_BUG_ON_ZERO(e) (sizeof(struct { int:-!!(e); }))
^
/home/user/build/src/grimlock_kernel_asus_tegra3_unified-52800b9d40bde53830b73c34f59d16fd36d2d915/include/linux/compiler-gcc.h:41:28: note: in expansion of macro 'BUILD_BUG_ON_ZERO'
#define __must_be_array(a) BUILD_BUG_ON_ZERO(__same_type((a), &(a)[0]))
^~~~~~~~~~~~~~~~~
/home/user/build/src/grimlock_kernel_asus_tegra3_unified-52800b9d40bde53830b73c34f59d16fd36d2d915/include/linux/kernel.h:45:59: note: in expansion of macro '__must_be_array'
#define ARRAY_SIZE(arr) (sizeof(arr) / sizeof((arr)[0]) + __must_be_array(arr))
^~~~~~~~~~~~~~~
/home/user/build/src/grimlock_kernel_asus_tegra3_unified-52800b9d40bde53830b73c34f59d16fd36d2d915/arch/arm/mach-tegra/board-cardhu-sensors.c:1762:6: note: in expansion of macro 'ARRAY_SIZE'
ARRAY_SIZE(pm269_i2c6_board_info));
^~~~~~~~~~
/home/user/build/src/grimlock_kernel_asus_tegra3_unified-52800b9d40bde53830b73c34f59d16fd36d2d915/arch/arm/mach-tegra/board-cardhu-sensors.c:1765:6: error: 'pm269_i2c7_board_info' undeclared (first use in this function)
pm269_i2c7_board_info,
^~~~~~~~~~~~~~~~~~~~~
In file included from /home/user/build/src/grimlock_kernel_asus_tegra3_unified-52800b9d40bde53830b73c34f59d16fd36d2d915/include/linux/cache.h:4:0,
from /home/user/build/src/grimlock_kernel_asus_tegra3_unified-52800b9d40bde53830b73c34f59d16fd36d2d915/include/linux/time.h:7,
from /home/user/build/src/grimlock_kernel_asus_tegra3_unified-52800b9d40bde53830b73c34f59d16fd36d2d915/include/linux/stat.h:60,
from /home/user/build/src/grimlock_kernel_asus_tegra3_unified-52800b9d40bde53830b73c34f59d16fd36d2d915/include/linux/module.h:10,
from /home/user/build/src/grimlock_kernel_asus_tegra3_unified-52800b9d40bde53830b73c34f59d16fd36d2d915/include/linux/i2c.h:31,
from /home/user/build/src/grimlock_kernel_asus_tegra3_unified-52800b9d40bde53830b73c34f59d16fd36d2d915/arch/arm/mach-tegra/board-cardhu-sensors.c:34:
/home/user/build/src/grimlock_kernel_asus_tegra3_unified-52800b9d40bde53830b73c34f59d16fd36d2d915/include/linux/kernel.h:672:45: error: bit-field '<anonymous>' width not an integer constant
#define BUILD_BUG_ON_ZERO(e) (sizeof(struct { int:-!!(e); }))
^
/home/user/build/src/grimlock_kernel_asus_tegra3_unified-52800b9d40bde53830b73c34f59d16fd36d2d915/include/linux/compiler-gcc.h:41:28: note: in expansion of macro 'BUILD_BUG_ON_ZERO'
#define __must_be_array(a) BUILD_BUG_ON_ZERO(__same_type((a), &(a)[0]))
^~~~~~~~~~~~~~~~~
/home/user/build/src/grimlock_kernel_asus_tegra3_unified-52800b9d40bde53830b73c34f59d16fd36d2d915/include/linux/kernel.h:45:59: note: in expansion of macro '__must_be_array'
#define ARRAY_SIZE(arr) (sizeof(arr) / sizeof((arr)[0]) + __must_be_array(arr))
^~~~~~~~~~~~~~~
/home/user/build/src/grimlock_kernel_asus_tegra3_unified-52800b9d40bde53830b73c34f59d16fd36d2d915/arch/arm/mach-tegra/board-cardhu-sensors.c:1766:6: note: in expansion of macro 'ARRAY_SIZE'
ARRAY_SIZE(pm269_i2c7_board_info));
^~~~~~~~~~
/home/user/build/src/grimlock_kernel_asus_tegra3_unified-52800b9d40bde53830b73c34f59d16fd36d2d915/arch/arm/mach-tegra/board-cardhu-sensors.c: At top level:
/home/user/build/src/grimlock_kernel_asus_tegra3_unified-52800b9d40bde53830b73c34f59d16fd36d2d915/arch/arm/mach-tegra/board-cardhu-sensors.c:1030:29: error: storage size of 'cardhu_ov5640_data' isn't known
struct ov5640_platform_data cardhu_ov5640_data = {
^~~~~~~~~~~~~~~~~~
/home/user/build/src/grimlock_kernel_asus_tegra3_unified-52800b9d40bde53830b73c34f59d16fd36d2d915/arch/arm/mach-tegra/board-cardhu-sensors.c:1047:36: error: storage size of 'sh532u_left_pdata' isn't known
static struct sh532u_platform_data sh532u_left_pdata = {
^~~~~~~~~~~~~~~~~
/home/user/build/src/grimlock_kernel_asus_tegra3_unified-52800b9d40bde53830b73c34f59d16fd36d2d915/arch/arm/mach-tegra/board-cardhu-sensors.c:1056:36: error: storage size of 'sh532u_right_pdata' isn't known
static struct sh532u_platform_data sh532u_right_pdata = {
^~~~~~~~~~~~~~~~~~
/home/user/build/src/grimlock_kernel_asus_tegra3_unified-52800b9d40bde53830b73c34f59d16fd36d2d915/arch/arm/mach-tegra/board-cardhu-sensors.c:1069:36: error: storage size of 'pm269_sh532u_left_pdata' isn't known
static struct sh532u_platform_data pm269_sh532u_left_pdata = {
^~~~~~~~~~~~~~~~~~~~~~~
/home/user/build/src/grimlock_kernel_asus_tegra3_unified-52800b9d40bde53830b73c34f59d16fd36d2d915/arch/arm/mach-tegra/board-cardhu-sensors.c:1082:36: error: storage size of 'pm269_sh532u_right_pdata' isn't known
static struct sh532u_platform_data pm269_sh532u_right_pdata = {
^~~~~~~~~~~~~~~~~~~~~~~~
/home/user/build/src/grimlock_kernel_asus_tegra3_unified-52800b9d40bde53830b73c34f59d16fd36d2d915/arch/arm/mach-tegra/board-cardhu-sensors.c:1096:38: warning: 'cardhu_tps61050_pdata' defined but not used [-Wunused-variable]
static struct tps61050_platform_data cardhu_tps61050_pdata = {
^~~~~~~~~~~~~~~~~~~~~
/home/user/build/src/grimlock_kernel_asus_tegra3_unified-52800b9d40bde53830b73c34f59d16fd36d2d915/arch/arm/mach-tegra/board-cardhu-sensors.c:1082:36: warning: 'pm269_sh532u_right_pdata' defined but not used [-Wunused-variable]
static struct sh532u_platform_data pm269_sh532u_right_pdata = {
^~~~~~~~~~~~~~~~~~~~~~~~
/home/user/build/src/grimlock_kernel_asus_tegra3_unified-52800b9d40bde53830b73c34f59d16fd36d2d915/arch/arm/mach-tegra/board-cardhu-sensors.c:1078:30: warning: 'pm269_sh532u_right_gpio_pdata' defined but not used [-Wunused-variable]
static struct nvc_gpio_pdata pm269_sh532u_right_gpio_pdata[] = {
^~~~~~~~~~~~~~~~~~~~~~~~~~~~~
/home/user/build/src/grimlock_kernel_asus_tegra3_unified-52800b9d40bde53830b73c34f59d16fd36d2d915/arch/arm/mach-tegra/board-cardhu-sensors.c:1069:36: warning: 'pm269_sh532u_left_pdata' defined but not used [-Wunused-variable]
static struct sh532u_platform_data pm269_sh532u_left_pdata = {
^~~~~~~~~~~~~~~~~~~~~~~
/home/user/build/src/grimlock_kernel_asus_tegra3_unified-52800b9d40bde53830b73c34f59d16fd36d2d915/arch/arm/mach-tegra/board-cardhu-sensors.c:1065:30: warning: 'pm269_sh532u_left_gpio_pdata' defined but not used [-Wunused-variable]
static struct nvc_gpio_pdata pm269_sh532u_left_gpio_pdata[] = {
^~~~~~~~~~~~~~~~~~~~~~~~~~~~
/home/user/build/src/grimlock_kernel_asus_tegra3_unified-52800b9d40bde53830b73c34f59d16fd36d2d915/arch/arm/mach-tegra/board-cardhu-sensors.c:1056:36: warning: 'sh532u_right_pdata' defined but not used [-Wunused-variable]
static struct sh532u_platform_data sh532u_right_pdata = {
^~~~~~~~~~~~~~~~~~
/home/user/build/src/grimlock_kernel_asus_tegra3_unified-52800b9d40bde53830b73c34f59d16fd36d2d915/arch/arm/mach-tegra/board-cardhu-sensors.c:1047:36: warning: 'sh532u_left_pdata' defined but not used [-Wunused-variable]
static struct sh532u_platform_data sh532u_left_pdata = {
^~~~~~~~~~~~~~~~~
/home/user/build/src/grimlock_kernel_asus_tegra3_unified-52800b9d40bde53830b73c34f59d16fd36d2d915/arch/arm/mach-tegra/board-cardhu-sensors.c:1043:30: warning: 'sh532u_gpio_pdata' defined but not used [-Wunused-variable]
static struct nvc_gpio_pdata sh532u_gpio_pdata[] = {
^~~~~~~~~~~~~~~~~
/home/user/build/src/grimlock_kernel_asus_tegra3_unified-52800b9d40bde53830b73c34f59d16fd36d2d915/arch/arm/mach-tegra/board-cardhu-sensors.c:98:13: warning: 'camera_busy' defined but not used [-Wunused-variable]
static bool camera_busy = false;
^~~~~~~~~~~
/home/user/build/src/grimlock_kernel_asus_tegra3_unified-52800b9d40bde53830b73c34f59d16fd36d2d915/arch/arm/mach-tegra/board-cardhu-sensors.c:97:26: warning: 'reg_cardhu_vddio_cam' defined but not used [-Wunused-variable]
static struct regulator *reg_cardhu_vddio_cam; /* LDO5 It's only for ME301T */
^~~~~~~~~~~~~~~~~~~~
/home/user/build/src/grimlock_kernel_asus_tegra3_unified-52800b9d40bde53830b73c34f59d16fd36d2d915/arch/arm/mach-tegra/board-cardhu-sensors.c:96:26: warning: 'reg_cardhu_vdda_en' defined but not used [-Wunused-variable]
static struct regulator *reg_cardhu_vdda_en; /* ICATCH7002A_VDDA_EN_GPIO GPIO_PR6*/
^~~~~~~~~~~~~~~~~~
/home/user/build/src/grimlock_kernel_asus_tegra3_unified-52800b9d40bde53830b73c34f59d16fd36d2d915/arch/arm/mach-tegra/board-cardhu-sensors.c:95:26: warning: 'reg_cardhu_af_pwr_en' defined but not used [-Wunused-variable]
static struct regulator *reg_cardhu_af_pwr_en; /* ICATCH7002A_AF_PWR_EN_GPIO PS0 */
^~~~~~~~~~~~~~~~~~~~
/home/user/build/src/grimlock_kernel_asus_tegra3_unified-52800b9d40bde53830b73c34f59d16fd36d2d915/arch/arm/mach-tegra/board-cardhu-sensors.c:94:26: warning: 'reg_cardhu_1v2_cam' defined but not used [-Wunused-variable]
static struct regulator *reg_cardhu_1v2_cam; /* VDDIO_CAM 1.2V PS0 */
^~~~~~~~~~~~~~~~~~
/home/user/build/src/grimlock_kernel_asus_tegra3_unified-52800b9d40bde53830b73c34f59d16fd36d2d915/arch/arm/mach-tegra/board-cardhu-sensors.c:93:26: warning: 'reg_cardhu_2v85_cam' defined but not used [-Wunused-variable]
static struct regulator *reg_cardhu_2v85_cam; /* Front Camera 2.85V power */
^~~~~~~~~~~~~~~~~~~
/home/user/build/src/grimlock_kernel_asus_tegra3_unified-52800b9d40bde53830b73c34f59d16fd36d2d915/arch/arm/mach-tegra/board-cardhu-sensors.c:92:26: warning: 'reg_cardhu_1v8_cam' defined but not used [-Wunused-variable]
static struct regulator *reg_cardhu_1v8_cam; /* VDDIO_CAM 1.8V PBB4 */
^~~~~~~~~~~~~~~~~~
/home/user/build/src/grimlock_kernel_asus_tegra3_unified-52800b9d40bde53830b73c34f59d16fd36d2d915/arch/arm/mach-tegra/board-cardhu-sensors.c:91:26: warning: 'reg_cardhu_cam' defined but not used [-Wunused-variable]
static struct regulator *reg_cardhu_cam; /* LDO6 */
^~~~~~~~~~~~~~
CC fs/namespace.o
make[3]: *** [/home/user/build/src/grimlock_kernel_asus_tegra3_unified-52800b9d40bde53830b73c34f59d16fd36d2d915/scripts/Makefile.build:305: arch/arm/mach-tegra/board-cardhu-sensors.o] Error 1
make[3]: *** Waiting for unfinished jobs....
CC fs/seq_file.o
/home/user/build/src/grimlock_kernel_asus_tegra3_unified-52800b9d40bde53830b73c34f59d16fd36d2d915/arch/arm/mach-tegra/board-cardhu-memory.c:4949:37: warning: 'cardhu_emc_tables_edb8132b2ma' defined but not used [-Wunused-const-variable=]
static const struct tegra_emc_table cardhu_emc_tables_edb8132b2ma[] = {
^~~~~~~~~~~~~~~~~~~~~~~~~~~~~
/home/user/build/src/grimlock_kernel_asus_tegra3_unified-52800b9d40bde53830b73c34f59d16fd36d2d915/arch/arm/mach-tegra/board-cardhu-memory.c:3986:37: warning: 'cardhu_emc_tables_k4p8g304eb' defined but not used [-Wunused-const-variable=]
static const struct tegra_emc_table cardhu_emc_tables_k4p8g304eb[] = {
^~~~~~~~~~~~~~~~~~~~~~~~~~~~
make[2]: *** [/home/user/build/src/grimlock_kernel_asus_tegra3_unified-52800b9d40bde53830b73c34f59d16fd36d2d915/Makefile:944: arch/arm/mach-tegra] Error 2
CC fs/xattr.o
CC mm/madvise.o
CC fs/libfs.o
CC mm/memory.o
CC fs/fs-writeback.o
CC fs/pnode.o
CC fs/drop_caches.o
CC fs/splice.o
CC fs/sync.o
CC mm/mincore.o
CC fs/utimes.o
CC fs/stack.o
CC fs/fs_struct.o
CC fs/statfs.o
CC mm/mlock.o
CC fs/buffer.o
CC fs/bio.o
CC fs/block_dev.o
CC mm/mmap.o
CC fs/direct-io.o
CC fs/mpage.o
CC fs/ioprio.o
CC mm/mprotect.o
CC fs/debugfs/inode.o
CC fs/cifs/cifsfs.o
CC fs/devpts/inode.o
CC mm/mremap.o
CC fs/debugfs/file.o
LD fs/devpts/devpts.o
LD fs/devpts/built-in.o
CC fs/ext2/balloc.o
CC mm/msync.o
CC fs/cifs/cifssmb.o
LD fs/debugfs/debugfs.o
LD fs/debugfs/built-in.o
CC fs/ext3/balloc.o
CC mm/rmap.o
CC fs/ext2/dir.o
CC fs/ext2/file.o
In file included from /home/user/build/src/grimlock_kernel_asus_tegra3_unified-52800b9d40bde53830b73c34f59d16fd36d2d915/include/linux/stddef.h:4:0,
from /home/user/build/src/grimlock_kernel_asus_tegra3_unified-52800b9d40bde53830b73c34f59d16fd36d2d915/include/linux/posix_types.h:4,
from /home/user/build/src/grimlock_kernel_asus_tegra3_unified-52800b9d40bde53830b73c34f59d16fd36d2d915/include/linux/types.h:17,
from /home/user/build/src/grimlock_kernel_asus_tegra3_unified-52800b9d40bde53830b73c34f59d16fd36d2d915/include/linux/thread_info.h:10,
from /home/user/build/src/grimlock_kernel_asus_tegra3_unified-52800b9d40bde53830b73c34f59d16fd36d2d915/include/linux/preempt.h:9,
from /home/user/build/src/grimlock_kernel_asus_tegra3_unified-52800b9d40bde53830b73c34f59d16fd36d2d915/include/linux/spinlock.h:50,
from /home/user/build/src/grimlock_kernel_asus_tegra3_unified-52800b9d40bde53830b73c34f59d16fd36d2d915/include/linux/mmzone.h:7,
from /home/user/build/src/grimlock_kernel_asus_tegra3_unified-52800b9d40bde53830b73c34f59d16fd36d2d915/include/linux/gfp.h:4,
from /home/user/build/src/grimlock_kernel_asus_tegra3_unified-52800b9d40bde53830b73c34f59d16fd36d2d915/include/linux/mm.h:8,
from /home/user/build/src/grimlock_kernel_asus_tegra3_unified-52800b9d40bde53830b73c34f59d16fd36d2d915/mm/rmap.c:45:
/home/user/build/src/grimlock_kernel_asus_tegra3_unified-52800b9d40bde53830b73c34f59d16fd36d2d915/mm/rmap.c:530:15: warning: 'is_vm_hugetlb_page' is static but used in inline function 'vma_address' which is not static
if (unlikely(is_vm_hugetlb_page(vma)))
^
/home/user/build/src/grimlock_kernel_asus_tegra3_unified-52800b9d40bde53830b73c34f59d16fd36d2d915/include/linux/compiler.h:147:42: note: in definition of macro 'unlikely'
# define unlikely(x) __builtin_expect(!!(x), 0)
^
CC fs/ext3/bitmap.o
CC mm/vmalloc.o
CC fs/ext2/ialloc.o
CC fs/ext3/dir.o
CC fs/ext2/inode.o
CC fs/ext3/file.o
CC fs/ext3/fsync.o
CC mm/pagewalk.o
CC mm/pgtable-generic.o
CC fs/ext2/ioctl.o
CC fs/ext3/ialloc.o
CC fs/cifs/cifs_debug.o
CC fs/ext2/namei.o
CC mm/init-mm.o
CC mm/bootmem.o
CC fs/ext3/inode.o
CC fs/ext2/super.o
CC fs/cifs/connect.o
CC mm/memblock.o
CC mm/bounce.o
CC fs/ext2/symlink.o
CC fs/ext2/xattr.o
CC mm/page_io.o
CC fs/ext3/ioctl.o
CC fs/ext2/xattr_user.o
CC mm/swap_state.o
CC fs/ext2/xattr_trusted.o
CC fs/ext3/namei.o
CC fs/ext2/acl.o
CC fs/cifs/dir.o
CC mm/swapfile.o
CC fs/ext2/xattr_security.o
LD fs/ext2/ext2.o
LD fs/ext2/built-in.o
CC fs/cifs/file.o
CC fs/ext4/balloc.o
CC fs/ext3/super.o
CC mm/thrash.o
CC fs/ext4/bitmap.o
CC mm/dmapool.o
CC fs/ext4/dir.o
CC mm/ashmem.o
CC fs/cifs/inode.o
CC fs/ext4/file.o
CC mm/ksm.o
CC fs/ext4/fsync.o
CC fs/ext3/symlink.o
CC fs/ext4/ialloc.o
CC fs/cifs/link.o
CC mm/slab.o
CC fs/ext3/hash.o
CC fs/ext3/resize.o
CC fs/cifs/misc.o
CC fs/ext4/inode.o
CC mm/memcontrol.o
CC fs/ext3/ext3_jbd.o
CC fs/cifs/netmisc.o
CC fs/ext3/xattr.o
/home/user/build/src/grimlock_kernel_asus_tegra3_unified-52800b9d40bde53830b73c34f59d16fd36d2d915/fs/cifs/netmisc.c:133:40: warning: 'mapping_table_ERRHRD' defined but not used [-Wunused-const-variable=]
static const struct smb_to_posix_error mapping_table_ERRHRD[] = {
^~~~~~~~~~~~~~~~~~~~
CC fs/cifs/smbencrypt.o
CC fs/ext3/xattr_user.o
CC fs/cifs/transport.o
CC fs/ext3/xattr_trusted.o
CC fs/ext4/page-io.o
CC fs/ext3/acl.o
CC mm/page_cgroup.o
CC fs/cifs/asn1.o
CC fs/ext4/ioctl.o
CC fs/ext3/xattr_security.o
CC mm/vmpressure.o
LD fs/ext3/ext3.o
LD fs/ext3/built-in.o
CC fs/f2fs/dir.o
LD mm/built-in.o
CC fs/ext4/namei.o
CC fs/cifs/cifs_unicode.o
CC fs/f2fs/file.o
CC fs/f2fs/inode.o
CC fs/cifs/nterr.o
CC fs/cifs/xattr.o
CC fs/f2fs/namei.o
CC fs/f2fs/hash.o
CC fs/ext4/super.o
CC fs/f2fs/super.o
/home/user/build/src/grimlock_kernel_asus_tegra3_unified-52800b9d40bde53830b73c34f59d16fd36d2d915/fs/cifs/xattr.c:39:0: warning: "XATTR_TRUSTED_PREFIX_LEN" redefined
#define XATTR_TRUSTED_PREFIX_LEN 8
In file included from /home/user/build/src/grimlock_kernel_asus_tegra3_unified-52800b9d40bde53830b73c34f59d16fd36d2d915/include/linux/security.h:39:0,
from /home/user/build/src/grimlock_kernel_asus_tegra3_unified-52800b9d40bde53830b73c34f59d16fd36d2d915/include/net/sock.h:54,
from /home/user/build/src/grimlock_kernel_asus_tegra3_unified-52800b9d40bde53830b73c34f59d16fd36d2d915/fs/cifs/cifspdu.h:25,
from /home/user/build/src/grimlock_kernel_asus_tegra3_unified-52800b9d40bde53830b73c34f59d16fd36d2d915/fs/cifs/xattr.c:26:
/home/user/build/src/grimlock_kernel_asus_tegra3_unified-52800b9d40bde53830b73c34f59d16fd36d2d915/include/linux/xattr.h:27:0: note: this is the location of the previous definition
#define XATTR_TRUSTED_PREFIX_LEN (sizeof (XATTR_TRUSTED_PREFIX) - 1)
/home/user/build/src/grimlock_kernel_asus_tegra3_unified-52800b9d40bde53830b73c34f59d16fd36d2d915/fs/cifs/xattr.c:40:0: warning: "XATTR_SECURITY_PREFIX_LEN" redefined
#define XATTR_SECURITY_PREFIX_LEN 9
In file included from /home/user/build/src/grimlock_kernel_asus_tegra3_unified-52800b9d40bde53830b73c34f59d16fd36d2d915/include/linux/security.h:39:0,
from /home/user/build/src/grimlock_kernel_asus_tegra3_unified-52800b9d40bde53830b73c34f59d16fd36d2d915/include/net/sock.h:54,
from /home/user/build/src/grimlock_kernel_asus_tegra3_unified-52800b9d40bde53830b73c34f59d16fd36d2d915/fs/cifs/cifspdu.h:25,
from /home/user/build/src/grimlock_kernel_asus_tegra3_unified-52800b9d40bde53830b73c34f59d16fd36d2d915/fs/cifs/xattr.c:26:
/home/user/build/src/grimlock_kernel_asus_tegra3_unified-52800b9d40bde53830b73c34f59d16fd36d2d915/include/linux/xattr.h:21:0: note: this is the location of the previous definition
#define XATTR_SECURITY_PREFIX_LEN (sizeof (XATTR_SECURITY_PREFIX) - 1)
CC fs/cifs/cifsencrypt.o
CC fs/f2fs/checkpoint.o
CC fs/cifs/readdir.o
CC fs/f2fs/gc.o
CC fs/f2fs/data.o
CC fs/cifs/ioctl.o
CC fs/f2fs/node.o
CC fs/cifs/sess.o
CC fs/f2fs/segment.o
CC fs/f2fs/recovery.o
CC fs/cifs/export.o
LD fs/cifs/cifs.o
LD fs/cifs/built-in.o
CC fs/fat/cache.o
CC fs/f2fs/debug.o
CC fs/f2fs/xattr.o
CC fs/fat/dir.o
CC fs/ext4/symlink.o
CC fs/f2fs/acl.o
CC fs/ext4/hash.o
CC fs/ext4/resize.o
LD fs/f2fs/f2fs.o
LD fs/f2fs/built-in.o
CC fs/fuse/dev.o
CC fs/ext4/extents.o
CC fs/fat/fatent.o
CC fs/ext4/ext4_jbd2.o
CC fs/fat/file.o
CC fs/ext4/migrate.o
CC fs/fuse/dir.o
CC fs/fat/inode.o
CC fs/ext4/mballoc.o
CC fs/fuse/file.o
CC fs/ext4/block_validity.o
CC fs/fat/misc.o
CC fs/ext4/move_extent.o
CC fs/fat/namei_vfat.o
CC fs/fuse/inode.o
CC fs/ext4/mmp.o
LD fs/fat/fat.o
LD fs/fat/vfat.o
LD fs/fat/built-in.o
CC fs/jbd/transaction.o
CC fs/ext4/indirect.o
CC fs/fuse/control.o
LD fs/fuse/fuse.o
LD fs/fuse/built-in.o
CC fs/jbd2/transaction.o
CC fs/ext4/xattr.o
CC fs/jbd/commit.o
CC fs/ext4/xattr_user.o
CC fs/jbd2/commit.o
CC fs/ext4/xattr_trusted.o
CC fs/ext4/acl.o
CC fs/jbd/recovery.o
CC fs/ext4/xattr_security.o
CC fs/jbd/checkpoint.o
CC fs/jbd/revoke.o
CC fs/jbd2/recovery.o
LD fs/ext4/ext4.o
LD fs/ext4/built-in.o
CC fs/lockd/clntlock.o
CC fs/jbd/journal.o
CC fs/lockd/clntproc.o
CC fs/jbd2/checkpoint.o
CC fs/lockd/clntxdr.o
CC fs/jbd2/revoke.o
CC fs/lockd/host.o
CC fs/lockd/svc.o
LD fs/jbd/jbd.o
LD fs/jbd/built-in.o
CC fs/nfs/client.o
CC fs/jbd2/journal.o
CC fs/lockd/svclock.o
CC fs/lockd/svcshare.o
CC fs/nfs/dir.o
CC fs/lockd/svcproc.o
CC fs/lockd/svcsubs.o
LD fs/jbd2/jbd2.o
LD fs/jbd2/built-in.o
LD fs/nfs_common/built-in.o
CC fs/nls/nls_base.o
CC fs/lockd/mon.o
CC fs/lockd/xdr.o
CC fs/nls/nls_cp437.o
CC fs/nls/nls_iso8859-1.o
CC fs/nfs/file.o
LD fs/nls/built-in.o
CC fs/notify/fsnotify.o
CC fs/lockd/grace.o
CC fs/notify/notification.o
CC fs/notify/group.o
LD fs/lockd/lockd.o
LD fs/lockd/built-in.o
CC fs/ntfs/aops.o
CC fs/notify/inode_mark.o
CC fs/notify/mark.o
CC fs/nfs/getroot.o
CC fs/notify/vfsmount_mark.o
LD fs/notify/dnotify/built-in.o
LD fs/notify/fanotify/built-in.o
CC fs/partitions/check.o
CC fs/ntfs/attrib.o
CC fs/partitions/msdos.o
CC fs/nfs/inode.o
CC fs/notify/inotify/inotify_fsnotify.o
CC fs/notify/inotify/inotify_user.o
CC fs/partitions/efi.o
CC fs/ntfs/collate.o
CC fs/ntfs/compress.o
LD fs/notify/inotify/built-in.o
LD fs/notify/built-in.o
CC fs/proc/mmu.o
LD fs/partitions/built-in.o
LD fs/quota/built-in.o
CC fs/ramfs/inode.o
CC fs/nfs/super.o
CC fs/proc/task_mmu.o
CC fs/ramfs/file-mmu.o
CC fs/ntfs/debug.o
LD fs/ramfs/ramfs.o
LD fs/ramfs/built-in.o
CC fs/sysfs/inode.o
CC fs/ntfs/dir.o
CC fs/proc/inode.o
CC fs/sysfs/file.o
CC fs/nfs/nfs2xdr.o
CC fs/proc/root.o
CC fs/ntfs/file.o
CC fs/sysfs/dir.o
CC fs/proc/base.o
CC fs/ntfs/index.o
CC fs/nfs/direct.o
CC fs/sysfs/symlink.o
CC fs/ntfs/inode.o
CC fs/sysfs/mount.o
CC fs/proc/generic.o
CC fs/nfs/pagelist.o
CC fs/sysfs/bin.o
CC fs/ntfs/mft.o
CC fs/sysfs/group.o
CC fs/proc/array.o
CC fs/nfs/proc.o
LD fs/sysfs/built-in.o
CC fs/eventpoll.o
CC fs/ntfs/mst.o
CC fs/proc/proc_tty.o
CC fs/ntfs/namei.o
CC fs/proc/cmdline.o
CC fs/anon_inodes.o
CC fs/ntfs/runlist.o
CC fs/nfs/read.o
CC fs/proc/consoles.o
CC fs/signalfd.o
CC fs/proc/cpuinfo.o
CC fs/proc/devices.o
CC fs/timerfd.o
CC fs/proc/interrupts.o
CC fs/ntfs/super.o
CC fs/nfs/symlink.o
CC fs/proc/loadavg.o
CC fs/eventfd.o
CC fs/proc/meminfo.o
CC fs/nfs/unlink.o
CC fs/proc/stat.o
CC fs/aio.o
CC fs/ntfs/sysctl.o
CC fs/ntfs/unistr.o
CC fs/proc/uptime.o
CC fs/ntfs/upcase.o
CC fs/nfs/write.o
CC fs/proc/version.o
LD fs/ntfs/ntfs.o
LD fs/ntfs/built-in.o
CC fs/locks.o
CC fs/proc/softirqs.o
CC fs/binfmt_script.o
CC fs/binfmt_elf.o
CC fs/proc/namespaces.o
CC fs/proc/proc_sysctl.o
/home/user/build/src/grimlock_kernel_asus_tegra3_unified-52800b9d40bde53830b73c34f59d16fd36d2d915/fs/nfs/write.c:46:34: warning: 'nfs_commit_ops' defined but not used [-Wunused-const-variable=]
static const struct rpc_call_ops nfs_commit_ops;
^~~~~~~~~~~~~~
CC fs/nfs/namespace.o
CC fs/mbcache.o
CC fs/posix_acl.o
CC fs/proc/proc_net.o
CC fs/nfs/mount_clnt.o
CC fs/xattr_acl.o
CC fs/dcookies.o
CC fs/proc/kmsg.o
CC fs/proc/page.o
CC fs/nfs/dns_resolve.o
CC fs/nfs/cache_lib.o
LD fs/proc/proc.o
LD fs/proc/built-in.o
CC fs/nfs/nfsroot.o
CC fs/nfs/sysctl.o
LD fs/nfs/nfs.o
LD fs/nfs/built-in.o
LD fs/built-in.o
make[1]: *** [Makefile:130: sub-make] Error 2
make: *** [Makefile:26: all] Error 2
>>> ERROR: linux-asus-tf700t: all failed
(015588) [11:38:30] ^^^^^^^^^^^^^^^^^^^^^^^^^^^^^^^^^^^^^^^^^^^^^^^^^^^^^^^^^^^^^^^^^^^^^^
(015588) [11:38:30] NOTE: The failed command's output is above the ^^^ line in the logfile: /home/jja2000/.local/var/pmbootstrap/log.txt
(015588) [11:38:30] ERROR: Command failed: (native) % cd /home/user/build && su user -c 'CROSS_COMPILE=armv6-alpine-linux-muslgnueabihf- CARCH=armhf CC=armv6-alpine-linux-muslgnueabihf-gcc abuild -d'
(015588) [11:38:30] Run 'pmbootstrap log' for details.
(015588) [11:38:30] See also: <https://postmarketos.org/troubleshooting>
(015588) [11:38:30] Traceback (most recent call last):
File "/home/jja2000/gitzooi/pmbootstrap/pmb/helpers/run.py", line 45, in core
stderr=args.logfd)
File "/usr/lib/python3.5/subprocess.py", line 271, in check_call
raise CalledProcessError(retcode, cmd)
subprocess.CalledProcessError: Command '['sudo', '/bin/sh', '-c', 'env -i CHARSET=UTF-8 PATH=/usr/lib/ccache/bin:/usr/local/sbin:/usr/local/bin:/usr/sbin:/usr/bin:/sbin:/bin SHELL=/bin/ash HISTFILE=~/.ash_history /usr/sbin/chroot /home/jja2000/.local/var/pmbootstrap/chroot_native sh -c \'cd /home/user/build;su user -c \'"\'"\'CROSS_COMPILE=armv6-alpine-linux-muslgnueabihf- CARCH=armhf CC=armv6-alpine-linux-muslgnueabihf-gcc abuild -d\'"\'"\'\'']' returned non-zero exit status 1
The above exception was the direct cause of the following exception:
Traceback (most recent call last):
File "/home/jja2000/gitzooi/pmbootstrap/pmb/__init__.py", line 53, in main
getattr(frontend, args.action)(args)
File "/home/jja2000/gitzooi/pmbootstrap/pmb/helpers/frontend.py", line 84, in build
args.buildinfo)
File "/home/jja2000/gitzooi/pmbootstrap/pmb/build/package.py", line 106, in package
pmb.chroot.user(args, cmd, suffix, "/home/user/build")
File "/home/jja2000/gitzooi/pmbootstrap/pmb/chroot/user.py", line 32, in user
auto_init, return_stdout, check)
File "/home/jja2000/gitzooi/pmbootstrap/pmb/chroot/root.py", line 86, in root
return_stdout, check)
File "/home/jja2000/gitzooi/pmbootstrap/pmb/helpers/run.py", line 58, in core
raise RuntimeError("Command failed: " + log_message) from exc
RuntimeError: Command failed: (native) % cd /home/user/build && su user -c 'CROSS_COMPILE=armv6-alpine-linux-muslgnueabihf- CARCH=armhf CC=armv6-alpine-linux-muslgnueabihf-gcc abuild -d'
Sign up for free to join this conversation on GitHub. Already have an account? Sign in to comment
You can’t perform that action at this time.