Skip to content

Instantly share code, notes, and snippets.

Embed
What would you like to do?
Determining if files pthread.h;pthread_np.h exist failed with the following output:
Change Dir: /var/tmp/pamac-build-apachler/bareos/src/bareos/build/CMakeFiles/CMakeTmp
Run Build Command(s):/usr/bin/make cmTC_b2c5d/fast && /usr/bin/make -f CMakeFiles/cmTC_b2c5d.dir/build.make CMakeFiles/cmTC_b2c5d.dir/build
make[1]: Verzeichnis „/var/tmp/pamac-build-apachler/bareos/src/bareos/build/CMakeFiles/CMakeTmp“ wird betreten
Building C object CMakeFiles/cmTC_b2c5d.dir/HAVE_PTHREAD_NP_H.c.o
/usr/bin/cc -march=x86-64 -mtune=generic -O2 -pipe -fstack-protector-strong -fno-plt -fdebug-prefix-map=/var/tmp/pamac-build-apachler/bareos/src/bareos/core=. -fmacro-prefix-map=/var/tmp/pamac-build-apachler/bareos/src/bareos/core=. -o CMakeFiles/cmTC_b2c5d.dir/HAVE_PTHREAD_NP_H.c.o -c /var/tmp/pamac-build-apachler/bareos/src/bareos/build/CMakeFiles/CheckIncludeFiles/HAVE_PTHREAD_NP_H.c
/var/tmp/pamac-build-apachler/bareos/src/bareos/build/CMakeFiles/CheckIncludeFiles/HAVE_PTHREAD_NP_H.c:3:10: schwerwiegender Fehler: pthread_np.h: Datei oder Verzeichnis nicht gefunden
3 | #include <pthread_np.h>
| ^~~~~~~~~~~~~~
Kompilierung beendet.
make[1]: *** [CMakeFiles/cmTC_b2c5d.dir/build.make:86: CMakeFiles/cmTC_b2c5d.dir/HAVE_PTHREAD_NP_H.c.o] Fehler 1
make[1]: Verzeichnis „/var/tmp/pamac-build-apachler/bareos/src/bareos/build/CMakeFiles/CMakeTmp“ wird verlassen
make: *** [Makefile:141: cmTC_b2c5d/fast] Fehler 2
Source:
/* */
#include <pthread.h>
#include <pthread_np.h>
int main(void){return 0;}
Performing C SOURCE FILE Test HAVE_PTHREAD_ATTR_GET_NP failed with the following output:
Change Dir: /var/tmp/pamac-build-apachler/bareos/src/bareos/build/CMakeFiles/CMakeTmp
Run Build Command(s):/usr/bin/make cmTC_c4296/fast && /usr/bin/make -f CMakeFiles/cmTC_c4296.dir/build.make CMakeFiles/cmTC_c4296.dir/build
make[1]: Verzeichnis „/var/tmp/pamac-build-apachler/bareos/src/bareos/build/CMakeFiles/CMakeTmp“ wird betreten
Building C object CMakeFiles/cmTC_c4296.dir/src.c.o
/usr/bin/cc -march=x86-64 -mtune=generic -O2 -pipe -fstack-protector-strong -fno-plt -fdebug-prefix-map=/var/tmp/pamac-build-apachler/bareos/src/bareos/core=. -fmacro-prefix-map=/var/tmp/pamac-build-apachler/bareos/src/bareos/core=. -DHAVE_PTHREAD_ATTR_GET_NP -o CMakeFiles/cmTC_c4296.dir/src.c.o -c /var/tmp/pamac-build-apachler/bareos/src/bareos/build/CMakeFiles/CMakeTmp/src.c
/var/tmp/pamac-build-apachler/bareos/src/bareos/build/CMakeFiles/CMakeTmp/src.c: In Funktion »main«:
/var/tmp/pamac-build-apachler/bareos/src/bareos/build/CMakeFiles/CMakeTmp/src.c:3:36: Warnung: Implizite Deklaration der Funktion »pthread_attr_get_np«; meinten Sie »pthread_attr_getscope«? [-Wimplicit-function-declaration]
3 | int main() { pthread_attr_t a; pthread_attr_get_np(pthread_self(), &a); }
| ^~~~~~~~~~~~~~~~~~~
| pthread_attr_getscope
Linking C executable cmTC_c4296
/usr/bin/cmake -E cmake_link_script CMakeFiles/cmTC_c4296.dir/link.txt --verbose=1
/usr/bin/cc -march=x86-64 -mtune=generic -O2 -pipe -fstack-protector-strong -fno-plt -fdebug-prefix-map=/var/tmp/pamac-build-apachler/bareos/src/bareos/core=. -fmacro-prefix-map=/var/tmp/pamac-build-apachler/bareos/src/bareos/core=. -DHAVE_PTHREAD_ATTR_GET_NP -Wl,-O1,--sort-common,--as-needed,-z,relro,-z,now -rdynamic CMakeFiles/cmTC_c4296.dir/src.c.o -o cmTC_c4296 /usr/lib/libpthread.so
/usr/bin/ld: CMakeFiles/cmTC_c4296.dir/src.c.o: in function `main':
src.c:(.text.startup+0x24): undefined reference to `pthread_attr_get_np'
collect2: Fehler: ld gab 1 als Ende-Status zurück
make[1]: *** [CMakeFiles/cmTC_c4296.dir/build.make:108: cmTC_c4296] Fehler 1
make[1]: Verzeichnis „/var/tmp/pamac-build-apachler/bareos/src/bareos/build/CMakeFiles/CMakeTmp“ wird verlassen
make: *** [Makefile:141: cmTC_c4296/fast] Fehler 2
Source file was:
#include <pthread.h>
int main() { pthread_attr_t a; pthread_attr_get_np(pthread_self(), &a); }
Determining size of major_t failed with the following output:
Change Dir: /var/tmp/pamac-build-apachler/bareos/src/bareos/build/CMakeFiles/CMakeTmp
Run Build Command(s):/usr/bin/make cmTC_9fdb2/fast && /usr/bin/make -f CMakeFiles/cmTC_9fdb2.dir/build.make CMakeFiles/cmTC_9fdb2.dir/build
make[1]: Verzeichnis „/var/tmp/pamac-build-apachler/bareos/src/bareos/build/CMakeFiles/CMakeTmp“ wird betreten
Building C object CMakeFiles/cmTC_9fdb2.dir/MAJOR_T.c.o
/usr/bin/cc -march=x86-64 -mtune=generic -O2 -pipe -fstack-protector-strong -fno-plt -fdebug-prefix-map=/var/tmp/pamac-build-apachler/bareos/src/bareos/core=. -fmacro-prefix-map=/var/tmp/pamac-build-apachler/bareos/src/bareos/core=. -Wall -o CMakeFiles/cmTC_9fdb2.dir/MAJOR_T.c.o -c /var/tmp/pamac-build-apachler/bareos/src/bareos/build/CMakeFiles/CheckTypeSize/MAJOR_T.c
/var/tmp/pamac-build-apachler/bareos/src/bareos/build/CMakeFiles/CheckTypeSize/MAJOR_T.c:23:22: Fehler: »major_t« ist hier nicht deklariert (nicht in einer Funktion)
23 | #define SIZE (sizeof(major_t))
| ^~~~~~~
/var/tmp/pamac-build-apachler/bareos/src/bareos/build/CMakeFiles/CheckTypeSize/MAJOR_T.c:25:12: Anmerkung: bei Substitution des Makros »SIZE«
25 | ('0' + ((SIZE / 10000)%10)),
| ^~~~
make[1]: *** [CMakeFiles/cmTC_9fdb2.dir/build.make:86: CMakeFiles/cmTC_9fdb2.dir/MAJOR_T.c.o] Fehler 1
make[1]: Verzeichnis „/var/tmp/pamac-build-apachler/bareos/src/bareos/build/CMakeFiles/CMakeTmp“ wird verlassen
make: *** [Makefile:141: cmTC_9fdb2/fast] Fehler 2
/var/tmp/pamac-build-apachler/bareos/src/bareos/build/CMakeFiles/CheckTypeSize/MAJOR_T.c:
#include <sys/types.h>
#include <stdint.h>
#include <stddef.h>
#undef KEY
#if defined(__i386)
# define KEY '_','_','i','3','8','6'
#elif defined(__x86_64)
# define KEY '_','_','x','8','6','_','6','4'
#elif defined(__ppc__)
# define KEY '_','_','p','p','c','_','_'
#elif defined(__ppc64__)
# define KEY '_','_','p','p','c','6','4','_','_'
#elif defined(__aarch64__)
# define KEY '_','_','a','a','r','c','h','6','4','_','_'
#elif defined(__ARM_ARCH_7A__)
# define KEY '_','_','A','R','M','_','A','R','C','H','_','7','A','_','_'
#elif defined(__ARM_ARCH_7S__)
# define KEY '_','_','A','R','M','_','A','R','C','H','_','7','S','_','_'
#endif
#define SIZE (sizeof(major_t))
static char info_size[] = {'I', 'N', 'F', 'O', ':', 's','i','z','e','[',
('0' + ((SIZE / 10000)%10)),
('0' + ((SIZE / 1000)%10)),
('0' + ((SIZE / 100)%10)),
('0' + ((SIZE / 10)%10)),
('0' + (SIZE % 10)),
']',
#ifdef KEY
' ','k','e','y','[', KEY, ']',
#endif
'\0'};
#ifdef __CLASSIC_C__
int main(argc, argv) int argc; char *argv[];
#else
int main(int argc, char *argv[])
#endif
{
int require = 0;
require += info_size[argc];
(void)argv;
return require;
}
Determining size of minor_t failed with the following output:
Change Dir: /var/tmp/pamac-build-apachler/bareos/src/bareos/build/CMakeFiles/CMakeTmp
Run Build Command(s):/usr/bin/make cmTC_adc8e/fast && /usr/bin/make -f CMakeFiles/cmTC_adc8e.dir/build.make CMakeFiles/cmTC_adc8e.dir/build
make[1]: Verzeichnis „/var/tmp/pamac-build-apachler/bareos/src/bareos/build/CMakeFiles/CMakeTmp“ wird betreten
Building C object CMakeFiles/cmTC_adc8e.dir/MINOR_T.c.o
/usr/bin/cc -march=x86-64 -mtune=generic -O2 -pipe -fstack-protector-strong -fno-plt -fdebug-prefix-map=/var/tmp/pamac-build-apachler/bareos/src/bareos/core=. -fmacro-prefix-map=/var/tmp/pamac-build-apachler/bareos/src/bareos/core=. -Wall -o CMakeFiles/cmTC_adc8e.dir/MINOR_T.c.o -c /var/tmp/pamac-build-apachler/bareos/src/bareos/build/CMakeFiles/CheckTypeSize/MINOR_T.c
/var/tmp/pamac-build-apachler/bareos/src/bareos/build/CMakeFiles/CheckTypeSize/MINOR_T.c:23:22: Fehler: »minor_t« ist hier (außerhalb einer Funktion) nicht deklariert; meinten Sie »ino_t«?
23 | #define SIZE (sizeof(minor_t))
| ^~~~~~~
/var/tmp/pamac-build-apachler/bareos/src/bareos/build/CMakeFiles/CheckTypeSize/MINOR_T.c:25:12: Anmerkung: bei Substitution des Makros »SIZE«
25 | ('0' + ((SIZE / 10000)%10)),
| ^~~~
make[1]: *** [CMakeFiles/cmTC_adc8e.dir/build.make:86: CMakeFiles/cmTC_adc8e.dir/MINOR_T.c.o] Fehler 1
make[1]: Verzeichnis „/var/tmp/pamac-build-apachler/bareos/src/bareos/build/CMakeFiles/CMakeTmp“ wird verlassen
make: *** [Makefile:141: cmTC_adc8e/fast] Fehler 2
/var/tmp/pamac-build-apachler/bareos/src/bareos/build/CMakeFiles/CheckTypeSize/MINOR_T.c:
#include <sys/types.h>
#include <stdint.h>
#include <stddef.h>
#undef KEY
#if defined(__i386)
# define KEY '_','_','i','3','8','6'
#elif defined(__x86_64)
# define KEY '_','_','x','8','6','_','6','4'
#elif defined(__ppc__)
# define KEY '_','_','p','p','c','_','_'
#elif defined(__ppc64__)
# define KEY '_','_','p','p','c','6','4','_','_'
#elif defined(__aarch64__)
# define KEY '_','_','a','a','r','c','h','6','4','_','_'
#elif defined(__ARM_ARCH_7A__)
# define KEY '_','_','A','R','M','_','A','R','C','H','_','7','A','_','_'
#elif defined(__ARM_ARCH_7S__)
# define KEY '_','_','A','R','M','_','A','R','C','H','_','7','S','_','_'
#endif
#define SIZE (sizeof(minor_t))
static char info_size[] = {'I', 'N', 'F', 'O', ':', 's','i','z','e','[',
('0' + ((SIZE / 10000)%10)),
('0' + ((SIZE / 1000)%10)),
('0' + ((SIZE / 100)%10)),
('0' + ((SIZE / 10)%10)),
('0' + (SIZE % 10)),
']',
#ifdef KEY
' ','k','e','y','[', KEY, ']',
#endif
'\0'};
#ifdef __CLASSIC_C__
int main(argc, argv) int argc; char *argv[];
#else
int main(int argc, char *argv[])
#endif
{
int require = 0;
require += info_size[argc];
(void)argv;
return require;
}
Determining if files afs/afsint.h exist failed with the following output:
Change Dir: /var/tmp/pamac-build-apachler/bareos/src/bareos/build/CMakeFiles/CMakeTmp
Run Build Command(s):/usr/bin/make cmTC_da1f2/fast && /usr/bin/make -f CMakeFiles/cmTC_da1f2.dir/build.make CMakeFiles/cmTC_da1f2.dir/build
make[1]: Verzeichnis „/var/tmp/pamac-build-apachler/bareos/src/bareos/build/CMakeFiles/CMakeTmp“ wird betreten
Building C object CMakeFiles/cmTC_da1f2.dir/HAVE_AFS_AFSINT_H.c.o
/usr/bin/cc -D_FILE_OFFSET_BITS=64 -march=x86-64 -mtune=generic -O2 -pipe -fstack-protector-strong -fno-plt -fdebug-prefix-map=/var/tmp/pamac-build-apachler/bareos/src/bareos/core=. -fmacro-prefix-map=/var/tmp/pamac-build-apachler/bareos/src/bareos/core=. -Wall -o CMakeFiles/cmTC_da1f2.dir/HAVE_AFS_AFSINT_H.c.o -c /var/tmp/pamac-build-apachler/bareos/src/bareos/build/CMakeFiles/CheckIncludeFiles/HAVE_AFS_AFSINT_H.c
/var/tmp/pamac-build-apachler/bareos/src/bareos/build/CMakeFiles/CheckIncludeFiles/HAVE_AFS_AFSINT_H.c:2:10: schwerwiegender Fehler: afs/afsint.h: Datei oder Verzeichnis nicht gefunden
2 | #include <afs/afsint.h>
| ^~~~~~~~~~~~~~
Kompilierung beendet.
make[1]: *** [CMakeFiles/cmTC_da1f2.dir/build.make:86: CMakeFiles/cmTC_da1f2.dir/HAVE_AFS_AFSINT_H.c.o] Fehler 1
make[1]: Verzeichnis „/var/tmp/pamac-build-apachler/bareos/src/bareos/build/CMakeFiles/CMakeTmp“ wird verlassen
make: *** [Makefile:141: cmTC_da1f2/fast] Fehler 2
Source:
/* */
#include <afs/afsint.h>
int main(void){return 0;}
Determining if files afs/venus.h exist failed with the following output:
Change Dir: /var/tmp/pamac-build-apachler/bareos/src/bareos/build/CMakeFiles/CMakeTmp
Run Build Command(s):/usr/bin/make cmTC_decfd/fast && /usr/bin/make -f CMakeFiles/cmTC_decfd.dir/build.make CMakeFiles/cmTC_decfd.dir/build
make[1]: Verzeichnis „/var/tmp/pamac-build-apachler/bareos/src/bareos/build/CMakeFiles/CMakeTmp“ wird betreten
Building C object CMakeFiles/cmTC_decfd.dir/HAVE_AFS_VENUS_H.c.o
/usr/bin/cc -D_FILE_OFFSET_BITS=64 -march=x86-64 -mtune=generic -O2 -pipe -fstack-protector-strong -fno-plt -fdebug-prefix-map=/var/tmp/pamac-build-apachler/bareos/src/bareos/core=. -fmacro-prefix-map=/var/tmp/pamac-build-apachler/bareos/src/bareos/core=. -Wall -o CMakeFiles/cmTC_decfd.dir/HAVE_AFS_VENUS_H.c.o -c /var/tmp/pamac-build-apachler/bareos/src/bareos/build/CMakeFiles/CheckIncludeFiles/HAVE_AFS_VENUS_H.c
/var/tmp/pamac-build-apachler/bareos/src/bareos/build/CMakeFiles/CheckIncludeFiles/HAVE_AFS_VENUS_H.c:2:10: schwerwiegender Fehler: afs/venus.h: Datei oder Verzeichnis nicht gefunden
2 | #include <afs/venus.h>
| ^~~~~~~~~~~~~
Kompilierung beendet.
make[1]: *** [CMakeFiles/cmTC_decfd.dir/build.make:86: CMakeFiles/cmTC_decfd.dir/HAVE_AFS_VENUS_H.c.o] Fehler 1
make[1]: Verzeichnis „/var/tmp/pamac-build-apachler/bareos/src/bareos/build/CMakeFiles/CMakeTmp“ wird verlassen
make: *** [Makefile:141: cmTC_decfd/fast] Fehler 2
Source:
/* */
#include <afs/venus.h>
int main(void){return 0;}
Determining if files attr.h exist failed with the following output:
Change Dir: /var/tmp/pamac-build-apachler/bareos/src/bareos/build/CMakeFiles/CMakeTmp
Run Build Command(s):/usr/bin/make cmTC_a416b/fast && /usr/bin/make -f CMakeFiles/cmTC_a416b.dir/build.make CMakeFiles/cmTC_a416b.dir/build
make[1]: Verzeichnis „/var/tmp/pamac-build-apachler/bareos/src/bareos/build/CMakeFiles/CMakeTmp“ wird betreten
Building C object CMakeFiles/cmTC_a416b.dir/HAVE_ATTR_H.c.o
/usr/bin/cc -D_FILE_OFFSET_BITS=64 -march=x86-64 -mtune=generic -O2 -pipe -fstack-protector-strong -fno-plt -fdebug-prefix-map=/var/tmp/pamac-build-apachler/bareos/src/bareos/core=. -fmacro-prefix-map=/var/tmp/pamac-build-apachler/bareos/src/bareos/core=. -Wall -o CMakeFiles/cmTC_a416b.dir/HAVE_ATTR_H.c.o -c /var/tmp/pamac-build-apachler/bareos/src/bareos/build/CMakeFiles/CheckIncludeFiles/HAVE_ATTR_H.c
/var/tmp/pamac-build-apachler/bareos/src/bareos/build/CMakeFiles/CheckIncludeFiles/HAVE_ATTR_H.c:2:10: schwerwiegender Fehler: attr.h: Datei oder Verzeichnis nicht gefunden
2 | #include <attr.h>
| ^~~~~~~~
Kompilierung beendet.
make[1]: *** [CMakeFiles/cmTC_a416b.dir/build.make:86: CMakeFiles/cmTC_a416b.dir/HAVE_ATTR_H.c.o] Fehler 1
make[1]: Verzeichnis „/var/tmp/pamac-build-apachler/bareos/src/bareos/build/CMakeFiles/CMakeTmp“ wird verlassen
make: *** [Makefile:141: cmTC_a416b/fast] Fehler 2
Source:
/* */
#include <attr.h>
int main(void){return 0;}
Determining if files demangle.h exist failed with the following output:
Change Dir: /var/tmp/pamac-build-apachler/bareos/src/bareos/build/CMakeFiles/CMakeTmp
Run Build Command(s):/usr/bin/make cmTC_1817e/fast && /usr/bin/make -f CMakeFiles/cmTC_1817e.dir/build.make CMakeFiles/cmTC_1817e.dir/build
make[1]: Verzeichnis „/var/tmp/pamac-build-apachler/bareos/src/bareos/build/CMakeFiles/CMakeTmp“ wird betreten
Building C object CMakeFiles/cmTC_1817e.dir/HAVE_DEMANGLE_H.c.o
/usr/bin/cc -D_FILE_OFFSET_BITS=64 -march=x86-64 -mtune=generic -O2 -pipe -fstack-protector-strong -fno-plt -fdebug-prefix-map=/var/tmp/pamac-build-apachler/bareos/src/bareos/core=. -fmacro-prefix-map=/var/tmp/pamac-build-apachler/bareos/src/bareos/core=. -Wall -o CMakeFiles/cmTC_1817e.dir/HAVE_DEMANGLE_H.c.o -c /var/tmp/pamac-build-apachler/bareos/src/bareos/build/CMakeFiles/CheckIncludeFiles/HAVE_DEMANGLE_H.c
/var/tmp/pamac-build-apachler/bareos/src/bareos/build/CMakeFiles/CheckIncludeFiles/HAVE_DEMANGLE_H.c:2:10: schwerwiegender Fehler: demangle.h: Datei oder Verzeichnis nicht gefunden
2 | #include <demangle.h>
| ^~~~~~~~~~~~
Kompilierung beendet.
make[1]: *** [CMakeFiles/cmTC_1817e.dir/build.make:86: CMakeFiles/cmTC_1817e.dir/HAVE_DEMANGLE_H.c.o] Fehler 1
make[1]: Verzeichnis „/var/tmp/pamac-build-apachler/bareos/src/bareos/build/CMakeFiles/CMakeTmp“ wird verlassen
make: *** [Makefile:141: cmTC_1817e/fast] Fehler 2
Source:
/* */
#include <demangle.h>
int main(void){return 0;}
Determining if files dl.h exist failed with the following output:
Change Dir: /var/tmp/pamac-build-apachler/bareos/src/bareos/build/CMakeFiles/CMakeTmp
Run Build Command(s):/usr/bin/make cmTC_ca839/fast && /usr/bin/make -f CMakeFiles/cmTC_ca839.dir/build.make CMakeFiles/cmTC_ca839.dir/build
make[1]: Verzeichnis „/var/tmp/pamac-build-apachler/bareos/src/bareos/build/CMakeFiles/CMakeTmp“ wird betreten
Building C object CMakeFiles/cmTC_ca839.dir/HAVE_DL_H.c.o
/usr/bin/cc -D_FILE_OFFSET_BITS=64 -march=x86-64 -mtune=generic -O2 -pipe -fstack-protector-strong -fno-plt -fdebug-prefix-map=/var/tmp/pamac-build-apachler/bareos/src/bareos/core=. -fmacro-prefix-map=/var/tmp/pamac-build-apachler/bareos/src/bareos/core=. -Wall -o CMakeFiles/cmTC_ca839.dir/HAVE_DL_H.c.o -c /var/tmp/pamac-build-apachler/bareos/src/bareos/build/CMakeFiles/CheckIncludeFiles/HAVE_DL_H.c
/var/tmp/pamac-build-apachler/bareos/src/bareos/build/CMakeFiles/CheckIncludeFiles/HAVE_DL_H.c:2:10: schwerwiegender Fehler: dl.h: Datei oder Verzeichnis nicht gefunden
2 | #include <dl.h>
| ^~~~~~
Kompilierung beendet.
make[1]: *** [CMakeFiles/cmTC_ca839.dir/build.make:86: CMakeFiles/cmTC_ca839.dir/HAVE_DL_H.c.o] Fehler 1
make[1]: Verzeichnis „/var/tmp/pamac-build-apachler/bareos/src/bareos/build/CMakeFiles/CMakeTmp“ wird verlassen
make: *** [Makefile:141: cmTC_ca839/fast] Fehler 2
Source:
/* */
#include <dl.h>
int main(void){return 0;}
Determining if files libutil.h exist failed with the following output:
Change Dir: /var/tmp/pamac-build-apachler/bareos/src/bareos/build/CMakeFiles/CMakeTmp
Run Build Command(s):/usr/bin/make cmTC_afff9/fast && /usr/bin/make -f CMakeFiles/cmTC_afff9.dir/build.make CMakeFiles/cmTC_afff9.dir/build
make[1]: Verzeichnis „/var/tmp/pamac-build-apachler/bareos/src/bareos/build/CMakeFiles/CMakeTmp“ wird betreten
Building C object CMakeFiles/cmTC_afff9.dir/HAVE_LIBUTIL_H.c.o
/usr/bin/cc -D_FILE_OFFSET_BITS=64 -march=x86-64 -mtune=generic -O2 -pipe -fstack-protector-strong -fno-plt -fdebug-prefix-map=/var/tmp/pamac-build-apachler/bareos/src/bareos/core=. -fmacro-prefix-map=/var/tmp/pamac-build-apachler/bareos/src/bareos/core=. -Wall -o CMakeFiles/cmTC_afff9.dir/HAVE_LIBUTIL_H.c.o -c /var/tmp/pamac-build-apachler/bareos/src/bareos/build/CMakeFiles/CheckIncludeFiles/HAVE_LIBUTIL_H.c
/var/tmp/pamac-build-apachler/bareos/src/bareos/build/CMakeFiles/CheckIncludeFiles/HAVE_LIBUTIL_H.c:2:10: schwerwiegender Fehler: libutil.h: Datei oder Verzeichnis nicht gefunden
2 | #include <libutil.h>
| ^~~~~~~~~~~
Kompilierung beendet.
make[1]: *** [CMakeFiles/cmTC_afff9.dir/build.make:86: CMakeFiles/cmTC_afff9.dir/HAVE_LIBUTIL_H.c.o] Fehler 1
make[1]: Verzeichnis „/var/tmp/pamac-build-apachler/bareos/src/bareos/build/CMakeFiles/CMakeTmp“ wird verlassen
make: *** [Makefile:141: cmTC_afff9/fast] Fehler 2
Source:
/* */
#include <libutil.h>
int main(void){return 0;}
Determining if files mtio.h exist failed with the following output:
Change Dir: /var/tmp/pamac-build-apachler/bareos/src/bareos/build/CMakeFiles/CMakeTmp
Run Build Command(s):/usr/bin/make cmTC_16872/fast && /usr/bin/make -f CMakeFiles/cmTC_16872.dir/build.make CMakeFiles/cmTC_16872.dir/build
make[1]: Verzeichnis „/var/tmp/pamac-build-apachler/bareos/src/bareos/build/CMakeFiles/CMakeTmp“ wird betreten
Building C object CMakeFiles/cmTC_16872.dir/HAVE_MTIO_H.c.o
/usr/bin/cc -D_FILE_OFFSET_BITS=64 -march=x86-64 -mtune=generic -O2 -pipe -fstack-protector-strong -fno-plt -fdebug-prefix-map=/var/tmp/pamac-build-apachler/bareos/src/bareos/core=. -fmacro-prefix-map=/var/tmp/pamac-build-apachler/bareos/src/bareos/core=. -Wall -o CMakeFiles/cmTC_16872.dir/HAVE_MTIO_H.c.o -c /var/tmp/pamac-build-apachler/bareos/src/bareos/build/CMakeFiles/CheckIncludeFiles/HAVE_MTIO_H.c
/var/tmp/pamac-build-apachler/bareos/src/bareos/build/CMakeFiles/CheckIncludeFiles/HAVE_MTIO_H.c:2:10: schwerwiegender Fehler: mtio.h: Datei oder Verzeichnis nicht gefunden
2 | #include <mtio.h>
| ^~~~~~~~
Kompilierung beendet.
make[1]: *** [CMakeFiles/cmTC_16872.dir/build.make:86: CMakeFiles/cmTC_16872.dir/HAVE_MTIO_H.c.o] Fehler 1
make[1]: Verzeichnis „/var/tmp/pamac-build-apachler/bareos/src/bareos/build/CMakeFiles/CMakeTmp“ wird verlassen
make: *** [Makefile:141: cmTC_16872/fast] Fehler 2
Source:
/* */
#include <mtio.h>
int main(void){return 0;}
Determining if files sys/attr.h exist failed with the following output:
Change Dir: /var/tmp/pamac-build-apachler/bareos/src/bareos/build/CMakeFiles/CMakeTmp
Run Build Command(s):/usr/bin/make cmTC_11b1f/fast && /usr/bin/make -f CMakeFiles/cmTC_11b1f.dir/build.make CMakeFiles/cmTC_11b1f.dir/build
make[1]: Verzeichnis „/var/tmp/pamac-build-apachler/bareos/src/bareos/build/CMakeFiles/CMakeTmp“ wird betreten
Building C object CMakeFiles/cmTC_11b1f.dir/HAVE_SYS_ATTR_H.c.o
/usr/bin/cc -D_FILE_OFFSET_BITS=64 -march=x86-64 -mtune=generic -O2 -pipe -fstack-protector-strong -fno-plt -fdebug-prefix-map=/var/tmp/pamac-build-apachler/bareos/src/bareos/core=. -fmacro-prefix-map=/var/tmp/pamac-build-apachler/bareos/src/bareos/core=. -Wall -o CMakeFiles/cmTC_11b1f.dir/HAVE_SYS_ATTR_H.c.o -c /var/tmp/pamac-build-apachler/bareos/src/bareos/build/CMakeFiles/CheckIncludeFiles/HAVE_SYS_ATTR_H.c
/var/tmp/pamac-build-apachler/bareos/src/bareos/build/CMakeFiles/CheckIncludeFiles/HAVE_SYS_ATTR_H.c:2:10: schwerwiegender Fehler: sys/attr.h: Datei oder Verzeichnis nicht gefunden
2 | #include <sys/attr.h>
| ^~~~~~~~~~~~
Kompilierung beendet.
make[1]: *** [CMakeFiles/cmTC_11b1f.dir/build.make:86: CMakeFiles/cmTC_11b1f.dir/HAVE_SYS_ATTR_H.c.o] Fehler 1
make[1]: Verzeichnis „/var/tmp/pamac-build-apachler/bareos/src/bareos/build/CMakeFiles/CMakeTmp“ wird verlassen
make: *** [Makefile:141: cmTC_11b1f/fast] Fehler 2
Source:
/* */
#include <sys/attr.h>
int main(void){return 0;}
Determining if files sys/byteorder.h exist failed with the following output:
Change Dir: /var/tmp/pamac-build-apachler/bareos/src/bareos/build/CMakeFiles/CMakeTmp
Run Build Command(s):/usr/bin/make cmTC_3ee2a/fast && /usr/bin/make -f CMakeFiles/cmTC_3ee2a.dir/build.make CMakeFiles/cmTC_3ee2a.dir/build
make[1]: Verzeichnis „/var/tmp/pamac-build-apachler/bareos/src/bareos/build/CMakeFiles/CMakeTmp“ wird betreten
Building C object CMakeFiles/cmTC_3ee2a.dir/HAVE_SYS_BYTEORDER_H.c.o
/usr/bin/cc -D_FILE_OFFSET_BITS=64 -march=x86-64 -mtune=generic -O2 -pipe -fstack-protector-strong -fno-plt -fdebug-prefix-map=/var/tmp/pamac-build-apachler/bareos/src/bareos/core=. -fmacro-prefix-map=/var/tmp/pamac-build-apachler/bareos/src/bareos/core=. -Wall -o CMakeFiles/cmTC_3ee2a.dir/HAVE_SYS_BYTEORDER_H.c.o -c /var/tmp/pamac-build-apachler/bareos/src/bareos/build/CMakeFiles/CheckIncludeFiles/HAVE_SYS_BYTEORDER_H.c
/var/tmp/pamac-build-apachler/bareos/src/bareos/build/CMakeFiles/CheckIncludeFiles/HAVE_SYS_BYTEORDER_H.c:2:10: schwerwiegender Fehler: sys/byteorder.h: Datei oder Verzeichnis nicht gefunden
2 | #include <sys/byteorder.h>
| ^~~~~~~~~~~~~~~~~
Kompilierung beendet.
make[1]: *** [CMakeFiles/cmTC_3ee2a.dir/build.make:86: CMakeFiles/cmTC_3ee2a.dir/HAVE_SYS_BYTEORDER_H.c.o] Fehler 1
make[1]: Verzeichnis „/var/tmp/pamac-build-apachler/bareos/src/bareos/build/CMakeFiles/CMakeTmp“ wird verlassen
make: *** [Makefile:141: cmTC_3ee2a/fast] Fehler 2
Source:
/* */
#include <sys/byteorder.h>
int main(void){return 0;}
Determining if files sys/dl.h exist failed with the following output:
Change Dir: /var/tmp/pamac-build-apachler/bareos/src/bareos/build/CMakeFiles/CMakeTmp
Run Build Command(s):/usr/bin/make cmTC_9c4c6/fast && /usr/bin/make -f CMakeFiles/cmTC_9c4c6.dir/build.make CMakeFiles/cmTC_9c4c6.dir/build
make[1]: Verzeichnis „/var/tmp/pamac-build-apachler/bareos/src/bareos/build/CMakeFiles/CMakeTmp“ wird betreten
Building C object CMakeFiles/cmTC_9c4c6.dir/HAVE_SYS_DL_H.c.o
/usr/bin/cc -D_FILE_OFFSET_BITS=64 -march=x86-64 -mtune=generic -O2 -pipe -fstack-protector-strong -fno-plt -fdebug-prefix-map=/var/tmp/pamac-build-apachler/bareos/src/bareos/core=. -fmacro-prefix-map=/var/tmp/pamac-build-apachler/bareos/src/bareos/core=. -Wall -o CMakeFiles/cmTC_9c4c6.dir/HAVE_SYS_DL_H.c.o -c /var/tmp/pamac-build-apachler/bareos/src/bareos/build/CMakeFiles/CheckIncludeFiles/HAVE_SYS_DL_H.c
/var/tmp/pamac-build-apachler/bareos/src/bareos/build/CMakeFiles/CheckIncludeFiles/HAVE_SYS_DL_H.c:2:10: schwerwiegender Fehler: sys/dl.h: Datei oder Verzeichnis nicht gefunden
2 | #include <sys/dl.h>
| ^~~~~~~~~~
Kompilierung beendet.
make[1]: *** [CMakeFiles/cmTC_9c4c6.dir/build.make:86: CMakeFiles/cmTC_9c4c6.dir/HAVE_SYS_DL_H.c.o] Fehler 1
make[1]: Verzeichnis „/var/tmp/pamac-build-apachler/bareos/src/bareos/build/CMakeFiles/CMakeTmp“ wird verlassen
make: *** [Makefile:141: cmTC_9c4c6/fast] Fehler 2
Source:
/* */
#include <sys/dl.h>
int main(void){return 0;}
Determining if files sys/ea.h exist failed with the following output:
Change Dir: /var/tmp/pamac-build-apachler/bareos/src/bareos/build/CMakeFiles/CMakeTmp
Run Build Command(s):/usr/bin/make cmTC_87bf5/fast && /usr/bin/make -f CMakeFiles/cmTC_87bf5.dir/build.make CMakeFiles/cmTC_87bf5.dir/build
make[1]: Verzeichnis „/var/tmp/pamac-build-apachler/bareos/src/bareos/build/CMakeFiles/CMakeTmp“ wird betreten
Building C object CMakeFiles/cmTC_87bf5.dir/HAVE_SYS_EA_H.c.o
/usr/bin/cc -D_FILE_OFFSET_BITS=64 -march=x86-64 -mtune=generic -O2 -pipe -fstack-protector-strong -fno-plt -fdebug-prefix-map=/var/tmp/pamac-build-apachler/bareos/src/bareos/core=. -fmacro-prefix-map=/var/tmp/pamac-build-apachler/bareos/src/bareos/core=. -Wall -o CMakeFiles/cmTC_87bf5.dir/HAVE_SYS_EA_H.c.o -c /var/tmp/pamac-build-apachler/bareos/src/bareos/build/CMakeFiles/CheckIncludeFiles/HAVE_SYS_EA_H.c
/var/tmp/pamac-build-apachler/bareos/src/bareos/build/CMakeFiles/CheckIncludeFiles/HAVE_SYS_EA_H.c:2:10: schwerwiegender Fehler: sys/ea.h: Datei oder Verzeichnis nicht gefunden
2 | #include <sys/ea.h>
| ^~~~~~~~~~
Kompilierung beendet.
make[1]: *** [CMakeFiles/cmTC_87bf5.dir/build.make:86: CMakeFiles/cmTC_87bf5.dir/HAVE_SYS_EA_H.c.o] Fehler 1
make[1]: Verzeichnis „/var/tmp/pamac-build-apachler/bareos/src/bareos/build/CMakeFiles/CMakeTmp“ wird verlassen
make: *** [Makefile:141: cmTC_87bf5/fast] Fehler 2
Source:
/* */
#include <sys/ea.h>
int main(void){return 0;}
Determining if files sys/types.h;sys/extattr.h exist failed with the following output:
Change Dir: /var/tmp/pamac-build-apachler/bareos/src/bareos/build/CMakeFiles/CMakeTmp
Run Build Command(s):/usr/bin/make cmTC_30610/fast && /usr/bin/make -f CMakeFiles/cmTC_30610.dir/build.make CMakeFiles/cmTC_30610.dir/build
make[1]: Verzeichnis „/var/tmp/pamac-build-apachler/bareos/src/bareos/build/CMakeFiles/CMakeTmp“ wird betreten
Building C object CMakeFiles/cmTC_30610.dir/HAVE_SYS_EXTATTR_H.c.o
/usr/bin/cc -D_FILE_OFFSET_BITS=64 -march=x86-64 -mtune=generic -O2 -pipe -fstack-protector-strong -fno-plt -fdebug-prefix-map=/var/tmp/pamac-build-apachler/bareos/src/bareos/core=. -fmacro-prefix-map=/var/tmp/pamac-build-apachler/bareos/src/bareos/core=. -Wall -o CMakeFiles/cmTC_30610.dir/HAVE_SYS_EXTATTR_H.c.o -c /var/tmp/pamac-build-apachler/bareos/src/bareos/build/CMakeFiles/CheckIncludeFiles/HAVE_SYS_EXTATTR_H.c
/var/tmp/pamac-build-apachler/bareos/src/bareos/build/CMakeFiles/CheckIncludeFiles/HAVE_SYS_EXTATTR_H.c:3:10: schwerwiegender Fehler: sys/extattr.h: Datei oder Verzeichnis nicht gefunden
3 | #include <sys/extattr.h>
| ^~~~~~~~~~~~~~~
Kompilierung beendet.
make[1]: *** [CMakeFiles/cmTC_30610.dir/build.make:86: CMakeFiles/cmTC_30610.dir/HAVE_SYS_EXTATTR_H.c.o] Fehler 1
make[1]: Verzeichnis „/var/tmp/pamac-build-apachler/bareos/src/bareos/build/CMakeFiles/CMakeTmp“ wird verlassen
make: *** [Makefile:141: cmTC_30610/fast] Fehler 2
Source:
/* */
#include <sys/types.h>
#include <sys/extattr.h>
int main(void){return 0;}
Determining if files sys/ndir.h exist failed with the following output:
Change Dir: /var/tmp/pamac-build-apachler/bareos/src/bareos/build/CMakeFiles/CMakeTmp
Run Build Command(s):/usr/bin/make cmTC_6b6a6/fast && /usr/bin/make -f CMakeFiles/cmTC_6b6a6.dir/build.make CMakeFiles/cmTC_6b6a6.dir/build
make[1]: Verzeichnis „/var/tmp/pamac-build-apachler/bareos/src/bareos/build/CMakeFiles/CMakeTmp“ wird betreten
Building C object CMakeFiles/cmTC_6b6a6.dir/HAVE_SYS_NDIR_H.c.o
/usr/bin/cc -D_FILE_OFFSET_BITS=64 -march=x86-64 -mtune=generic -O2 -pipe -fstack-protector-strong -fno-plt -fdebug-prefix-map=/var/tmp/pamac-build-apachler/bareos/src/bareos/core=. -fmacro-prefix-map=/var/tmp/pamac-build-apachler/bareos/src/bareos/core=. -Wall -o CMakeFiles/cmTC_6b6a6.dir/HAVE_SYS_NDIR_H.c.o -c /var/tmp/pamac-build-apachler/bareos/src/bareos/build/CMakeFiles/CheckIncludeFiles/HAVE_SYS_NDIR_H.c
/var/tmp/pamac-build-apachler/bareos/src/bareos/build/CMakeFiles/CheckIncludeFiles/HAVE_SYS_NDIR_H.c:2:10: schwerwiegender Fehler: sys/ndir.h: Datei oder Verzeichnis nicht gefunden
2 | #include <sys/ndir.h>
| ^~~~~~~~~~~~
Kompilierung beendet.
make[1]: *** [CMakeFiles/cmTC_6b6a6.dir/build.make:86: CMakeFiles/cmTC_6b6a6.dir/HAVE_SYS_NDIR_H.c.o] Fehler 1
make[1]: Verzeichnis „/var/tmp/pamac-build-apachler/bareos/src/bareos/build/CMakeFiles/CMakeTmp“ wird verlassen
make: *** [Makefile:141: cmTC_6b6a6/fast] Fehler 2
Source:
/* */
#include <sys/ndir.h>
int main(void){return 0;}
Determining if files sys/nvpair.h exist failed with the following output:
Change Dir: /var/tmp/pamac-build-apachler/bareos/src/bareos/build/CMakeFiles/CMakeTmp
Run Build Command(s):/usr/bin/make cmTC_c41ca/fast && /usr/bin/make -f CMakeFiles/cmTC_c41ca.dir/build.make CMakeFiles/cmTC_c41ca.dir/build
make[1]: Verzeichnis „/var/tmp/pamac-build-apachler/bareos/src/bareos/build/CMakeFiles/CMakeTmp“ wird betreten
Building C object CMakeFiles/cmTC_c41ca.dir/HAVE_SYS_NVPAIR_H.c.o
/usr/bin/cc -D_FILE_OFFSET_BITS=64 -march=x86-64 -mtune=generic -O2 -pipe -fstack-protector-strong -fno-plt -fdebug-prefix-map=/var/tmp/pamac-build-apachler/bareos/src/bareos/core=. -fmacro-prefix-map=/var/tmp/pamac-build-apachler/bareos/src/bareos/core=. -Wall -o CMakeFiles/cmTC_c41ca.dir/HAVE_SYS_NVPAIR_H.c.o -c /var/tmp/pamac-build-apachler/bareos/src/bareos/build/CMakeFiles/CheckIncludeFiles/HAVE_SYS_NVPAIR_H.c
/var/tmp/pamac-build-apachler/bareos/src/bareos/build/CMakeFiles/CheckIncludeFiles/HAVE_SYS_NVPAIR_H.c:2:10: schwerwiegender Fehler: sys/nvpair.h: Datei oder Verzeichnis nicht gefunden
2 | #include <sys/nvpair.h>
| ^~~~~~~~~~~~~~
Kompilierung beendet.
make[1]: *** [CMakeFiles/cmTC_c41ca.dir/build.make:86: CMakeFiles/cmTC_c41ca.dir/HAVE_SYS_NVPAIR_H.c.o] Fehler 1
make[1]: Verzeichnis „/var/tmp/pamac-build-apachler/bareos/src/bareos/build/CMakeFiles/CMakeTmp“ wird verlassen
make: *** [Makefile:141: cmTC_c41ca/fast] Fehler 2
Source:
/* */
#include <sys/nvpair.h>
int main(void){return 0;}
Determining if files sys/sockio.h exist failed with the following output:
Change Dir: /var/tmp/pamac-build-apachler/bareos/src/bareos/build/CMakeFiles/CMakeTmp
Run Build Command(s):/usr/bin/make cmTC_9cbe0/fast && /usr/bin/make -f CMakeFiles/cmTC_9cbe0.dir/build.make CMakeFiles/cmTC_9cbe0.dir/build
make[1]: Verzeichnis „/var/tmp/pamac-build-apachler/bareos/src/bareos/build/CMakeFiles/CMakeTmp“ wird betreten
Building C object CMakeFiles/cmTC_9cbe0.dir/HAVE_SYS_SOCKIO_H.c.o
/usr/bin/cc -D_FILE_OFFSET_BITS=64 -march=x86-64 -mtune=generic -O2 -pipe -fstack-protector-strong -fno-plt -fdebug-prefix-map=/var/tmp/pamac-build-apachler/bareos/src/bareos/core=. -fmacro-prefix-map=/var/tmp/pamac-build-apachler/bareos/src/bareos/core=. -Wall -o CMakeFiles/cmTC_9cbe0.dir/HAVE_SYS_SOCKIO_H.c.o -c /var/tmp/pamac-build-apachler/bareos/src/bareos/build/CMakeFiles/CheckIncludeFiles/HAVE_SYS_SOCKIO_H.c
/var/tmp/pamac-build-apachler/bareos/src/bareos/build/CMakeFiles/CheckIncludeFiles/HAVE_SYS_SOCKIO_H.c:2:10: schwerwiegender Fehler: sys/sockio.h: Datei oder Verzeichnis nicht gefunden
2 | #include <sys/sockio.h>
| ^~~~~~~~~~~~~~
Kompilierung beendet.
make[1]: *** [CMakeFiles/cmTC_9cbe0.dir/build.make:86: CMakeFiles/cmTC_9cbe0.dir/HAVE_SYS_SOCKIO_H.c.o] Fehler 1
make[1]: Verzeichnis „/var/tmp/pamac-build-apachler/bareos/src/bareos/build/CMakeFiles/CMakeTmp“ wird verlassen
make: *** [Makefile:141: cmTC_9cbe0/fast] Fehler 2
Source:
/* */
#include <sys/sockio.h>
int main(void){return 0;}
Determining if files sys/types.h;sys/tape.h exist failed with the following output:
Change Dir: /var/tmp/pamac-build-apachler/bareos/src/bareos/build/CMakeFiles/CMakeTmp
Run Build Command(s):/usr/bin/make cmTC_4196d/fast && /usr/bin/make -f CMakeFiles/cmTC_4196d.dir/build.make CMakeFiles/cmTC_4196d.dir/build
make[1]: Verzeichnis „/var/tmp/pamac-build-apachler/bareos/src/bareos/build/CMakeFiles/CMakeTmp“ wird betreten
Building C object CMakeFiles/cmTC_4196d.dir/HAVE_SYS_TAPE_H.c.o
/usr/bin/cc -D_FILE_OFFSET_BITS=64 -march=x86-64 -mtune=generic -O2 -pipe -fstack-protector-strong -fno-plt -fdebug-prefix-map=/var/tmp/pamac-build-apachler/bareos/src/bareos/core=. -fmacro-prefix-map=/var/tmp/pamac-build-apachler/bareos/src/bareos/core=. -Wall -o CMakeFiles/cmTC_4196d.dir/HAVE_SYS_TAPE_H.c.o -c /var/tmp/pamac-build-apachler/bareos/src/bareos/build/CMakeFiles/CheckIncludeFiles/HAVE_SYS_TAPE_H.c
/var/tmp/pamac-build-apachler/bareos/src/bareos/build/CMakeFiles/CheckIncludeFiles/HAVE_SYS_TAPE_H.c:3:10: schwerwiegender Fehler: sys/tape.h: Datei oder Verzeichnis nicht gefunden
3 | #include <sys/tape.h>
| ^~~~~~~~~~~~
Kompilierung beendet.
make[1]: *** [CMakeFiles/cmTC_4196d.dir/build.make:86: CMakeFiles/cmTC_4196d.dir/HAVE_SYS_TAPE_H.c.o] Fehler 1
make[1]: Verzeichnis „/var/tmp/pamac-build-apachler/bareos/src/bareos/build/CMakeFiles/CMakeTmp“ wird verlassen
make: *** [Makefile:141: cmTC_4196d/fast] Fehler 2
Source:
/* */
#include <sys/types.h>
#include <sys/tape.h>
int main(void){return 0;}
Determining if files varargs.h exist failed with the following output:
Change Dir: /var/tmp/pamac-build-apachler/bareos/src/bareos/build/CMakeFiles/CMakeTmp
Run Build Command(s):/usr/bin/make cmTC_d6741/fast && /usr/bin/make -f CMakeFiles/cmTC_d6741.dir/build.make CMakeFiles/cmTC_d6741.dir/build
make[1]: Verzeichnis „/var/tmp/pamac-build-apachler/bareos/src/bareos/build/CMakeFiles/CMakeTmp“ wird betreten
Building C object CMakeFiles/cmTC_d6741.dir/HAVE_VARARGS_H.c.o
/usr/bin/cc -D_FILE_OFFSET_BITS=64 -march=x86-64 -mtune=generic -O2 -pipe -fstack-protector-strong -fno-plt -fdebug-prefix-map=/var/tmp/pamac-build-apachler/bareos/src/bareos/core=. -fmacro-prefix-map=/var/tmp/pamac-build-apachler/bareos/src/bareos/core=. -Wall -o CMakeFiles/cmTC_d6741.dir/HAVE_VARARGS_H.c.o -c /var/tmp/pamac-build-apachler/bareos/src/bareos/build/CMakeFiles/CheckIncludeFiles/HAVE_VARARGS_H.c
In Datei, eingebunden von /var/tmp/pamac-build-apachler/bareos/src/bareos/build/CMakeFiles/CheckIncludeFiles/HAVE_VARARGS_H.c:2:
/usr/lib/gcc/x86_64-pc-linux-gnu/9.3.0/include/varargs.h:4:2: Fehler: #error "GCC no longer implements <varargs.h>."
4 | #error "GCC no longer implements <varargs.h>."
| ^~~~~
/usr/lib/gcc/x86_64-pc-linux-gnu/9.3.0/include/varargs.h:5:2: Fehler: #error "Revise your code to use <stdarg.h>."
5 | #error "Revise your code to use <stdarg.h>."
| ^~~~~
make[1]: *** [CMakeFiles/cmTC_d6741.dir/build.make:86: CMakeFiles/cmTC_d6741.dir/HAVE_VARARGS_H.c.o] Fehler 1
make[1]: Verzeichnis „/var/tmp/pamac-build-apachler/bareos/src/bareos/build/CMakeFiles/CMakeTmp“ wird verlassen
make: *** [Makefile:141: cmTC_d6741/fast] Fehler 2
Source:
/* */
#include <varargs.h>
int main(void){return 0;}
Determining if files NSI exist failed with the following output:
Change Dir: /var/tmp/pamac-build-apachler/bareos/src/bareos/build/CMakeFiles/CMakeTmp
Run Build Command(s):/usr/bin/make cmTC_1fe8a/fast && /usr/bin/make -f CMakeFiles/cmTC_1fe8a.dir/build.make CMakeFiles/cmTC_1fe8a.dir/build
make[1]: Verzeichnis „/var/tmp/pamac-build-apachler/bareos/src/bareos/build/CMakeFiles/CMakeTmp“ wird betreten
Building C object CMakeFiles/cmTC_1fe8a.dir/HAVE_NSI.c.o
/usr/bin/cc -D_FILE_OFFSET_BITS=64 -march=x86-64 -mtune=generic -O2 -pipe -fstack-protector-strong -fno-plt -fdebug-prefix-map=/var/tmp/pamac-build-apachler/bareos/src/bareos/core=. -fmacro-prefix-map=/var/tmp/pamac-build-apachler/bareos/src/bareos/core=. -Wall -o CMakeFiles/cmTC_1fe8a.dir/HAVE_NSI.c.o -c /var/tmp/pamac-build-apachler/bareos/src/bareos/build/CMakeFiles/CheckIncludeFiles/HAVE_NSI.c
/var/tmp/pamac-build-apachler/bareos/src/bareos/build/CMakeFiles/CheckIncludeFiles/HAVE_NSI.c:2:10: schwerwiegender Fehler: NSI: Datei oder Verzeichnis nicht gefunden
2 | #include <NSI>
| ^~~~~
Kompilierung beendet.
make[1]: *** [CMakeFiles/cmTC_1fe8a.dir/build.make:86: CMakeFiles/cmTC_1fe8a.dir/HAVE_NSI.c.o] Fehler 1
make[1]: Verzeichnis „/var/tmp/pamac-build-apachler/bareos/src/bareos/build/CMakeFiles/CMakeTmp“ wird verlassen
make: *** [Makefile:141: cmTC_1fe8a/fast] Fehler 2
Source:
/* */
#include <NSI>
int main(void){return 0;}
Determining if files umem.h exist failed with the following output:
Change Dir: /var/tmp/pamac-build-apachler/bareos/src/bareos/build/CMakeFiles/CMakeTmp
Run Build Command(s):/usr/bin/make cmTC_5f57e/fast && /usr/bin/make -f CMakeFiles/cmTC_5f57e.dir/build.make CMakeFiles/cmTC_5f57e.dir/build
make[1]: Verzeichnis „/var/tmp/pamac-build-apachler/bareos/src/bareos/build/CMakeFiles/CMakeTmp“ wird betreten
Building C object CMakeFiles/cmTC_5f57e.dir/HAVE_UMEM_H.c.o
/usr/bin/cc -D_FILE_OFFSET_BITS=64 -march=x86-64 -mtune=generic -O2 -pipe -fstack-protector-strong -fno-plt -fdebug-prefix-map=/var/tmp/pamac-build-apachler/bareos/src/bareos/core=. -fmacro-prefix-map=/var/tmp/pamac-build-apachler/bareos/src/bareos/core=. -Wall -o CMakeFiles/cmTC_5f57e.dir/HAVE_UMEM_H.c.o -c /var/tmp/pamac-build-apachler/bareos/src/bareos/build/CMakeFiles/CheckIncludeFiles/HAVE_UMEM_H.c
/var/tmp/pamac-build-apachler/bareos/src/bareos/build/CMakeFiles/CheckIncludeFiles/HAVE_UMEM_H.c:2:10: schwerwiegender Fehler: umem.h: Datei oder Verzeichnis nicht gefunden
2 | #include <umem.h>
| ^~~~~~~~
Kompilierung beendet.
make[1]: *** [CMakeFiles/cmTC_5f57e.dir/build.make:86: CMakeFiles/cmTC_5f57e.dir/HAVE_UMEM_H.c.o] Fehler 1
make[1]: Verzeichnis „/var/tmp/pamac-build-apachler/bareos/src/bareos/build/CMakeFiles/CMakeTmp“ wird verlassen
make: *** [Makefile:141: cmTC_5f57e/fast] Fehler 2
Source:
/* */
#include <umem.h>
int main(void){return 0;}
Determining if files acl.h exist failed with the following output:
Change Dir: /var/tmp/pamac-build-apachler/bareos/src/bareos/build/CMakeFiles/CMakeTmp
Run Build Command(s):/usr/bin/make cmTC_cccc9/fast && /usr/bin/make -f CMakeFiles/cmTC_cccc9.dir/build.make CMakeFiles/cmTC_cccc9.dir/build
make[1]: Verzeichnis „/var/tmp/pamac-build-apachler/bareos/src/bareos/build/CMakeFiles/CMakeTmp“ wird betreten
Building C object CMakeFiles/cmTC_cccc9.dir/HAVE_ACL_H.c.o
/usr/bin/cc -D_FILE_OFFSET_BITS=64 -march=x86-64 -mtune=generic -O2 -pipe -fstack-protector-strong -fno-plt -fdebug-prefix-map=/var/tmp/pamac-build-apachler/bareos/src/bareos/core=. -fmacro-prefix-map=/var/tmp/pamac-build-apachler/bareos/src/bareos/core=. -Wall -o CMakeFiles/cmTC_cccc9.dir/HAVE_ACL_H.c.o -c /var/tmp/pamac-build-apachler/bareos/src/bareos/build/CMakeFiles/CheckIncludeFiles/HAVE_ACL_H.c
/var/tmp/pamac-build-apachler/bareos/src/bareos/build/CMakeFiles/CheckIncludeFiles/HAVE_ACL_H.c:2:10: schwerwiegender Fehler: acl.h: Datei oder Verzeichnis nicht gefunden
2 | #include <acl.h>
| ^~~~~~~
Kompilierung beendet.
make[1]: *** [CMakeFiles/cmTC_cccc9.dir/build.make:86: CMakeFiles/cmTC_cccc9.dir/HAVE_ACL_H.c.o] Fehler 1
make[1]: Verzeichnis „/var/tmp/pamac-build-apachler/bareos/src/bareos/build/CMakeFiles/CMakeTmp“ wird verlassen
make: *** [Makefile:141: cmTC_cccc9/fast] Fehler 2
Source:
/* */
#include <acl.h>
int main(void){return 0;}
Determining if files sys/proplist.h exist failed with the following output:
Change Dir: /var/tmp/pamac-build-apachler/bareos/src/bareos/build/CMakeFiles/CMakeTmp
Run Build Command(s):/usr/bin/make cmTC_c257e/fast && /usr/bin/make -f CMakeFiles/cmTC_c257e.dir/build.make CMakeFiles/cmTC_c257e.dir/build
make[1]: Verzeichnis „/var/tmp/pamac-build-apachler/bareos/src/bareos/build/CMakeFiles/CMakeTmp“ wird betreten
Building C object CMakeFiles/cmTC_c257e.dir/HAVE_SYS_PROPLIST_H.c.o
/usr/bin/cc -D_FILE_OFFSET_BITS=64 -march=x86-64 -mtune=generic -O2 -pipe -fstack-protector-strong -fno-plt -fdebug-prefix-map=/var/tmp/pamac-build-apachler/bareos/src/bareos/core=. -fmacro-prefix-map=/var/tmp/pamac-build-apachler/bareos/src/bareos/core=. -Wall -o CMakeFiles/cmTC_c257e.dir/HAVE_SYS_PROPLIST_H.c.o -c /var/tmp/pamac-build-apachler/bareos/src/bareos/build/CMakeFiles/CheckIncludeFiles/HAVE_SYS_PROPLIST_H.c
/var/tmp/pamac-build-apachler/bareos/src/bareos/build/CMakeFiles/CheckIncludeFiles/HAVE_SYS_PROPLIST_H.c:2:10: schwerwiegender Fehler: sys/proplist.h: Datei oder Verzeichnis nicht gefunden
2 | #include <sys/proplist.h>
| ^~~~~~~~~~~~~~~~
Kompilierung beendet.
make[1]: *** [CMakeFiles/cmTC_c257e.dir/build.make:86: CMakeFiles/cmTC_c257e.dir/HAVE_SYS_PROPLIST_H.c.o] Fehler 1
make[1]: Verzeichnis „/var/tmp/pamac-build-apachler/bareos/src/bareos/build/CMakeFiles/CMakeTmp“ wird verlassen
make: *** [Makefile:141: cmTC_c257e/fast] Fehler 2
Source:
/* */
#include <sys/proplist.h>
int main(void){return 0;}
Determining if files api/glfs.h exist failed with the following output:
Change Dir: /var/tmp/pamac-build-apachler/bareos/src/bareos/build/CMakeFiles/CMakeTmp
Run Build Command(s):/usr/bin/make cmTC_b801b/fast && /usr/bin/make -f CMakeFiles/cmTC_b801b.dir/build.make CMakeFiles/cmTC_b801b.dir/build
make[1]: Verzeichnis „/var/tmp/pamac-build-apachler/bareos/src/bareos/build/CMakeFiles/CMakeTmp“ wird betreten
Building C object CMakeFiles/cmTC_b801b.dir/HAVE_API_GLFS_H.c.o
/usr/bin/cc -D_FILE_OFFSET_BITS=64 -march=x86-64 -mtune=generic -O2 -pipe -fstack-protector-strong -fno-plt -fdebug-prefix-map=/var/tmp/pamac-build-apachler/bareos/src/bareos/core=. -fmacro-prefix-map=/var/tmp/pamac-build-apachler/bareos/src/bareos/core=. -Wall -o CMakeFiles/cmTC_b801b.dir/HAVE_API_GLFS_H.c.o -c /var/tmp/pamac-build-apachler/bareos/src/bareos/build/CMakeFiles/CheckIncludeFiles/HAVE_API_GLFS_H.c
/var/tmp/pamac-build-apachler/bareos/src/bareos/build/CMakeFiles/CheckIncludeFiles/HAVE_API_GLFS_H.c:2:10: schwerwiegender Fehler: api/glfs.h: Datei oder Verzeichnis nicht gefunden
2 | #include <api/glfs.h>
| ^~~~~~~~~~~~
Kompilierung beendet.
make[1]: *** [CMakeFiles/cmTC_b801b.dir/build.make:86: CMakeFiles/cmTC_b801b.dir/HAVE_API_GLFS_H.c.o] Fehler 1
make[1]: Verzeichnis „/var/tmp/pamac-build-apachler/bareos/src/bareos/build/CMakeFiles/CMakeTmp“ wird verlassen
make: *** [Makefile:141: cmTC_b801b/fast] Fehler 2
Source:
/* */
#include <api/glfs.h>
int main(void){return 0;}
Determining if files glusterfs/api/glfs.h exist failed with the following output:
Change Dir: /var/tmp/pamac-build-apachler/bareos/src/bareos/build/CMakeFiles/CMakeTmp
Run Build Command(s):/usr/bin/make cmTC_80acd/fast && /usr/bin/make -f CMakeFiles/cmTC_80acd.dir/build.make CMakeFiles/cmTC_80acd.dir/build
make[1]: Verzeichnis „/var/tmp/pamac-build-apachler/bareos/src/bareos/build/CMakeFiles/CMakeTmp“ wird betreten
Building C object CMakeFiles/cmTC_80acd.dir/HAVE_GLUSTERFS_API_GLFS_H.c.o
/usr/bin/cc -D_FILE_OFFSET_BITS=64 -march=x86-64 -mtune=generic -O2 -pipe -fstack-protector-strong -fno-plt -fdebug-prefix-map=/var/tmp/pamac-build-apachler/bareos/src/bareos/core=. -fmacro-prefix-map=/var/tmp/pamac-build-apachler/bareos/src/bareos/core=. -Wall -o CMakeFiles/cmTC_80acd.dir/HAVE_GLUSTERFS_API_GLFS_H.c.o -c /var/tmp/pamac-build-apachler/bareos/src/bareos/build/CMakeFiles/CheckIncludeFiles/HAVE_GLUSTERFS_API_GLFS_H.c
/var/tmp/pamac-build-apachler/bareos/src/bareos/build/CMakeFiles/CheckIncludeFiles/HAVE_GLUSTERFS_API_GLFS_H.c:2:10: schwerwiegender Fehler: glusterfs/api/glfs.h: Datei oder Verzeichnis nicht gefunden
2 | #include <glusterfs/api/glfs.h>
| ^~~~~~~~~~~~~~~~~~~~~~
Kompilierung beendet.
make[1]: *** [CMakeFiles/cmTC_80acd.dir/build.make:86: CMakeFiles/cmTC_80acd.dir/HAVE_GLUSTERFS_API_GLFS_H.c.o] Fehler 1
make[1]: Verzeichnis „/var/tmp/pamac-build-apachler/bareos/src/bareos/build/CMakeFiles/CMakeTmp“ wird verlassen
make: *** [Makefile:141: cmTC_80acd/fast] Fehler 2
Source:
/* */
#include <glusterfs/api/glfs.h>
int main(void){return 0;}
Determining if files elasto/data.h exist failed with the following output:
Change Dir: /var/tmp/pamac-build-apachler/bareos/src/bareos/build/CMakeFiles/CMakeTmp
Run Build Command(s):/usr/bin/make cmTC_66dbc/fast && /usr/bin/make -f CMakeFiles/cmTC_66dbc.dir/build.make CMakeFiles/cmTC_66dbc.dir/build
make[1]: Verzeichnis „/var/tmp/pamac-build-apachler/bareos/src/bareos/build/CMakeFiles/CMakeTmp“ wird betreten
Building C object CMakeFiles/cmTC_66dbc.dir/HAVE_ELASTO_DATA_H.c.o
/usr/bin/cc -D_FILE_OFFSET_BITS=64 -march=x86-64 -mtune=generic -O2 -pipe -fstack-protector-strong -fno-plt -fdebug-prefix-map=/var/tmp/pamac-build-apachler/bareos/src/bareos/core=. -fmacro-prefix-map=/var/tmp/pamac-build-apachler/bareos/src/bareos/core=. -Wall -o CMakeFiles/cmTC_66dbc.dir/HAVE_ELASTO_DATA_H.c.o -c /var/tmp/pamac-build-apachler/bareos/src/bareos/build/CMakeFiles/CheckIncludeFiles/HAVE_ELASTO_DATA_H.c
/var/tmp/pamac-build-apachler/bareos/src/bareos/build/CMakeFiles/CheckIncludeFiles/HAVE_ELASTO_DATA_H.c:2:10: schwerwiegender Fehler: elasto/data.h: Datei oder Verzeichnis nicht gefunden
2 | #include <elasto/data.h>
| ^~~~~~~~~~~~~~~
Kompilierung beendet.
make[1]: *** [CMakeFiles/cmTC_66dbc.dir/build.make:86: CMakeFiles/cmTC_66dbc.dir/HAVE_ELASTO_DATA_H.c.o] Fehler 1
make[1]: Verzeichnis „/var/tmp/pamac-build-apachler/bareos/src/bareos/build/CMakeFiles/CMakeTmp“ wird verlassen
make: *** [Makefile:141: cmTC_66dbc/fast] Fehler 2
Source:
/* */
#include <elasto/data.h>
int main(void){return 0;}
Determining if files elasto/file.h exist failed with the following output:
Change Dir: /var/tmp/pamac-build-apachler/bareos/src/bareos/build/CMakeFiles/CMakeTmp
Run Build Command(s):/usr/bin/make cmTC_c05e6/fast && /usr/bin/make -f CMakeFiles/cmTC_c05e6.dir/build.make CMakeFiles/cmTC_c05e6.dir/build
make[1]: Verzeichnis „/var/tmp/pamac-build-apachler/bareos/src/bareos/build/CMakeFiles/CMakeTmp“ wird betreten
Building C object CMakeFiles/cmTC_c05e6.dir/HAVE_ELASTO_FILE_H.c.o
/usr/bin/cc -D_FILE_OFFSET_BITS=64 -march=x86-64 -mtune=generic -O2 -pipe -fstack-protector-strong -fno-plt -fdebug-prefix-map=/var/tmp/pamac-build-apachler/bareos/src/bareos/core=. -fmacro-prefix-map=/var/tmp/pamac-build-apachler/bareos/src/bareos/core=. -Wall -o CMakeFiles/cmTC_c05e6.dir/HAVE_ELASTO_FILE_H.c.o -c /var/tmp/pamac-build-apachler/bareos/src/bareos/build/CMakeFiles/CheckIncludeFiles/HAVE_ELASTO_FILE_H.c
/var/tmp/pamac-build-apachler/bareos/src/bareos/build/CMakeFiles/CheckIncludeFiles/HAVE_ELASTO_FILE_H.c:2:10: schwerwiegender Fehler: elasto/file.h: Datei oder Verzeichnis nicht gefunden
2 | #include <elasto/file.h>
| ^~~~~~~~~~~~~~~
Kompilierung beendet.
make[1]: *** [CMakeFiles/cmTC_c05e6.dir/build.make:86: CMakeFiles/cmTC_c05e6.dir/HAVE_ELASTO_FILE_H.c.o] Fehler 1
make[1]: Verzeichnis „/var/tmp/pamac-build-apachler/bareos/src/bareos/build/CMakeFiles/CMakeTmp“ wird verlassen
make: *** [Makefile:141: cmTC_c05e6/fast] Fehler 2
Source:
/* */
#include <elasto/file.h>
int main(void){return 0;}
Determining if files sys/types.h;sys/scsi/impl/uscsi.h exist failed with the following output:
Change Dir: /var/tmp/pamac-build-apachler/bareos/src/bareos/build/CMakeFiles/CMakeTmp
Run Build Command(s):/usr/bin/make cmTC_f56aa/fast && /usr/bin/make -f CMakeFiles/cmTC_f56aa.dir/build.make CMakeFiles/cmTC_f56aa.dir/build
make[1]: Verzeichnis „/var/tmp/pamac-build-apachler/bareos/src/bareos/build/CMakeFiles/CMakeTmp“ wird betreten
Building C object CMakeFiles/cmTC_f56aa.dir/HAVE_SYS_SCSI_IMPL_USCSI_H.c.o
/usr/bin/cc -D_FILE_OFFSET_BITS=64 -march=x86-64 -mtune=generic -O2 -pipe -fstack-protector-strong -fno-plt -fdebug-prefix-map=/var/tmp/pamac-build-apachler/bareos/src/bareos/core=. -fmacro-prefix-map=/var/tmp/pamac-build-apachler/bareos/src/bareos/core=. -Wall -o CMakeFiles/cmTC_f56aa.dir/HAVE_SYS_SCSI_IMPL_USCSI_H.c.o -c /var/tmp/pamac-build-apachler/bareos/src/bareos/build/CMakeFiles/CheckIncludeFiles/HAVE_SYS_SCSI_IMPL_USCSI_H.c
/var/tmp/pamac-build-apachler/bareos/src/bareos/build/CMakeFiles/CheckIncludeFiles/HAVE_SYS_SCSI_IMPL_USCSI_H.c:3:10: schwerwiegender Fehler: sys/scsi/impl/uscsi.h: Datei oder Verzeichnis nicht gefunden
3 | #include <sys/scsi/impl/uscsi.h>
| ^~~~~~~~~~~~~~~~~~~~~~~
Kompilierung beendet.
make[1]: *** [CMakeFiles/cmTC_f56aa.dir/build.make:86: CMakeFiles/cmTC_f56aa.dir/HAVE_SYS_SCSI_IMPL_USCSI_H.c.o] Fehler 1
make[1]: Verzeichnis „/var/tmp/pamac-build-apachler/bareos/src/bareos/build/CMakeFiles/CMakeTmp“ wird verlassen
make: *** [Makefile:141: cmTC_f56aa/fast] Fehler 2
Source:
/* */
#include <sys/types.h>
#include <sys/scsi/impl/uscsi.h>
int main(void){return 0;}
Determining if files stdio.h;camlib.h exist failed with the following output:
Change Dir: /var/tmp/pamac-build-apachler/bareos/src/bareos/build/CMakeFiles/CMakeTmp
Run Build Command(s):/usr/bin/make cmTC_1b8fd/fast && /usr/bin/make -f CMakeFiles/cmTC_1b8fd.dir/build.make CMakeFiles/cmTC_1b8fd.dir/build
make[1]: Verzeichnis „/var/tmp/pamac-build-apachler/bareos/src/bareos/build/CMakeFiles/CMakeTmp“ wird betreten
Building C object CMakeFiles/cmTC_1b8fd.dir/HAVE_CAMLIB_H.c.o
/usr/bin/cc -D_FILE_OFFSET_BITS=64 -march=x86-64 -mtune=generic -O2 -pipe -fstack-protector-strong -fno-plt -fdebug-prefix-map=/var/tmp/pamac-build-apachler/bareos/src/bareos/core=. -fmacro-prefix-map=/var/tmp/pamac-build-apachler/bareos/src/bareos/core=. -Wall -o CMakeFiles/cmTC_1b8fd.dir/HAVE_CAMLIB_H.c.o -c /var/tmp/pamac-build-apachler/bareos/src/bareos/build/CMakeFiles/CheckIncludeFiles/HAVE_CAMLIB_H.c
/var/tmp/pamac-build-apachler/bareos/src/bareos/build/CMakeFiles/CheckIncludeFiles/HAVE_CAMLIB_H.c:3:10: schwerwiegender Fehler: camlib.h: Datei oder Verzeichnis nicht gefunden
3 | #include <camlib.h>
| ^~~~~~~~~~
Kompilierung beendet.
make[1]: *** [CMakeFiles/cmTC_1b8fd.dir/build.make:86: CMakeFiles/cmTC_1b8fd.dir/HAVE_CAMLIB_H.c.o] Fehler 1
make[1]: Verzeichnis „/var/tmp/pamac-build-apachler/bareos/src/bareos/build/CMakeFiles/CMakeTmp“ wird verlassen
make: *** [Makefile:141: cmTC_1b8fd/fast] Fehler 2
Source:
/* */
#include <stdio.h>
#include <camlib.h>
int main(void){return 0;}
Determining if files cam/scsi/scsi_message.h exist failed with the following output:
Change Dir: /var/tmp/pamac-build-apachler/bareos/src/bareos/build/CMakeFiles/CMakeTmp
Run Build Command(s):/usr/bin/make cmTC_9ac57/fast && /usr/bin/make -f CMakeFiles/cmTC_9ac57.dir/build.make CMakeFiles/cmTC_9ac57.dir/build
make[1]: Verzeichnis „/var/tmp/pamac-build-apachler/bareos/src/bareos/build/CMakeFiles/CMakeTmp“ wird betreten
Building C object CMakeFiles/cmTC_9ac57.dir/HAVE_CAM_SCSI_SCSI_MESSAGE_H.c.o
/usr/bin/cc -D_FILE_OFFSET_BITS=64 -march=x86-64 -mtune=generic -O2 -pipe -fstack-protector-strong -fno-plt -fdebug-prefix-map=/var/tmp/pamac-build-apachler/bareos/src/bareos/core=. -fmacro-prefix-map=/var/tmp/pamac-build-apachler/bareos/src/bareos/core=. -Wall -o CMakeFiles/cmTC_9ac57.dir/HAVE_CAM_SCSI_SCSI_MESSAGE_H.c.o -c /var/tmp/pamac-build-apachler/bareos/src/bareos/build/CMakeFiles/CheckIncludeFiles/HAVE_CAM_SCSI_SCSI_MESSAGE_H.c
/var/tmp/pamac-build-apachler/bareos/src/bareos/build/CMakeFiles/CheckIncludeFiles/HAVE_CAM_SCSI_SCSI_MESSAGE_H.c:2:10: schwerwiegender Fehler: cam/scsi/scsi_message.h: Datei oder Verzeichnis nicht gefunden
2 | #include <cam/scsi/scsi_message.h>
| ^~~~~~~~~~~~~~~~~~~~~~~~~
Kompilierung beendet.
make[1]: *** [CMakeFiles/cmTC_9ac57.dir/build.make:86: CMakeFiles/cmTC_9ac57.dir/HAVE_CAM_SCSI_SCSI_MESSAGE_H.c.o] Fehler 1
make[1]: Verzeichnis „/var/tmp/pamac-build-apachler/bareos/src/bareos/build/CMakeFiles/CMakeTmp“ wird verlassen
make: *** [Makefile:141: cmTC_9ac57/fast] Fehler 2
Source:
/* */
#include <cam/scsi/scsi_message.h>
int main(void){return 0;}
Determining if files dev/scsipi/scsipi_all.h exist failed with the following output:
Change Dir: /var/tmp/pamac-build-apachler/bareos/src/bareos/build/CMakeFiles/CMakeTmp
Run Build Command(s):/usr/bin/make cmTC_37c9a/fast && /usr/bin/make -f CMakeFiles/cmTC_37c9a.dir/build.make CMakeFiles/cmTC_37c9a.dir/build
make[1]: Verzeichnis „/var/tmp/pamac-build-apachler/bareos/src/bareos/build/CMakeFiles/CMakeTmp“ wird betreten
Building C object CMakeFiles/cmTC_37c9a.dir/HAVE_DEV_SCSIPI_SCSIPI_ALL_H.c.o
/usr/bin/cc -D_FILE_OFFSET_BITS=64 -march=x86-64 -mtune=generic -O2 -pipe -fstack-protector-strong -fno-plt -fdebug-prefix-map=/var/tmp/pamac-build-apachler/bareos/src/bareos/core=. -fmacro-prefix-map=/var/tmp/pamac-build-apachler/bareos/src/bareos/core=. -Wall -o CMakeFiles/cmTC_37c9a.dir/HAVE_DEV_SCSIPI_SCSIPI_ALL_H.c.o -c /var/tmp/pamac-build-apachler/bareos/src/bareos/build/CMakeFiles/CheckIncludeFiles/HAVE_DEV_SCSIPI_SCSIPI_ALL_H.c
/var/tmp/pamac-build-apachler/bareos/src/bareos/build/CMakeFiles/CheckIncludeFiles/HAVE_DEV_SCSIPI_SCSIPI_ALL_H.c:2:10: schwerwiegender Fehler: dev/scsipi/scsipi_all.h: Datei oder Verzeichnis nicht gefunden
2 | #include <dev/scsipi/scsipi_all.h>
| ^~~~~~~~~~~~~~~~~~~~~~~~~
Kompilierung beendet.
make[1]: *** [CMakeFiles/cmTC_37c9a.dir/build.make:86: CMakeFiles/cmTC_37c9a.dir/HAVE_DEV_SCSIPI_SCSIPI_ALL_H.c.o] Fehler 1
make[1]: Verzeichnis „/var/tmp/pamac-build-apachler/bareos/src/bareos/build/CMakeFiles/CMakeTmp“ wird verlassen
make: *** [Makefile:141: cmTC_37c9a/fast] Fehler 2
Source:
/* */
#include <dev/scsipi/scsipi_all.h>
int main(void){return 0;}
Determining if files scsi/uscsi_all.h exist failed with the following output:
Change Dir: /var/tmp/pamac-build-apachler/bareos/src/bareos/build/CMakeFiles/CMakeTmp
Run Build Command(s):/usr/bin/make cmTC_dd6c7/fast && /usr/bin/make -f CMakeFiles/cmTC_dd6c7.dir/build.make CMakeFiles/cmTC_dd6c7.dir/build
make[1]: Verzeichnis „/var/tmp/pamac-build-apachler/bareos/src/bareos/build/CMakeFiles/CMakeTmp“ wird betreten
Building C object CMakeFiles/cmTC_dd6c7.dir/HAVE_USCSI_ALL_H.c.o
/usr/bin/cc -D_FILE_OFFSET_BITS=64 -march=x86-64 -mtune=generic -O2 -pipe -fstack-protector-strong -fno-plt -fdebug-prefix-map=/var/tmp/pamac-build-apachler/bareos/src/bareos/core=. -fmacro-prefix-map=/var/tmp/pamac-build-apachler/bareos/src/bareos/core=. -Wall -o CMakeFiles/cmTC_dd6c7.dir/HAVE_USCSI_ALL_H.c.o -c /var/tmp/pamac-build-apachler/bareos/src/bareos/build/CMakeFiles/CheckIncludeFiles/HAVE_USCSI_ALL_H.c
/var/tmp/pamac-build-apachler/bareos/src/bareos/build/CMakeFiles/CheckIncludeFiles/HAVE_USCSI_ALL_H.c:2:10: schwerwiegender Fehler: scsi/uscsi_all.h: Datei oder Verzeichnis nicht gefunden
2 | #include <scsi/uscsi_all.h>
| ^~~~~~~~~~~~~~~~~~
Kompilierung beendet.
make[1]: *** [CMakeFiles/cmTC_dd6c7.dir/build.make:86: CMakeFiles/cmTC_dd6c7.dir/HAVE_USCSI_ALL_H.c.o] Fehler 1
make[1]: Verzeichnis „/var/tmp/pamac-build-apachler/bareos/src/bareos/build/CMakeFiles/CMakeTmp“ wird verlassen
make: *** [Makefile:141: cmTC_dd6c7/fast] Fehler 2
Source:
/* */
#include <scsi/uscsi_all.h>
int main(void){return 0;}
Determining if files scsi/uscsi_all.h exist failed with the following output:
Change Dir: /var/tmp/pamac-build-apachler/bareos/src/bareos/build/CMakeFiles/CMakeTmp
Run Build Command(s):/usr/bin/make cmTC_36809/fast && /usr/bin/make -f CMakeFiles/cmTC_36809.dir/build.make CMakeFiles/cmTC_36809.dir/build
make[1]: Verzeichnis „/var/tmp/pamac-build-apachler/bareos/src/bareos/build/CMakeFiles/CMakeTmp“ wird betreten
Building C object CMakeFiles/cmTC_36809.dir/HAVE_SCSI_USCSI_ALL_H.c.o
/usr/bin/cc -D_FILE_OFFSET_BITS=64 -march=x86-64 -mtune=generic -O2 -pipe -fstack-protector-strong -fno-plt -fdebug-prefix-map=/var/tmp/pamac-build-apachler/bareos/src/bareos/core=. -fmacro-prefix-map=/var/tmp/pamac-build-apachler/bareos/src/bareos/core=. -Wall -o CMakeFiles/cmTC_36809.dir/HAVE_SCSI_USCSI_ALL_H.c.o -c /var/tmp/pamac-build-apachler/bareos/src/bareos/build/CMakeFiles/CheckIncludeFiles/HAVE_SCSI_USCSI_ALL_H.c
/var/tmp/pamac-build-apachler/bareos/src/bareos/build/CMakeFiles/CheckIncludeFiles/HAVE_SCSI_USCSI_ALL_H.c:2:10: schwerwiegender Fehler: scsi/uscsi_all.h: Datei oder Verzeichnis nicht gefunden
2 | #include <scsi/uscsi_all.h>
| ^~~~~~~~~~~~~~~~~~
Kompilierung beendet.
make[1]: *** [CMakeFiles/cmTC_36809.dir/build.make:86: CMakeFiles/cmTC_36809.dir/HAVE_SCSI_USCSI_ALL_H.c.o] Fehler 1
make[1]: Verzeichnis „/var/tmp/pamac-build-apachler/bareos/src/bareos/build/CMakeFiles/CMakeTmp“ wird verlassen
make: *** [Makefile:141: cmTC_36809/fast] Fehler 2
Source:
/* */
#include <scsi/uscsi_all.h>
int main(void){return 0;}
Determining if the function add_proplist_entry exists failed with the following output:
Change Dir: /var/tmp/pamac-build-apachler/bareos/src/bareos/build/CMakeFiles/CMakeTmp
Run Build Command(s):/usr/bin/make cmTC_124b9/fast && /usr/bin/make -f CMakeFiles/cmTC_124b9.dir/build.make CMakeFiles/cmTC_124b9.dir/build
make[1]: Verzeichnis „/var/tmp/pamac-build-apachler/bareos/src/bareos/build/CMakeFiles/CMakeTmp“ wird betreten
Building C object CMakeFiles/cmTC_124b9.dir/CheckFunctionExists.c.o
/usr/bin/cc -D_FILE_OFFSET_BITS=64 -march=x86-64 -mtune=generic -O2 -pipe -fstack-protector-strong -fno-plt -fdebug-prefix-map=/var/tmp/pamac-build-apachler/bareos/src/bareos/core=. -fmacro-prefix-map=/var/tmp/pamac-build-apachler/bareos/src/bareos/core=. -Wall -DCHECK_FUNCTION_EXISTS=add_proplist_entry -o CMakeFiles/cmTC_124b9.dir/CheckFunctionExists.c.o -c /usr/share/cmake-3.17/Modules/CheckFunctionExists.c
Linking C executable cmTC_124b9
/usr/bin/cmake -E cmake_link_script CMakeFiles/cmTC_124b9.dir/link.txt --verbose=1
/usr/bin/cc -march=x86-64 -mtune=generic -O2 -pipe -fstack-protector-strong -fno-plt -fdebug-prefix-map=/var/tmp/pamac-build-apachler/bareos/src/bareos/core=. -fmacro-prefix-map=/var/tmp/pamac-build-apachler/bareos/src/bareos/core=. -Wall -DCHECK_FUNCTION_EXISTS=add_proplist_entry -Wl,-O1,--sort-common,--as-needed,-z,relro,-z,now -rdynamic CMakeFiles/cmTC_124b9.dir/CheckFunctionExists.c.o -o cmTC_124b9
/usr/bin/ld: CMakeFiles/cmTC_124b9.dir/CheckFunctionExists.c.o: in function `main':
CheckFunctionExists.c:(.text.startup+0xd): undefined reference to `add_proplist_entry'
collect2: Fehler: ld gab 1 als Ende-Status zurück
make[1]: *** [CMakeFiles/cmTC_124b9.dir/build.make:107: cmTC_124b9] Fehler 1
make[1]: Verzeichnis „/var/tmp/pamac-build-apachler/bareos/src/bareos/build/CMakeFiles/CMakeTmp“ wird verlassen
make: *** [Makefile:141: cmTC_124b9/fast] Fehler 2
Determining if the function closefrom exists failed with the following output:
Change Dir: /var/tmp/pamac-build-apachler/bareos/src/bareos/build/CMakeFiles/CMakeTmp
Run Build Command(s):/usr/bin/make cmTC_4e658/fast && /usr/bin/make -f CMakeFiles/cmTC_4e658.dir/build.make CMakeFiles/cmTC_4e658.dir/build
make[1]: Verzeichnis „/var/tmp/pamac-build-apachler/bareos/src/bareos/build/CMakeFiles/CMakeTmp“ wird betreten
Building C object CMakeFiles/cmTC_4e658.dir/CheckFunctionExists.c.o
/usr/bin/cc -D_FILE_OFFSET_BITS=64 -march=x86-64 -mtune=generic -O2 -pipe -fstack-protector-strong -fno-plt -fdebug-prefix-map=/var/tmp/pamac-build-apachler/bareos/src/bareos/core=. -fmacro-prefix-map=/var/tmp/pamac-build-apachler/bareos/src/bareos/core=. -Wall -DCHECK_FUNCTION_EXISTS=closefrom -o CMakeFiles/cmTC_4e658.dir/CheckFunctionExists.c.o -c /usr/share/cmake-3.17/Modules/CheckFunctionExists.c
Linking C executable cmTC_4e658
/usr/bin/cmake -E cmake_link_script CMakeFiles/cmTC_4e658.dir/link.txt --verbose=1
/usr/bin/cc -march=x86-64 -mtune=generic -O2 -pipe -fstack-protector-strong -fno-plt -fdebug-prefix-map=/var/tmp/pamac-build-apachler/bareos/src/bareos/core=. -fmacro-prefix-map=/var/tmp/pamac-build-apachler/bareos/src/bareos/core=. -Wall -DCHECK_FUNCTION_EXISTS=closefrom -Wl,-O1,--sort-common,--as-needed,-z,relro,-z,now -rdynamic CMakeFiles/cmTC_4e658.dir/CheckFunctionExists.c.o -o cmTC_4e658
/usr/bin/ld: CMakeFiles/cmTC_4e658.dir/CheckFunctionExists.c.o: in function `main':
CheckFunctionExists.c:(.text.startup+0xd): undefined reference to `closefrom'
collect2: Fehler: ld gab 1 als Ende-Status zurück
make[1]: *** [CMakeFiles/cmTC_4e658.dir/build.make:107: cmTC_4e658] Fehler 1
make[1]: Verzeichnis „/var/tmp/pamac-build-apachler/bareos/src/bareos/build/CMakeFiles/CMakeTmp“ wird verlassen
make: *** [Makefile:141: cmTC_4e658/fast] Fehler 2
Determining if the function extattr_get_file exists failed with the following output:
Change Dir: /var/tmp/pamac-build-apachler/bareos/src/bareos/build/CMakeFiles/CMakeTmp
Run Build Command(s):/usr/bin/make cmTC_2db58/fast && /usr/bin/make -f CMakeFiles/cmTC_2db58.dir/build.make CMakeFiles/cmTC_2db58.dir/build
make[1]: Verzeichnis „/var/tmp/pamac-build-apachler/bareos/src/bareos/build/CMakeFiles/CMakeTmp“ wird betreten
Building C object CMakeFiles/cmTC_2db58.dir/CheckFunctionExists.c.o
/usr/bin/cc -D_FILE_OFFSET_BITS=64 -march=x86-64 -mtune=generic -O2 -pipe -fstack-protector-strong -fno-plt -fdebug-prefix-map=/var/tmp/pamac-build-apachler/bareos/src/bareos/core=. -fmacro-prefix-map=/var/tmp/pamac-build-apachler/bareos/src/bareos/core=. -Wall -DCHECK_FUNCTION_EXISTS=extattr_get_file -o CMakeFiles/cmTC_2db58.dir/CheckFunctionExists.c.o -c /usr/share/cmake-3.17/Modules/CheckFunctionExists.c
Linking C executable cmTC_2db58
/usr/bin/cmake -E cmake_link_script CMakeFiles/cmTC_2db58.dir/link.txt --verbose=1
/usr/bin/cc -march=x86-64 -mtune=generic -O2 -pipe -fstack-protector-strong -fno-plt -fdebug-prefix-map=/var/tmp/pamac-build-apachler/bareos/src/bareos/core=. -fmacro-prefix-map=/var/tmp/pamac-build-apachler/bareos/src/bareos/core=. -Wall -DCHECK_FUNCTION_EXISTS=extattr_get_file -Wl,-O1,--sort-common,--as-needed,-z,relro,-z,now -rdynamic CMakeFiles/cmTC_2db58.dir/CheckFunctionExists.c.o -o cmTC_2db58
/usr/bin/ld: CMakeFiles/cmTC_2db58.dir/CheckFunctionExists.c.o: in function `main':
CheckFunctionExists.c:(.text.startup+0xd): undefined reference to `extattr_get_file'
collect2: Fehler: ld gab 1 als Ende-Status zurück
make[1]: *** [CMakeFiles/cmTC_2db58.dir/build.make:107: cmTC_2db58] Fehler 1
make[1]: Verzeichnis „/var/tmp/pamac-build-apachler/bareos/src/bareos/build/CMakeFiles/CMakeTmp“ wird verlassen
make: *** [Makefile:141: cmTC_2db58/fast] Fehler 2
Determining if the function extattr_get_link exists failed with the following output:
Change Dir: /var/tmp/pamac-build-apachler/bareos/src/bareos/build/CMakeFiles/CMakeTmp
Run Build Command(s):/usr/bin/make cmTC_955a5/fast && /usr/bin/make -f CMakeFiles/cmTC_955a5.dir/build.make CMakeFiles/cmTC_955a5.dir/build
make[1]: Verzeichnis „/var/tmp/pamac-build-apachler/bareos/src/bareos/build/CMakeFiles/CMakeTmp“ wird betreten
Building C object CMakeFiles/cmTC_955a5.dir/CheckFunctionExists.c.o
/usr/bin/cc -D_FILE_OFFSET_BITS=64 -march=x86-64 -mtune=generic -O2 -pipe -fstack-protector-strong -fno-plt -fdebug-prefix-map=/var/tmp/pamac-build-apachler/bareos/src/bareos/core=. -fmacro-prefix-map=/var/tmp/pamac-build-apachler/bareos/src/bareos/core=. -Wall -DCHECK_FUNCTION_EXISTS=extattr_get_link -o CMakeFiles/cmTC_955a5.dir/CheckFunctionExists.c.o -c /usr/share/cmake-3.17/Modules/CheckFunctionExists.c
Linking C executable cmTC_955a5
/usr/bin/cmake -E cmake_link_script CMakeFiles/cmTC_955a5.dir/link.txt --verbose=1
/usr/bin/cc -march=x86-64 -mtune=generic -O2 -pipe -fstack-protector-strong -fno-plt -fdebug-prefix-map=/var/tmp/pamac-build-apachler/bareos/src/bareos/core=. -fmacro-prefix-map=/var/tmp/pamac-build-apachler/bareos/src/bareos/core=. -Wall -DCHECK_FUNCTION_EXISTS=extattr_get_link -Wl,-O1,--sort-common,--as-needed,-z,relro,-z,now -rdynamic CMakeFiles/cmTC_955a5.dir/CheckFunctionExists.c.o -o cmTC_955a5
/usr/bin/ld: CMakeFiles/cmTC_955a5.dir/CheckFunctionExists.c.o: in function `main':
CheckFunctionExists.c:(.text.startup+0xd): undefined reference to `extattr_get_link'
collect2: Fehler: ld gab 1 als Ende-Status zurück
make[1]: *** [CMakeFiles/cmTC_955a5.dir/build.make:107: cmTC_955a5] Fehler 1
make[1]: Verzeichnis „/var/tmp/pamac-build-apachler/bareos/src/bareos/build/CMakeFiles/CMakeTmp“ wird verlassen
make: *** [Makefile:141: cmTC_955a5/fast] Fehler 2
Determining if the function extattr_list_file exists failed with the following output:
Change Dir: /var/tmp/pamac-build-apachler/bareos/src/bareos/build/CMakeFiles/CMakeTmp
Run Build Command(s):/usr/bin/make cmTC_9ee05/fast && /usr/bin/make -f CMakeFiles/cmTC_9ee05.dir/build.make CMakeFiles/cmTC_9ee05.dir/build
make[1]: Verzeichnis „/var/tmp/pamac-build-apachler/bareos/src/bareos/build/CMakeFiles/CMakeTmp“ wird betreten
Building C object CMakeFiles/cmTC_9ee05.dir/CheckFunctionExists.c.o
/usr/bin/cc -D_FILE_OFFSET_BITS=64 -march=x86-64 -mtune=generic -O2 -pipe -fstack-protector-strong -fno-plt -fdebug-prefix-map=/var/tmp/pamac-build-apachler/bareos/src/bareos/core=. -fmacro-prefix-map=/var/tmp/pamac-build-apachler/bareos/src/bareos/core=. -Wall -DCHECK_FUNCTION_EXISTS=extattr_list_file -o CMakeFiles/cmTC_9ee05.dir/CheckFunctionExists.c.o -c /usr/share/cmake-3.17/Modules/CheckFunctionExists.c
Linking C executable cmTC_9ee05
/usr/bin/cmake -E cmake_link_script CMakeFiles/cmTC_9ee05.dir/link.txt --verbose=1
/usr/bin/cc -march=x86-64 -mtune=generic -O2 -pipe -fstack-protector-strong -fno-plt -fdebug-prefix-map=/var/tmp/pamac-build-apachler/bareos/src/bareos/core=. -fmacro-prefix-map=/var/tmp/pamac-build-apachler/bareos/src/bareos/core=. -Wall -DCHECK_FUNCTION_EXISTS=extattr_list_file -Wl,-O1,--sort-common,--as-needed,-z,relro,-z,now -rdynamic CMakeFiles/cmTC_9ee05.dir/CheckFunctionExists.c.o -o cmTC_9ee05
/usr/bin/ld: CMakeFiles/cmTC_9ee05.dir/CheckFunctionExists.c.o: in function `main':
CheckFunctionExists.c:(.text.startup+0xd): undefined reference to `extattr_list_file'
collect2: Fehler: ld gab 1 als Ende-Status zurück
make[1]: *** [CMakeFiles/cmTC_9ee05.dir/build.make:107: cmTC_9ee05] Fehler 1
make[1]: Verzeichnis „/var/tmp/pamac-build-apachler/bareos/src/bareos/build/CMakeFiles/CMakeTmp“ wird verlassen
make: *** [Makefile:141: cmTC_9ee05/fast] Fehler 2
Determining if the function extattr_list_link exists failed with the following output:
Change Dir: /var/tmp/pamac-build-apachler/bareos/src/bareos/build/CMakeFiles/CMakeTmp
Run Build Command(s):/usr/bin/make cmTC_1e141/fast && /usr/bin/make -f CMakeFiles/cmTC_1e141.dir/build.make CMakeFiles/cmTC_1e141.dir/build
make[1]: Verzeichnis „/var/tmp/pamac-build-apachler/bareos/src/bareos/build/CMakeFiles/CMakeTmp“ wird betreten
Building C object CMakeFiles/cmTC_1e141.dir/CheckFunctionExists.c.o
/usr/bin/cc -D_FILE_OFFSET_BITS=64 -march=x86-64 -mtune=generic -O2 -pipe -fstack-protector-strong -fno-plt -fdebug-prefix-map=/var/tmp/pamac-build-apachler/bareos/src/bareos/core=. -fmacro-prefix-map=/var/tmp/pamac-build-apachler/bareos/src/bareos/core=. -Wall -DCHECK_FUNCTION_EXISTS=extattr_list_link -o CMakeFiles/cmTC_1e141.dir/CheckFunctionExists.c.o -c /usr/share/cmake-3.17/Modules/CheckFunctionExists.c
Linking C executable cmTC_1e141
/usr/bin/cmake -E cmake_link_script CMakeFiles/cmTC_1e141.dir/link.txt --verbose=1
/usr/bin/cc -march=x86-64 -mtune=generic -O2 -pipe -fstack-protector-strong -fno-plt -fdebug-prefix-map=/var/tmp/pamac-build-apachler/bareos/src/bareos/core=. -fmacro-prefix-map=/var/tmp/pamac-build-apachler/bareos/src/bareos/core=. -Wall -DCHECK_FUNCTION_EXISTS=extattr_list_link -Wl,-O1,--sort-common,--as-needed,-z,relro,-z,now -rdynamic CMakeFiles/cmTC_1e141.dir/CheckFunctionExists.c.o -o cmTC_1e141
/usr/bin/ld: CMakeFiles/cmTC_1e141.dir/CheckFunctionExists.c.o: in function `main':
CheckFunctionExists.c:(.text.startup+0xd): undefined reference to `extattr_list_link'
collect2: Fehler: ld gab 1 als Ende-Status zurück
make[1]: *** [CMakeFiles/cmTC_1e141.dir/build.make:107: cmTC_1e141] Fehler 1
make[1]: Verzeichnis „/var/tmp/pamac-build-apachler/bareos/src/bareos/build/CMakeFiles/CMakeTmp“ wird verlassen
make: *** [Makefile:141: cmTC_1e141/fast] Fehler 2
Determining if the function extattr_namespace_to_string exists failed with the following output:
Change Dir: /var/tmp/pamac-build-apachler/bareos/src/bareos/build/CMakeFiles/CMakeTmp
Run Build Command(s):/usr/bin/make cmTC_22d76/fast && /usr/bin/make -f CMakeFiles/cmTC_22d76.dir/build.make CMakeFiles/cmTC_22d76.dir/build
make[1]: Verzeichnis „/var/tmp/pamac-build-apachler/bareos/src/bareos/build/CMakeFiles/CMakeTmp“ wird betreten
Building C object CMakeFiles/cmTC_22d76.dir/CheckFunctionExists.c.o
/usr/bin/cc -D_FILE_OFFSET_BITS=64 -march=x86-64 -mtune=generic -O2 -pipe -fstack-protector-strong -fno-plt -fdebug-prefix-map=/var/tmp/pamac-build-apachler/bareos/src/bareos/core=. -fmacro-prefix-map=/var/tmp/pamac-build-apachler/bareos/src/bareos/core=. -Wall -DCHECK_FUNCTION_EXISTS=extattr_namespace_to_string -o CMakeFiles/cmTC_22d76.dir/CheckFunctionExists.c.o -c /usr/share/cmake-3.17/Modules/CheckFunctionExists.c
Linking C executable cmTC_22d76
/usr/bin/cmake -E cmake_link_script CMakeFiles/cmTC_22d76.dir/link.txt --verbose=1
/usr/bin/cc -march=x86-64 -mtune=generic -O2 -pipe -fstack-protector-strong -fno-plt -fdebug-prefix-map=/var/tmp/pamac-build-apachler/bareos/src/bareos/core=. -fmacro-prefix-map=/var/tmp/pamac-build-apachler/bareos/src/bareos/core=. -Wall -DCHECK_FUNCTION_EXISTS=extattr_namespace_to_string -Wl,-O1,--sort-common,--as-needed,-z,relro,-z,now -rdynamic CMakeFiles/cmTC_22d76.dir/CheckFunctionExists.c.o -o cmTC_22d76
/usr/bin/ld: CMakeFiles/cmTC_22d76.dir/CheckFunctionExists.c.o: in function `main':
CheckFunctionExists.c:(.text.startup+0xd): undefined reference to `extattr_namespace_to_string'
collect2: Fehler: ld gab 1 als Ende-Status zurück
make[1]: *** [CMakeFiles/cmTC_22d76.dir/build.make:107: cmTC_22d76] Fehler 1
make[1]: Verzeichnis „/var/tmp/pamac-build-apachler/bareos/src/bareos/build/CMakeFiles/CMakeTmp“ wird verlassen
make: *** [Makefile:141: cmTC_22d76/fast] Fehler 2
Determining if the function extattr_set_file exists failed with the following output:
Change Dir: /var/tmp/pamac-build-apachler/bareos/src/bareos/build/CMakeFiles/CMakeTmp
Run Build Command(s):/usr/bin/make cmTC_37e7d/fast && /usr/bin/make -f CMakeFiles/cmTC_37e7d.dir/build.make CMakeFiles/cmTC_37e7d.dir/build
make[1]: Verzeichnis „/var/tmp/pamac-build-apachler/bareos/src/bareos/build/CMakeFiles/CMakeTmp“ wird betreten
Building C object CMakeFiles/cmTC_37e7d.dir/CheckFunctionExists.c.o
/usr/bin/cc -D_FILE_OFFSET_BITS=64 -march=x86-64 -mtune=generic -O2 -pipe -fstack-protector-strong -fno-plt -fdebug-prefix-map=/var/tmp/pamac-build-apachler/bareos/src/bareos/core=. -fmacro-prefix-map=/var/tmp/pamac-build-apachler/bareos/src/bareos/core=. -Wall -DCHECK_FUNCTION_EXISTS=extattr_set_file -o CMakeFiles/cmTC_37e7d.dir/CheckFunctionExists.c.o -c /usr/share/cmake-3.17/Modules/CheckFunctionExists.c
Linking C executable cmTC_37e7d
/usr/bin/cmake -E cmake_link_script CMakeFiles/cmTC_37e7d.dir/link.txt --verbose=1
/usr/bin/cc -march=x86-64 -mtune=generic -O2 -pipe -fstack-protector-strong -fno-plt -fdebug-prefix-map=/var/tmp/pamac-build-apachler/bareos/src/bareos/core=. -fmacro-prefix-map=/var/tmp/pamac-build-apachler/bareos/src/bareos/core=. -Wall -DCHECK_FUNCTION_EXISTS=extattr_set_file -Wl,-O1,--sort-common,--as-needed,-z,relro,-z,now -rdynamic CMakeFiles/cmTC_37e7d.dir/CheckFunctionExists.c.o -o cmTC_37e7d
/usr/bin/ld: CMakeFiles/cmTC_37e7d.dir/CheckFunctionExists.c.o: in function `main':
CheckFunctionExists.c:(.text.startup+0xd): undefined reference to `extattr_set_file'
collect2: Fehler: ld gab 1 als Ende-Status zurück
make[1]: *** [CMakeFiles/cmTC_37e7d.dir/build.make:107: cmTC_37e7d] Fehler 1
make[1]: Verzeichnis „/var/tmp/pamac-build-apachler/bareos/src/bareos/build/CMakeFiles/CMakeTmp“ wird verlassen
make: *** [Makefile:141: cmTC_37e7d/fast] Fehler 2
Determining if the function extattr_set_link exists failed with the following output:
Change Dir: /var/tmp/pamac-build-apachler/bareos/src/bareos/build/CMakeFiles/CMakeTmp
Run Build Command(s):/usr/bin/make cmTC_25900/fast && /usr/bin/make -f CMakeFiles/cmTC_25900.dir/build.make CMakeFiles/cmTC_25900.dir/build
make[1]: Verzeichnis „/var/tmp/pamac-build-apachler/bareos/src/bareos/build/CMakeFiles/CMakeTmp“ wird betreten
Building C object CMakeFiles/cmTC_25900.dir/CheckFunctionExists.c.o
/usr/bin/cc -D_FILE_OFFSET_BITS=64 -march=x86-64 -mtune=generic -O2 -pipe -fstack-protector-strong -fno-plt -fdebug-prefix-map=/var/tmp/pamac-build-apachler/bareos/src/bareos/core=. -fmacro-prefix-map=/var/tmp/pamac-build-apachler/bareos/src/bareos/core=. -Wall -DCHECK_FUNCTION_EXISTS=extattr_set_link -o CMakeFiles/cmTC_25900.dir/CheckFunctionExists.c.o -c /usr/share/cmake-3.17/Modules/CheckFunctionExists.c
Linking C executable cmTC_25900
/usr/bin/cmake -E cmake_link_script CMakeFiles/cmTC_25900.dir/link.txt --verbose=1
/usr/bin/cc -march=x86-64 -mtune=generic -O2 -pipe -fstack-protector-strong -fno-plt -fdebug-prefix-map=/var/tmp/pamac-build-apachler/bareos/src/bareos/core=. -fmacro-prefix-map=/var/tmp/pamac-build-apachler/bareos/src/bareos/core=. -Wall -DCHECK_FUNCTION_EXISTS=extattr_set_link -Wl,-O1,--sort-common,--as-needed,-z,relro,-z,now -rdynamic CMakeFiles/cmTC_25900.dir/CheckFunctionExists.c.o -o cmTC_25900
/usr/bin/ld: CMakeFiles/cmTC_25900.dir/CheckFunctionExists.c.o: in function `main':
CheckFunctionExists.c:(.text.startup+0xd): undefined reference to `extattr_set_link'
collect2: Fehler: ld gab 1 als Ende-Status zurück
make[1]: *** [CMakeFiles/cmTC_25900.dir/build.make:107: cmTC_25900] Fehler 1
make[1]: Verzeichnis „/var/tmp/pamac-build-apachler/bareos/src/bareos/build/CMakeFiles/CMakeTmp“ wird verlassen
make: *** [Makefile:141: cmTC_25900/fast] Fehler 2
Determining if the function extattr_string_to_namespace exists failed with the following output:
Change Dir: /var/tmp/pamac-build-apachler/bareos/src/bareos/build/CMakeFiles/CMakeTmp
Run Build Command(s):/usr/bin/make cmTC_95c36/fast && /usr/bin/make -f CMakeFiles/cmTC_95c36.dir/build.make CMakeFiles/cmTC_95c36.dir/build
make[1]: Verzeichnis „/var/tmp/pamac-build-apachler/bareos/src/bareos/build/CMakeFiles/CMakeTmp“ wird betreten
Building C object CMakeFiles/cmTC_95c36.dir/CheckFunctionExists.c.o
/usr/bin/cc -D_FILE_OFFSET_BITS=64 -march=x86-64 -mtune=generic -O2 -pipe -fstack-protector-strong -fno-plt -fdebug-prefix-map=/var/tmp/pamac-build-apachler/bareos/src/bareos/core=. -fmacro-prefix-map=/var/tmp/pamac-build-apachler/bareos/src/bareos/core=. -Wall -DCHECK_FUNCTION_EXISTS=extattr_string_to_namespace -o CMakeFiles/cmTC_95c36.dir/CheckFunctionExists.c.o -c /usr/share/cmake-3.17/Modules/CheckFunctionExists.c
Linking C executable cmTC_95c36
/usr/bin/cmake -E cmake_link_script CMakeFiles/cmTC_95c36.dir/link.txt --verbose=1
/usr/bin/cc -march=x86-64 -mtune=generic -O2 -pipe -fstack-protector-strong -fno-plt -fdebug-prefix-map=/var/tmp/pamac-build-apachler/bareos/src/bareos/core=. -fmacro-prefix-map=/var/tmp/pamac-build-apachler/bareos/src/bareos/core=. -Wall -DCHECK_FUNCTION_EXISTS=extattr_string_to_namespace -Wl,-O1,--sort-common,--as-needed,-z,relro,-z,now -rdynamic CMakeFiles/cmTC_95c36.dir/CheckFunctionExists.c.o -o cmTC_95c36
/usr/bin/ld: CMakeFiles/cmTC_95c36.dir/CheckFunctionExists.c.o: in function `main':
CheckFunctionExists.c:(.text.startup+0xd): undefined reference to `extattr_string_to_namespace'
collect2: Fehler: ld gab 1 als Ende-Status zurück
make[1]: *** [CMakeFiles/cmTC_95c36.dir/build.make:107: cmTC_95c36] Fehler 1
make[1]: Verzeichnis „/var/tmp/pamac-build-apachler/bareos/src/bareos/build/CMakeFiles/CMakeTmp“ wird verlassen
make: *** [Makefile:141: cmTC_95c36/fast] Fehler 2
Determining if the function getea exists failed with the following output:
Change Dir: /var/tmp/pamac-build-apachler/bareos/src/bareos/build/CMakeFiles/CMakeTmp
Run Build Command(s):/usr/bin/make cmTC_988b8/fast && /usr/bin/make -f CMakeFiles/cmTC_988b8.dir/build.make CMakeFiles/cmTC_988b8.dir/build
make[1]: Verzeichnis „/var/tmp/pamac-build-apachler/bareos/src/bareos/build/CMakeFiles/CMakeTmp“ wird betreten
Building C object CMakeFiles/cmTC_988b8.dir/CheckFunctionExists.c.o
/usr/bin/cc -D_FILE_OFFSET_BITS=64 -march=x86-64 -mtune=generic -O2 -pipe -fstack-protector-strong -fno-plt -fdebug-prefix-map=/var/tmp/pamac-build-apachler/bareos/src/bareos/core=. -fmacro-prefix-map=/var/tmp/pamac-build-apachler/bareos/src/bareos/core=. -Wall -DCHECK_FUNCTION_EXISTS=getea -o CMakeFiles/cmTC_988b8.dir/CheckFunctionExists.c.o -c /usr/share/cmake-3.17/Modules/CheckFunctionExists.c
Linking C executable cmTC_988b8
/usr/bin/cmake -E cmake_link_script CMakeFiles/cmTC_988b8.dir/link.txt --verbose=1
/usr/bin/cc -march=x86-64 -mtune=generic -O2 -pipe -fstack-protector-strong -fno-plt -fdebug-prefix-map=/var/tmp/pamac-build-apachler/bareos/src/bareos/core=. -fmacro-prefix-map=/var/tmp/pamac-build-apachler/bareos/src/bareos/core=. -Wall -DCHECK_FUNCTION_EXISTS=getea -Wl,-O1,--sort-common,--as-needed,-z,relro,-z,now -rdynamic CMakeFiles/cmTC_988b8.dir/CheckFunctionExists.c.o -o cmTC_988b8
/usr/bin/ld: CMakeFiles/cmTC_988b8.dir/CheckFunctionExists.c.o: in function `main':
CheckFunctionExists.c:(.text.startup+0xd): undefined reference to `getea'
collect2: Fehler: ld gab 1 als Ende-Status zurück
make[1]: *** [CMakeFiles/cmTC_988b8.dir/build.make:107: cmTC_988b8] Fehler 1
make[1]: Verzeichnis „/var/tmp/pamac-build-apachler/bareos/src/bareos/build/CMakeFiles/CMakeTmp“ wird verlassen
make: *** [Makefile:141: cmTC_988b8/fast] Fehler 2
Determining if the function getmntinfo exists failed with the following output:
Change Dir: /var/tmp/pamac-build-apachler/bareos/src/bareos/build/CMakeFiles/CMakeTmp
Run Build Command(s):/usr/bin/make cmTC_640aa/fast && /usr/bin/make -f CMakeFiles/cmTC_640aa.dir/build.make CMakeFiles/cmTC_640aa.dir/build
make[1]: Verzeichnis „/var/tmp/pamac-build-apachler/bareos/src/bareos/build/CMakeFiles/CMakeTmp“ wird betreten
Building C object CMakeFiles/cmTC_640aa.dir/CheckFunctionExists.c.o
/usr/bin/cc -D_FILE_OFFSET_BITS=64 -march=x86-64 -mtune=generic -O2 -pipe -fstack-protector-strong -fno-plt -fdebug-prefix-map=/var/tmp/pamac-build-apachler/bareos/src/bareos/core=. -fmacro-prefix-map=/var/tmp/pamac-build-apachler/bareos/src/bareos/core=. -Wall -DCHECK_FUNCTION_EXISTS=getmntinfo -o CMakeFiles/cmTC_640aa.dir/CheckFunctionExists.c.o -c /usr/share/cmake-3.17/Modules/CheckFunctionExists.c
Linking C executable cmTC_640aa
/usr/bin/cmake -E cmake_link_script CMakeFiles/cmTC_640aa.dir/link.txt --verbose=1
/usr/bin/cc -march=x86-64 -mtune=generic -O2 -pipe -fstack-protector-strong -fno-plt -fdebug-prefix-map=/var/tmp/pamac-build-apachler/bareos/src/bareos/core=. -fmacro-prefix-map=/var/tmp/pamac-build-apachler/bareos/src/bareos/core=. -Wall -DCHECK_FUNCTION_EXISTS=getmntinfo -Wl,-O1,--sort-common,--as-needed,-z,relro,-z,now -rdynamic CMakeFiles/cmTC_640aa.dir/CheckFunctionExists.c.o -o cmTC_640aa
/usr/bin/ld: CMakeFiles/cmTC_640aa.dir/CheckFunctionExists.c.o: in function `main':
CheckFunctionExists.c:(.text.startup+0xd): undefined reference to `getmntinfo'
collect2: Fehler: ld gab 1 als Ende-Status zurück
make[1]: *** [CMakeFiles/cmTC_640aa.dir/build.make:107: cmTC_640aa] Fehler 1
make[1]: Verzeichnis „/var/tmp/pamac-build-apachler/bareos/src/bareos/build/CMakeFiles/CMakeTmp“ wird verlassen
make: *** [Makefile:141: cmTC_640aa/fast] Fehler 2
Determining if the function getproplist exists failed with the following output:
Change Dir: /var/tmp/pamac-build-apachler/bareos/src/bareos/build/CMakeFiles/CMakeTmp
Run Build Command(s):/usr/bin/make cmTC_bc511/fast && /usr/bin/make -f CMakeFiles/cmTC_bc511.dir/build.make CMakeFiles/cmTC_bc511.dir/build
make[1]: Verzeichnis „/var/tmp/pamac-build-apachler/bareos/src/bareos/build/CMakeFiles/CMakeTmp“ wird betreten
Building C object CMakeFiles/cmTC_bc511.dir/CheckFunctionExists.c.o
/usr/bin/cc -D_FILE_OFFSET_BITS=64 -march=x86-64 -mtune=generic -O2 -pipe -fstack-protector-strong -fno-plt -fdebug-prefix-map=/var/tmp/pamac-build-apachler/bareos/src/bareos/core=. -fmacro-prefix-map=/var/tmp/pamac-build-apachler/bareos/src/bareos/core=. -Wall -DCHECK_FUNCTION_EXISTS=getproplist -o CMakeFiles/cmTC_bc511.dir/CheckFunctionExists.c.o -c /usr/share/cmake-3.17/Modules/CheckFunctionExists.c
Linking C executable cmTC_bc511
/usr/bin/cmake -E cmake_link_script CMakeFiles/cmTC_bc511.dir/link.txt --verbose=1
/usr/bin/cc -march=x86-64 -mtune=generic -O2 -pipe -fstack-protector-strong -fno-plt -fdebug-prefix-map=/var/tmp/pamac-build-apachler/bareos/src/bareos/core=. -fmacro-prefix-map=/var/tmp/pamac-build-apachler/bareos/src/bareos/core=. -Wall -DCHECK_FUNCTION_EXISTS=getproplist -Wl,-O1,--sort-common,--as-needed,-z,relro,-z,now -rdynamic CMakeFiles/cmTC_bc511.dir/CheckFunctionExists.c.o -o cmTC_bc511
/usr/bin/ld: CMakeFiles/cmTC_bc511.dir/CheckFunctionExists.c.o: in function `main':
CheckFunctionExists.c:(.text.startup+0xd): undefined reference to `getproplist'
collect2: Fehler: ld gab 1 als Ende-Status zurück
make[1]: *** [CMakeFiles/cmTC_bc511.dir/build.make:107: cmTC_bc511] Fehler 1
make[1]: Verzeichnis „/var/tmp/pamac-build-apachler/bareos/src/bareos/build/CMakeFiles/CMakeTmp“ wird verlassen
make: *** [Makefile:141: cmTC_bc511/fast] Fehler 2
Determining if the function get_proplist_entry exists failed with the following output:
Change Dir: /var/tmp/pamac-build-apachler/bareos/src/bareos/build/CMakeFiles/CMakeTmp
Run Build Command(s):/usr/bin/make cmTC_79021/fast && /usr/bin/make -f CMakeFiles/cmTC_79021.dir/build.make CMakeFiles/cmTC_79021.dir/build
make[1]: Verzeichnis „/var/tmp/pamac-build-apachler/bareos/src/bareos/build/CMakeFiles/CMakeTmp“ wird betreten
Building C object CMakeFiles/cmTC_79021.dir/CheckFunctionExists.c.o
/usr/bin/cc -D_FILE_OFFSET_BITS=64 -march=x86-64 -mtune=generic -O2 -pipe -fstack-protector-strong -fno-plt -fdebug-prefix-map=/var/tmp/pamac-build-apachler/bareos/src/bareos/core=. -fmacro-prefix-map=/var/tmp/pamac-build-apachler/bareos/src/bareos/core=. -Wall -DCHECK_FUNCTION_EXISTS=get_proplist_entry -o CMakeFiles/cmTC_79021.dir/CheckFunctionExists.c.o -c /usr/share/cmake-3.17/Modules/CheckFunctionExists.c
Linking C executable cmTC_79021
/usr/bin/cmake -E cmake_link_script CMakeFiles/cmTC_79021.dir/link.txt --verbose=1
/usr/bin/cc -march=x86-64 -mtune=generic -O2 -pipe -fstack-protector-strong -fno-plt -fdebug-prefix-map=/var/tmp/pamac-build-apachler/bareos/src/bareos/core=. -fmacro-prefix-map=/var/tmp/pamac-build-apachler/bareos/src/bareos/core=. -Wall -DCHECK_FUNCTION_EXISTS=get_proplist_entry -Wl,-O1,--sort-common,--as-needed,-z,relro,-z,now -rdynamic CMakeFiles/cmTC_79021.dir/CheckFunctionExists.c.o -o cmTC_79021
/usr/bin/ld: CMakeFiles/cmTC_79021.dir/CheckFunctionExists.c.o: in function `main':
CheckFunctionExists.c:(.text.startup+0xd): undefined reference to `get_proplist_entry'
collect2: Fehler: ld gab 1 als Ende-Status zurück
make[1]: *** [CMakeFiles/cmTC_79021.dir/build.make:107: cmTC_79021] Fehler 1
make[1]: Verzeichnis „/var/tmp/pamac-build-apachler/bareos/src/bareos/build/CMakeFiles/CMakeTmp“ wird verlassen
make: *** [Makefile:141: cmTC_79021/fast] Fehler 2
Determining if the function glfs_readdirplus exists failed with the following output:
Change Dir: /var/tmp/pamac-build-apachler/bareos/src/bareos/build/CMakeFiles/CMakeTmp
Run Build Command(s):/usr/bin/make cmTC_623df/fast && /usr/bin/make -f CMakeFiles/cmTC_623df.dir/build.make CMakeFiles/cmTC_623df.dir/build
make[1]: Verzeichnis „/var/tmp/pamac-build-apachler/bareos/src/bareos/build/CMakeFiles/CMakeTmp“ wird betreten
Building C object CMakeFiles/cmTC_623df.dir/CheckFunctionExists.c.o
/usr/bin/cc -D_FILE_OFFSET_BITS=64 -march=x86-64 -mtune=generic -O2 -pipe -fstack-protector-strong -fno-plt -fdebug-prefix-map=/var/tmp/pamac-build-apachler/bareos/src/bareos/core=. -fmacro-prefix-map=/var/tmp/pamac-build-apachler/bareos/src/bareos/core=. -Wall -DCHECK_FUNCTION_EXISTS=glfs_readdirplus -o CMakeFiles/cmTC_623df.dir/CheckFunctionExists.c.o -c /usr/share/cmake-3.17/Modules/CheckFunctionExists.c
Linking C executable cmTC_623df
/usr/bin/cmake -E cmake_link_script CMakeFiles/cmTC_623df.dir/link.txt --verbose=1
/usr/bin/cc -march=x86-64 -mtune=generic -O2 -pipe -fstack-protector-strong -fno-plt -fdebug-prefix-map=/var/tmp/pamac-build-apachler/bareos/src/bareos/core=. -fmacro-prefix-map=/var/tmp/pamac-build-apachler/bareos/src/bareos/core=. -Wall -DCHECK_FUNCTION_EXISTS=glfs_readdirplus -Wl,-O1,--sort-common,--as-needed,-z,relro,-z,now -rdynamic CMakeFiles/cmTC_623df.dir/CheckFunctionExists.c.o -o cmTC_623df
/usr/bin/ld: CMakeFiles/cmTC_623df.dir/CheckFunctionExists.c.o: in function `main':
CheckFunctionExists.c:(.text.startup+0xd): undefined reference to `glfs_readdirplus'
collect2: Fehler: ld gab 1 als Ende-Status zurück
make[1]: *** [CMakeFiles/cmTC_623df.dir/build.make:107: cmTC_623df] Fehler 1
make[1]: Verzeichnis „/var/tmp/pamac-build-apachler/bareos/src/bareos/build/CMakeFiles/CMakeTmp“ wird verlassen
make: *** [Makefile:141: cmTC_623df/fast] Fehler 2
Determining if the function lgetea exists failed with the following output:
Change Dir: /var/tmp/pamac-build-apachler/bareos/src/bareos/build/CMakeFiles/CMakeTmp
Run Build Command(s):/usr/bin/make cmTC_4f5a4/fast && /usr/bin/make -f CMakeFiles/cmTC_4f5a4.dir/build.make CMakeFiles/cmTC_4f5a4.dir/build
make[1]: Verzeichnis „/var/tmp/pamac-build-apachler/bareos/src/bareos/build/CMakeFiles/CMakeTmp“ wird betreten
Building C object CMakeFiles/cmTC_4f5a4.dir/CheckFunctionExists.c.o
/usr/bin/cc -D_FILE_OFFSET_BITS=64 -march=x86-64 -mtune=generic -O2 -pipe -fstack-protector-strong -fno-plt -fdebug-prefix-map=/var/tmp/pamac-build-apachler/bareos/src/bareos/core=. -fmacro-prefix-map=/var/tmp/pamac-build-apachler/bareos/src/bareos/core=. -Wall -DCHECK_FUNCTION_EXISTS=lgetea -o CMakeFiles/cmTC_4f5a4.dir/CheckFunctionExists.c.o -c /usr/share/cmake-3.17/Modules/CheckFunctionExists.c
Linking C executable cmTC_4f5a4
/usr/bin/cmake -E cmake_link_script CMakeFiles/cmTC_4f5a4.dir/link.txt --verbose=1
/usr/bin/cc -march=x86-64 -mtune=generic -O2 -pipe -fstack-protector-strong -fno-plt -fdebug-prefix-map=/var/tmp/pamac-build-apachler/bareos/src/bareos/core=. -fmacro-prefix-map=/var/tmp/pamac-build-apachler/bareos/src/bareos/core=. -Wall -DCHECK_FUNCTION_EXISTS=lgetea -Wl,-O1,--sort-common,--as-needed,-z,relro,-z,now -rdynamic CMakeFiles/cmTC_4f5a4.dir/CheckFunctionExists.c.o -o cmTC_4f5a4
/usr/bin/ld: CMakeFiles/cmTC_4f5a4.dir/CheckFunctionExists.c.o: in function `main':
CheckFunctionExists.c:(.text.startup+0xd): undefined reference to `lgetea'
collect2: Fehler: ld gab 1 als Ende-Status zurück
make[1]: *** [CMakeFiles/cmTC_4f5a4.dir/build.make:107: cmTC_4f5a4] Fehler 1
make[1]: Verzeichnis „/var/tmp/pamac-build-apachler/bareos/src/bareos/build/CMakeFiles/CMakeTmp“ wird verlassen
make: *** [Makefile:141: cmTC_4f5a4/fast] Fehler 2
Determining if the function listea exists failed with the following output:
Change Dir: /var/tmp/pamac-build-apachler/bareos/src/bareos/build/CMakeFiles/CMakeTmp
Run Build Command(s):/usr/bin/make cmTC_caf41/fast && /usr/bin/make -f CMakeFiles/cmTC_caf41.dir/build.make CMakeFiles/cmTC_caf41.dir/build
make[1]: Verzeichnis „/var/tmp/pamac-build-apachler/bareos/src/bareos/build/CMakeFiles/CMakeTmp“ wird betreten
Building C object CMakeFiles/cmTC_caf41.dir/CheckFunctionExists.c.o
/usr/bin/cc -D_FILE_OFFSET_BITS=64 -march=x86-64 -mtune=generic -O2 -pipe -fstack-protector-strong -fno-plt -fdebug-prefix-map=/var/tmp/pamac-build-apachler/bareos/src/bareos/core=. -fmacro-prefix-map=/var/tmp/pamac-build-apachler/bareos/src/bareos/core=. -Wall -DCHECK_FUNCTION_EXISTS=listea -o CMakeFiles/cmTC_caf41.dir/CheckFunctionExists.c.o -c /usr/share/cmake-3.17/Modules/CheckFunctionExists.c
Linking C executable cmTC_caf41
/usr/bin/cmake -E cmake_link_script CMakeFiles/cmTC_caf41.dir/link.txt --verbose=1
/usr/bin/cc -march=x86-64 -mtune=generic -O2 -pipe -fstack-protector-strong -fno-plt -fdebug-prefix-map=/var/tmp/pamac-build-apachler/bareos/src/bareos/core=. -fmacro-prefix-map=/var/tmp/pamac-build-apachler/bareos/src/bareos/core=. -Wall -DCHECK_FUNCTION_EXISTS=listea -Wl,-O1,--sort-common,--as-needed,-z,relro,-z,now -rdynamic CMakeFiles/cmTC_caf41.dir/CheckFunctionExists.c.o -o cmTC_caf41
/usr/bin/ld: CMakeFiles/cmTC_caf41.dir/CheckFunctionExists.c.o: in function `main':
CheckFunctionExists.c:(.text.startup+0xd): undefined reference to `listea'
collect2: Fehler: ld gab 1 als Ende-Status zurück
make[1]: *** [CMakeFiles/cmTC_caf41.dir/build.make:107: cmTC_caf41] Fehler 1
make[1]: Verzeichnis „/var/tmp/pamac-build-apachler/bareos/src/bareos/build/CMakeFiles/CMakeTmp“ wird verlassen
make: *** [Makefile:141: cmTC_caf41/fast] Fehler 2
Determining if the function llistea exists failed with the following output:
Change Dir: /var/tmp/pamac-build-apachler/bareos/src/bareos/build/CMakeFiles/CMakeTmp
Run Build Command(s):/usr/bin/make cmTC_3e6ef/fast && /usr/bin/make -f CMakeFiles/cmTC_3e6ef.dir/build.make CMakeFiles/cmTC_3e6ef.dir/build
make[1]: Verzeichnis „/var/tmp/pamac-build-apachler/bareos/src/bareos/build/CMakeFiles/CMakeTmp“ wird betreten
Building C object CMakeFiles/cmTC_3e6ef.dir/CheckFunctionExists.c.o
/usr/bin/cc -D_FILE_OFFSET_BITS=64 -march=x86-64 -mtune=generic -O2 -pipe -fstack-protector-strong -fno-plt -fdebug-prefix-map=/var/tmp/pamac-build-apachler/bareos/src/bareos/core=. -fmacro-prefix-map=/var/tmp/pamac-build-apachler/bareos/src/bareos/core=. -Wall -DCHECK_FUNCTION_EXISTS=llistea -o CMakeFiles/cmTC_3e6ef.dir/CheckFunctionExists.c.o -c /usr/share/cmake-3.17/Modules/CheckFunctionExists.c
Linking C executable cmTC_3e6ef
/usr/bin/cmake -E cmake_link_script CMakeFiles/cmTC_3e6ef.dir/link.txt --verbose=1
/usr/bin/cc -march=x86-64 -mtune=generic -O2 -pipe -fstack-protector-strong -fno-plt -fdebug-prefix-map=/var/tmp/pamac-build-apachler/bareos/src/bareos/core=. -fmacro-prefix-map=/var/tmp/pamac-build-apachler/bareos/src/bareos/core=. -Wall -DCHECK_FUNCTION_EXISTS=llistea -Wl,-O1,--sort-common,--as-needed,-z,relro,-z,now -rdynamic CMakeFiles/cmTC_3e6ef.dir/CheckFunctionExists.c.o -o cmTC_3e6ef
/usr/bin/ld: CMakeFiles/cmTC_3e6ef.dir/CheckFunctionExists.c.o: in function `main':
CheckFunctionExists.c:(.text.startup+0xd): undefined reference to `llistea'
collect2: Fehler: ld gab 1 als Ende-Status zurück
make[1]: *** [CMakeFiles/cmTC_3e6ef.dir/build.make:107: cmTC_3e6ef] Fehler 1
make[1]: Verzeichnis „/var/tmp/pamac-build-apachler/bareos/src/bareos/build/CMakeFiles/CMakeTmp“ wird verlassen
make: *** [Makefile:141: cmTC_3e6ef/fast] Fehler 2
Determining if the function lsetea exists failed with the following output:
Change Dir: /var/tmp/pamac-build-apachler/bareos/src/bareos/build/CMakeFiles/CMakeTmp
Run Build Command(s):/usr/bin/make cmTC_3076c/fast && /usr/bin/make -f CMakeFiles/cmTC_3076c.dir/build.make CMakeFiles/cmTC_3076c.dir/build
make[1]: Verzeichnis „/var/tmp/pamac-build-apachler/bareos/src/bareos/build/CMakeFiles/CMakeTmp“ wird betreten
Building C object CMakeFiles/cmTC_3076c.dir/CheckFunctionExists.c.o
/usr/bin/cc -D_FILE_OFFSET_BITS=64 -march=x86-64 -mtune=generic -O2 -pipe -fstack-protector-strong -fno-plt -fdebug-prefix-map=/var/tmp/pamac-build-apachler/bareos/src/bareos/core=. -fmacro-prefix-map=/var/tmp/pamac-build-apachler/bareos/src/bareos/core=. -Wall -DCHECK_FUNCTION_EXISTS=lsetea -o CMakeFiles/cmTC_3076c.dir/CheckFunctionExists.c.o -c /usr/share/cmake-3.17/Modules/CheckFunctionExists.c
Linking C executable cmTC_3076c
/usr/bin/cmake -E cmake_link_script CMakeFiles/cmTC_3076c.dir/link.txt --verbose=1
/usr/bin/cc -march=x86-64 -mtune=generic -O2 -pipe -fstack-protector-strong -fno-plt -fdebug-prefix-map=/var/tmp/pamac-build-apachler/bareos/src/bareos/core=. -fmacro-prefix-map=/var/tmp/pamac-build-apachler/bareos/src/bareos/core=. -Wall -DCHECK_FUNCTION_EXISTS=lsetea -Wl,-O1,--sort-common,--as-needed,-z,relro,-z,now -rdynamic CMakeFiles/cmTC_3076c.dir/CheckFunctionExists.c.o -o cmTC_3076c
/usr/bin/ld: CMakeFiles/cmTC_3076c.dir/CheckFunctionExists.c.o: in function `main':
CheckFunctionExists.c:(.text.startup+0xd): undefined reference to `lsetea'
collect2: Fehler: ld gab 1 als Ende-Status zurück
make[1]: *** [CMakeFiles/cmTC_3076c.dir/build.make:107: cmTC_3076c] Fehler 1
make[1]: Verzeichnis „/var/tmp/pamac-build-apachler/bareos/src/bareos/build/CMakeFiles/CMakeTmp“ wird verlassen
make: *** [Makefile:141: cmTC_3076c/fast] Fehler 2
Determining if the function setea exists failed with the following output:
Change Dir: /var/tmp/pamac-build-apachler/bareos/src/bareos/build/CMakeFiles/CMakeTmp
Run Build Command(s):/usr/bin/make cmTC_a9f8c/fast && /usr/bin/make -f CMakeFiles/cmTC_a9f8c.dir/build.make CMakeFiles/cmTC_a9f8c.dir/build
make[1]: Verzeichnis „/var/tmp/pamac-build-apachler/bareos/src/bareos/build/CMakeFiles/CMakeTmp“ wird betreten
Building C object CMakeFiles/cmTC_a9f8c.dir/CheckFunctionExists.c.o
/usr/bin/cc -D_FILE_OFFSET_BITS=64 -march=x86-64 -mtune=generic -O2 -pipe -fstack-protector-strong -fno-plt -fdebug-prefix-map=/var/tmp/pamac-build-apachler/bareos/src/bareos/core=. -fmacro-prefix-map=/var/tmp/pamac-build-apachler/bareos/src/bareos/core=. -Wall -DCHECK_FUNCTION_EXISTS=setea -o CMakeFiles/cmTC_a9f8c.dir/CheckFunctionExists.c.o -c /usr/share/cmake-3.17/Modules/CheckFunctionExists.c
Linking C executable cmTC_a9f8c
/usr/bin/cmake -E cmake_link_script CMakeFiles/cmTC_a9f8c.dir/link.txt --verbose=1
/usr/bin/cc -march=x86-64 -mtune=generic -O2 -pipe -fstack-protector-strong -fno-plt -fdebug-prefix-map=/var/tmp/pamac-build-apachler/bareos/src/bareos/core=. -fmacro-prefix-map=/var/tmp/pamac-build-apachler/bareos/src/bareos/core=. -Wall -DCHECK_FUNCTION_EXISTS=setea -Wl,-O1,--sort-common,--as-needed,-z,relro,-z,now -rdynamic CMakeFiles/cmTC_a9f8c.dir/CheckFunctionExists.c.o -o cmTC_a9f8c
/usr/bin/ld: CMakeFiles/cmTC_a9f8c.dir/CheckFunctionExists.c.o: in function `main':
CheckFunctionExists.c:(.text.startup+0xd): undefined reference to `setea'
collect2: Fehler: ld gab 1 als Ende-Status zurück
make[1]: *** [CMakeFiles/cmTC_a9f8c.dir/build.make:107: cmTC_a9f8c] Fehler 1
make[1]: Verzeichnis „/var/tmp/pamac-build-apachler/bareos/src/bareos/build/CMakeFiles/CMakeTmp“ wird verlassen
make: *** [Makefile:141: cmTC_a9f8c/fast] Fehler 2
Determining if the function setproplist exists failed with the following output:
Change Dir: /var/tmp/pamac-build-apachler/bareos/src/bareos/build/CMakeFiles/CMakeTmp
Run Build Command(s):/usr/bin/make cmTC_520c7/fast && /usr/bin/make -f CMakeFiles/cmTC_520c7.dir/build.make CMakeFiles/cmTC_520c7.dir/build
make[1]: Verzeichnis „/var/tmp/pamac-build-apachler/bareos/src/bareos/build/CMakeFiles/CMakeTmp“ wird betreten
Building C object CMakeFiles/cmTC_520c7.dir/CheckFunctionExists.c.o
/usr/bin/cc -D_FILE_OFFSET_BITS=64 -march=x86-64 -mtune=generic -O2 -pipe -fstack-protector-strong -fno-plt -fdebug-prefix-map=/var/tmp/pamac-build-apachler/bareos/src/bareos/core=. -fmacro-prefix-map=/var/tmp/pamac-build-apachler/bareos/src/bareos/core=. -Wall -DCHECK_FUNCTION_EXISTS=setproplist -o CMakeFiles/cmTC_520c7.dir/CheckFunctionExists.c.o -c /usr/share/cmake-3.17/Modules/CheckFunctionExists.c
Linking C executable cmTC_520c7
/usr/bin/cmake -E cmake_link_script CMakeFiles/cmTC_520c7.dir/link.txt --verbose=1
/usr/bin/cc -march=x86-64 -mtune=generic -O2 -pipe -fstack-protector-strong -fno-plt -fdebug-prefix-map=/var/tmp/pamac-build-apachler/bareos/src/bareos/core=. -fmacro-prefix-map=/var/tmp/pamac-build-apachler/bareos/src/bareos/core=. -Wall -DCHECK_FUNCTION_EXISTS=setproplist -Wl,-O1,--sort-common,--as-needed,-z,relro,-z,now -rdynamic CMakeFiles/cmTC_520c7.dir/CheckFunctionExists.c.o -o cmTC_520c7
/usr/bin/ld: CMakeFiles/cmTC_520c7.dir/CheckFunctionExists.c.o: in function `main':
CheckFunctionExists.c:(.text.startup+0xd): undefined reference to `setproplist'
collect2: Fehler: ld gab 1 als Ende-Status zurück
make[1]: *** [CMakeFiles/cmTC_520c7.dir/build.make:107: cmTC_520c7] Fehler 1
make[1]: Verzeichnis „/var/tmp/pamac-build-apachler/bareos/src/bareos/build/CMakeFiles/CMakeTmp“ wird verlassen
make: *** [Makefile:141: cmTC_520c7/fast] Fehler 2
Determining if the function hl_loa exists failed with the following output:
Change Dir: /var/tmp/pamac-build-apachler/bareos/src/bareos/build/CMakeFiles/CMakeTmp
Run Build Command(s):/usr/bin/make cmTC_7f96a/fast && /usr/bin/make -f CMakeFiles/cmTC_7f96a.dir/build.make CMakeFiles/cmTC_7f96a.dir/build
make[1]: Verzeichnis „/var/tmp/pamac-build-apachler/bareos/src/bareos/build/CMakeFiles/CMakeTmp“ wird betreten
Building C object CMakeFiles/cmTC_7f96a.dir/CheckFunctionExists.c.o
/usr/bin/cc -D_FILE_OFFSET_BITS=64 -march=x86-64 -mtune=generic -O2 -pipe -fstack-protector-strong -fno-plt -fdebug-prefix-map=/var/tmp/pamac-build-apachler/bareos/src/bareos/core=. -fmacro-prefix-map=/var/tmp/pamac-build-apachler/bareos/src/bareos/core=. -Wall -DCHECK_FUNCTION_EXISTS=hl_loa -o CMakeFiles/cmTC_7f96a.dir/CheckFunctionExists.c.o -c /usr/share/cmake-3.17/Modules/CheckFunctionExists.c
Linking C executable cmTC_7f96a
/usr/bin/cmake -E cmake_link_script CMakeFiles/cmTC_7f96a.dir/link.txt --verbose=1
/usr/bin/cc -march=x86-64 -mtune=generic -O2 -pipe -fstack-protector-strong -fno-plt -fdebug-prefix-map=/var/tmp/pamac-build-apachler/bareos/src/bareos/core=. -fmacro-prefix-map=/var/tmp/pamac-build-apachler/bareos/src/bareos/core=. -Wall -DCHECK_FUNCTION_EXISTS=hl_loa -Wl,-O1,--sort-common,--as-needed,-z,relro,-z,now -rdynamic CMakeFiles/cmTC_7f96a.dir/CheckFunctionExists.c.o -o cmTC_7f96a
/usr/bin/ld: CMakeFiles/cmTC_7f96a.dir/CheckFunctionExists.c.o: in function `main':
CheckFunctionExists.c:(.text.startup+0xd): undefined reference to `hl_loa'
collect2: Fehler: ld gab 1 als Ende-Status zurück
make[1]: *** [CMakeFiles/cmTC_7f96a.dir/build.make:107: cmTC_7f96a] Fehler 1
make[1]: Verzeichnis „/var/tmp/pamac-build-apachler/bareos/src/bareos/build/CMakeFiles/CMakeTmp“ wird verlassen
make: *** [Makefile:141: cmTC_7f96a/fast] Fehler 2
Determining if the function sizeof_proplist_entry exists failed with the following output:
Change Dir: /var/tmp/pamac-build-apachler/bareos/src/bareos/build/CMakeFiles/CMakeTmp
Run Build Command(s):/usr/bin/make cmTC_f4e76/fast && /usr/bin/make -f CMakeFiles/cmTC_f4e76.dir/build.make CMakeFiles/cmTC_f4e76.dir/build
make[1]: Verzeichnis „/var/tmp/pamac-build-apachler/bareos/src/bareos/build/CMakeFiles/CMakeTmp“ wird betreten
Building C object CMakeFiles/cmTC_f4e76.dir/CheckFunctionExists.c.o
/usr/bin/cc -D_FILE_OFFSET_BITS=64 -march=x86-64 -mtune=generic -O2 -pipe -fstack-protector-strong -fno-plt -fdebug-prefix-map=/var/tmp/pamac-build-apachler/bareos/src/bareos/core=. -fmacro-prefix-map=/var/tmp/pamac-build-apachler/bareos/src/bareos/core=. -Wall -DCHECK_FUNCTION_EXISTS=sizeof_proplist_entry -o CMakeFiles/cmTC_f4e76.dir/CheckFunctionExists.c.o -c /usr/share/cmake-3.17/Modules/CheckFunctionExists.c
Linking C executable cmTC_f4e76
/usr/bin/cmake -E cmake_link_script CMakeFiles/cmTC_f4e76.dir/link.txt --verbose=1
/usr/bin/cc -march=x86-64 -mtune=generic -O2 -pipe -fstack-protector-strong -fno-plt -fdebug-prefix-map=/var/tmp/pamac-build-apachler/bareos/src/bareos/core=. -fmacro-prefix-map=/var/tmp/pamac-build-apachler/bareos/src/bareos/core=. -Wall -DCHECK_FUNCTION_EXISTS=sizeof_proplist_entry -Wl,-O1,--sort-common,--as-needed,-z,relro,-z,now -rdynamic CMakeFiles/cmTC_f4e76.dir/CheckFunctionExists.c.o -o cmTC_f4e76
/usr/bin/ld: CMakeFiles/cmTC_f4e76.dir/CheckFunctionExists.c.o: in function `main':
CheckFunctionExists.c:(.text.startup+0xd): undefined reference to `sizeof_proplist_entry'
collect2: Fehler: ld gab 1 als Ende-Status zurück
make[1]: *** [CMakeFiles/cmTC_f4e76.dir/build.make:107: cmTC_f4e76] Fehler 1
make[1]: Verzeichnis „/var/tmp/pamac-build-apachler/bareos/src/bareos/build/CMakeFiles/CMakeTmp“ wird verlassen
make: *** [Makefile:141: cmTC_f4e76/fast] Fehler 2
Determining if the __stub___lchmod exist failed with the following output:
Change Dir: /var/tmp/pamac-build-apachler/bareos/src/bareos/build/CMakeFiles/CMakeTmp
Run Build Command(s):/usr/bin/make cmTC_ca142/fast && /usr/bin/make -f CMakeFiles/cmTC_ca142.dir/build.make CMakeFiles/cmTC_ca142.dir/build
make[1]: Verzeichnis „/var/tmp/pamac-build-apachler/bareos/src/bareos/build/CMakeFiles/CMakeTmp“ wird betreten
Building C object CMakeFiles/cmTC_ca142.dir/CheckSymbolExists.c.o
/usr/bin/cc -D_FILE_OFFSET_BITS=64 -march=x86-64 -mtune=generic -O2 -pipe -fstack-protector-strong -fno-plt -fdebug-prefix-map=/var/tmp/pamac-build-apachler/bareos/src/bareos/core=. -fmacro-prefix-map=/var/tmp/pamac-build-apachler/bareos/src/bareos/core=. -Wall -o CMakeFiles/cmTC_ca142.dir/CheckSymbolExists.c.o -c /var/tmp/pamac-build-apachler/bareos/src/bareos/build/CMakeFiles/CMakeTmp/CheckSymbolExists.c
/var/tmp/pamac-build-apachler/bareos/src/bareos/build/CMakeFiles/CMakeTmp/CheckSymbolExists.c:2:10: schwerwiegender Fehler: features_h: Datei oder Verzeichnis nicht gefunden
2 | #include <features_h>
| ^~~~~~~~~~~~
Kompilierung beendet.
make[1]: *** [CMakeFiles/cmTC_ca142.dir/build.make:86: CMakeFiles/cmTC_ca142.dir/CheckSymbolExists.c.o] Fehler 1
make[1]: Verzeichnis „/var/tmp/pamac-build-apachler/bareos/src/bareos/build/CMakeFiles/CMakeTmp“ wird verlassen
make: *** [Makefile:141: cmTC_ca142/fast] Fehler 2
File /var/tmp/pamac-build-apachler/bareos/src/bareos/build/CMakeFiles/CMakeTmp/CheckSymbolExists.c:
/* */
#include <features_h>
int main(int argc, char** argv)
{
(void)argv;
#ifndef __stub___lchmod
return ((int*)(&__stub___lchmod))[argc];
#else
(void)argc;
return 0;
#endif
}
Performing C SOURCE FILE Test HAVE_ACL_TYPE_DEFAULT_DIR failed with the following output:
Change Dir: /var/tmp/pamac-build-apachler/bareos/src/bareos/build/CMakeFiles/CMakeTmp
Run Build Command(s):/usr/bin/make cmTC_a0ffa/fast && /usr/bin/make -f CMakeFiles/cmTC_a0ffa.dir/build.make CMakeFiles/cmTC_a0ffa.dir/build
make[1]: Verzeichnis „/var/tmp/pamac-build-apachler/bareos/src/bareos/build/CMakeFiles/CMakeTmp“ wird betreten
Building C object CMakeFiles/cmTC_a0ffa.dir/src.c.o
/usr/bin/cc -D_FILE_OFFSET_BITS=64 -march=x86-64 -mtune=generic -O2 -pipe -fstack-protector-strong -fno-plt -fdebug-prefix-map=/var/tmp/pamac-build-apachler/bareos/src/bareos/core=. -fmacro-prefix-map=/var/tmp/pamac-build-apachler/bareos/src/bareos/core=. -Wall -DHAVE_ACL_TYPE_DEFAULT_DIR -o CMakeFiles/cmTC_a0ffa.dir/src.c.o -c /var/tmp/pamac-build-apachler/bareos/src/bareos/build/CMakeFiles/CMakeTmp/src.c
/var/tmp/pamac-build-apachler/bareos/src/bareos/build/CMakeFiles/CMakeTmp/src.c: In Funktion »main«:
/var/tmp/pamac-build-apachler/bareos/src/bareos/build/CMakeFiles/CMakeTmp/src.c:3:28: Fehler: »ACL_TYPE_DEFAULT_DIR« nicht deklariert (erstmalige Verwendung in dieser Funktion); meinten Sie »ACL_TYPE_DEFAULT«?
3 | int main(void) { return ACL_TYPE_DEFAULT_DIR; }
| ^~~~~~~~~~~~~~~~~~~~
| ACL_TYPE_DEFAULT
/var/tmp/pamac-build-apachler/bareos/src/bareos/build/CMakeFiles/CMakeTmp/src.c:3:28: Anmerkung: jeder nicht deklarierte Bezeichner wird nur einmal für jede Funktion, in der er vorkommt, gemeldet
make[1]: *** [CMakeFiles/cmTC_a0ffa.dir/build.make:86: CMakeFiles/cmTC_a0ffa.dir/src.c.o] Fehler 1
make[1]: Verzeichnis „/var/tmp/pamac-build-apachler/bareos/src/bareos/build/CMakeFiles/CMakeTmp“ wird verlassen
make: *** [Makefile:141: cmTC_a0ffa/fast] Fehler 2
Source file was:
#include <sys/types.h>
#include <sys/acl.h>
int main(void) { return ACL_TYPE_DEFAULT_DIR; }
Performing C SOURCE FILE Test HAVE_ACL_TYPE_EXTENDED failed with the following output:
Change Dir: /var/tmp/pamac-build-apachler/bareos/src/bareos/build/CMakeFiles/CMakeTmp
Run Build Command(s):/usr/bin/make cmTC_1fde4/fast && /usr/bin/make -f CMakeFiles/cmTC_1fde4.dir/build.make CMakeFiles/cmTC_1fde4.dir/build
make[1]: Verzeichnis „/var/tmp/pamac-build-apachler/bareos/src/bareos/build/CMakeFiles/CMakeTmp“ wird betreten
Building C object CMakeFiles/cmTC_1fde4.dir/src.c.o
/usr/bin/cc -D_FILE_OFFSET_BITS=64 -march=x86-64 -mtune=generic -O2 -pipe -fstack-protector-strong -fno-plt -fdebug-prefix-map=/var/tmp/pamac-build-apachler/bareos/src/bareos/core=. -fmacro-prefix-map=/var/tmp/pamac-build-apachler/bareos/src/bareos/core=. -Wall -DHAVE_ACL_TYPE_EXTENDED -o CMakeFiles/cmTC_1fde4.dir/src.c.o -c /var/tmp/pamac-build-apachler/bareos/src/bareos/build/CMakeFiles/CMakeTmp/src.c
/var/tmp/pamac-build-apachler/bareos/src/bareos/build/CMakeFiles/CMakeTmp/src.c: In Funktion »main«:
/var/tmp/pamac-build-apachler/bareos/src/bareos/build/CMakeFiles/CMakeTmp/src.c:3:28: Fehler: »ACL_TYPE_EXTENDED« nicht deklariert (erstmalige Verwendung in dieser Funktion); meinten Sie »HAVE_ACL_TYPE_EXTENDED«?
3 | int main(void) { return ACL_TYPE_EXTENDED; }
| ^~~~~~~~~~~~~~~~~
| HAVE_ACL_TYPE_EXTENDED
/var/tmp/pamac-build-apachler/bareos/src/bareos/build/CMakeFiles/CMakeTmp/src.c:3:28: Anmerkung: jeder nicht deklarierte Bezeichner wird nur einmal für jede Funktion, in der er vorkommt, gemeldet
make[1]: *** [CMakeFiles/cmTC_1fde4.dir/build.make:86: CMakeFiles/cmTC_1fde4.dir/src.c.o] Fehler 1
make[1]: Verzeichnis „/var/tmp/pamac-build-apachler/bareos/src/bareos/build/CMakeFiles/CMakeTmp“ wird verlassen
make: *** [Makefile:141: cmTC_1fde4/fast] Fehler 2
Source file was:
#include <sys/types.h>
#include <sys/acl.h>
int main(void) { return ACL_TYPE_EXTENDED; }
Performing C SOURCE FILE Test HAVE_ACL_TYPE_NFS4 failed with the following output:
Change Dir: /var/tmp/pamac-build-apachler/bareos/src/bareos/build/CMakeFiles/CMakeTmp
Run Build Command(s):/usr/bin/make cmTC_6e972/fast && /usr/bin/make -f CMakeFiles/cmTC_6e972.dir/build.make CMakeFiles/cmTC_6e972.dir/build
make[1]: Verzeichnis „/var/tmp/pamac-build-apachler/bareos/src/bareos/build/CMakeFiles/CMakeTmp“ wird betreten
Building C object CMakeFiles/cmTC_6e972.dir/src.c.o
/usr/bin/cc -D_FILE_OFFSET_BITS=64 -march=x86-64 -mtune=generic -O2 -pipe -fstack-protector-strong -fno-plt -fdebug-prefix-map=/var/tmp/pamac-build-apachler/bareos/src/bareos/core=. -fmacro-prefix-map=/var/tmp/pamac-build-apachler/bareos/src/bareos/core=. -Wall -DHAVE_ACL_TYPE_NFS4 -o CMakeFiles/cmTC_6e972.dir/src.c.o -c /var/tmp/pamac-build-apachler/bareos/src/bareos/build/CMakeFiles/CMakeTmp/src.c
/var/tmp/pamac-build-apachler/bareos/src/bareos/build/CMakeFiles/CMakeTmp/src.c: In Funktion »main«:
/var/tmp/pamac-build-apachler/bareos/src/bareos/build/CMakeFiles/CMakeTmp/src.c:3:28: Fehler: »ACL_TYPE_NFS4« nicht deklariert (erstmalige Verwendung in dieser Funktion); meinten Sie »ACL_TYPE_ACCESS«?
3 | int main(void) { return ACL_TYPE_NFS4; }
| ^~~~~~~~~~~~~
| ACL_TYPE_ACCESS
/var/tmp/pamac-build-apachler/bareos/src/bareos/build/CMakeFiles/CMakeTmp/src.c:3:28: Anmerkung: jeder nicht deklarierte Bezeichner wird nur einmal für jede Funktion, in der er vorkommt, gemeldet
make[1]: *** [CMakeFiles/cmTC_6e972.dir/build.make:86: CMakeFiles/cmTC_6e972.dir/src.c.o] Fehler 1
make[1]: Verzeichnis „/var/tmp/pamac-build-apachler/bareos/src/bareos/build/CMakeFiles/CMakeTmp“ wird verlassen
make: *** [Makefile:141: cmTC_6e972/fast] Fehler 2
Source file was:
#include <sys/types.h>
#include <sys/acl.h>
int main(void) { return ACL_TYPE_NFS4; }
Sign up for free to join this conversation on GitHub. Already have an account? Sign in to comment
You can’t perform that action at this time.