Skip to content

Instantly share code, notes, and snippets.

@arunoda arunoda/error.log Secret
Created Jan 11, 2013

Embed
What would you like to do?
Nodejitsu failed after bundled
Arunodas-MacBook-Pro:streamcoder Arunoda$ jitsu deploy
info: Welcome to Nodejitsu arunodasusiripala
info: jitsu v0.11.4, node v0.8.16
info: It worked if it ends with Nodejitsu ok
info: Executing command deploy
info: Analyzing application dependencies in start-stream-server.js
info: Creating snapshot 0.0.1-1
info Uploading: [=============================] 100%
error: Error running command deploy
error: Nodejitsu Error (500): Internal Server Error
error: npm http GET http://nj-npm.irisnpm.com/express
npm http GET http://nj-npm.irisnpm.com/redis
npm http GET http://nj-npm.irisnpm.com/hiredis
npm http GET http://nj-npm.irisnpm.com/winstoon
npm http GET http://nj-npm.irisnpm.com/node-uuid
npm http GET http://nj-npm.irisnpm.com/readable-stream
npm http GET http://nj-npm.irisnpm.com/knox
npm http GET http://nj-npm.irisnpm.com/mongojs
npm http GET http://nj-npm.irisnpm.com/request
npm http GET https://github.com/bobmayo56/node-librato-metrics/archive/master.tar.gz
npm http 200 http://nj-npm.irisnpm.com/hiredis
npm http GET http://nj-npm.irisnpm.com/hiredis/-/hiredis-0.1.14.tgz
npm http 200 http://nj-npm.irisnpm.com/winstoon
npm http 200 https://github.com/bobmayo56/node-librato-metrics/archive/master.tar.gz
npm http GET http://nj-npm.irisnpm.com/winstoon/-/winstoon-0.1.3.tgz
npm http 200 http://nj-npm.irisnpm.com/node-uuid
npm http GET http://nj-npm.irisnpm.com/node-uuid/-/node-uuid-1.4.0.tgz
npm http 200 http://nj-npm.irisnpm.com/redis
npm http GET http://nj-npm.irisnpm.com/redis/-/redis-0.8.2.tgz
npm http 200 http://nj-npm.irisnpm.com/express
npm http GET http://nj-npm.irisnpm.com/express/-/express-3.0.6.tgz
npm http 200 http://nj-npm.irisnpm.com/readable-stream
npm http GET http://nj-npm.irisnpm.com/readable-stream/-/readable-stream-0.1.0.tgz
npm http 200 http://nj-npm.irisnpm.com/hiredis/-/hiredis-0.1.14.tgz
npm http 200 http://nj-npm.irisnpm.com/mongojs
npm http 200 http://nj-npm.irisnpm.com/winstoon/-/winstoon-0.1.3.tgz
npm http GET http://nj-npm.irisnpm.com/mongojs/-/mongojs-0.4.6.tgz
npm http 200 http://nj-npm.irisnpm.com/knox
npm http GET http://nj-npm.irisnpm.com/knox/-/knox-0.4.6.tgz
npm http 200 http://nj-npm.irisnpm.com/node-uuid/-/node-uuid-1.4.0.tgz
npm http 200 http://nj-npm.irisnpm.com/redis/-/redis-0.8.2.tgz
npm http 200 http://nj-npm.irisnpm.com/readable-stream/-/readable-stream-0.1.0.tgz
npm http 200 http://nj-npm.irisnpm.com/express/-/express-3.0.6.tgz
npm http 200 http://nj-npm.irisnpm.com/request
npm http GET http://nj-npm.irisnpm.com/request/-/request-2.12.0.tgz
npm http 200 http://nj-npm.irisnpm.com/knox/-/knox-0.4.6.tgz
npm http 200 http://nj-npm.irisnpm.com/mongojs/-/mongojs-0.4.6.tgz
npm WARN package.json hiredis@0.1.14 No README.md file found!
npm http 200 http://nj-npm.irisnpm.com/request/-/request-2.12.0.tgz
> hiredis@0.1.14 preinstall /root/tmp/tmp-3498pjmxgkw/build/package/node_modules/hiredis
> make || gmake
cd deps/hiredis && make static
npm http GET http://nj-npm.irisnpm.com/request/2.9.100
npm http GET http://nj-npm.irisnpm.com/winston
npm http GET http://nj-npm.irisnpm.com/sprintf
npm http GET http://nj-npm.irisnpm.com/mime
npm http GET http://nj-npm.irisnpm.com/xml2js
npm http GET http://nj-npm.irisnpm.com/common
npm http GET http://nj-npm.irisnpm.com/mongodb
npm http GET http://nj-npm.irisnpm.com/connect/2.7.2
npm http GET http://nj-npm.irisnpm.com/commander/0.6.1
npm http GET http://nj-npm.irisnpm.com/range-parser/0.0.4
npm http GET http://nj-npm.irisnpm.com/mkdirp/0.3.3
npm http GET http://nj-npm.irisnpm.com/cookie/0.0.5
npm http GET http://nj-npm.irisnpm.com/buffer-crc32/0.1.1
make[1]: Entering directory `/root/tmp/tmp-3498pjmxgkw/build/package/node_modules/hiredis/deps/hiredis'
cc -std=c99 -pedantic -c -O3 -fPIC -m64 -Wall -W -Wstrict-prototypes -Wwrite-strings -g -ggdb net.c
npm http GET http://nj-npm.irisnpm.com/fresh/0.1.0
npm http GET http://nj-npm.irisnpm.com/methods/0.0.1
npm http GET http://nj-npm.irisnpm.com/send/0.1.0
npm http GET http://nj-npm.irisnpm.com/cookie-signature/0.0.1
npm http GET http://nj-npm.irisnpm.com/debug
npm http 200 http://nj-npm.irisnpm.com/sprintf
npm http GET http://nj-npm.irisnpm.com/sprintf/-/sprintf-0.1.1.tgz
npm http 200 http://nj-npm.irisnpm.com/request/2.9.100
npm http GET http://nj-npm.irisnpm.com/request/-/request-2.9.100.tgz
npm http 200 http://nj-npm.irisnpm.com/xml2js
npm http GET http://nj-npm.irisnpm.com/xml2js/-/xml2js-0.2.2.tgz
npm http 200 http://nj-npm.irisnpm.com/mime
cc -std=c99 -pedantic -c -O3 -fPIC -m64 -Wall -W -Wstrict-prototypes -Wwrite-strings -g -ggdb hiredis.c
npm http GET http://nj-npm.irisnpm.com/mime/-/mime-1.2.8.tgz
npm http 200 http://nj-npm.irisnpm.com/common
npm http GET http://nj-npm.irisnpm.com/common/-/common-0.2.1.tgz
npm http 200 http://nj-npm.irisnpm.com/winston
npm http GET http://nj-npm.irisnpm.com/winston/-/winston-0.6.2.tgz
npm http 200 http://nj-npm.irisnpm.com/connect/2.7.2
npm http GET http://nj-npm.irisnpm.com/connect/-/connect-2.7.2.tgz
npm http 200 http://nj-npm.irisnpm.com/commander/0.6.1
npm http GET http://nj-npm.irisnpm.com/commander/-/commander-0.6.1.tgz
npm http 200 http://nj-npm.irisnpm.com/range-parser/0.0.4
npm http GET http://nj-npm.irisnpm.com/range-parser/-/range-parser-0.0.4.tgz
npm http 200 http://nj-npm.irisnpm.com/mkdirp/0.3.3
npm http GET http://nj-npm.irisnpm.com/mkdirp/-/mkdirp-0.3.3.tgz
cc -std=c99 -pedantic -c -O3 -fPIC -m64 -Wall -W -Wstrict-prototypes -Wwrite-strings -g -ggdb sds.c
npm http 200 http://nj-npm.irisnpm.com/cookie/0.0.5
npm http GET http://nj-npm.irisnpm.com/cookie/-/cookie-0.0.5.tgz
npm http 200 http://nj-npm.irisnpm.com/mongodb
npm http GET http://nj-npm.irisnpm.com/mongodb/-/mongodb-1.2.8.tgz
npm http 200 http://nj-npm.irisnpm.com/buffer-crc32/0.1.1
npm http GET http://nj-npm.irisnpm.com/buffer-crc32/-/buffer-crc32-0.1.1.tgz
npm http 200 http://nj-npm.irisnpm.com/fresh/0.1.0
npm http GET http://nj-npm.irisnpm.com/fresh/-/fresh-0.1.0.tgz
npm http 200 http://nj-npm.irisnpm.com/methods/0.0.1
cc -std=c99 -pedantic -c -O3 -fPIC -m64 -Wall -W -Wstrict-prototypes -Wwrite-strings -g -ggdb async.c
npm http GET http://nj-npm.irisnpm.com/methods/-/methods-0.0.1.tgz
npm http 200 http://nj-npm.irisnpm.com/sprintf/-/sprintf-0.1.1.tgz
async.c: In function '__redisAsyncCommand':
async.c:538:10: warning: 'cstr' may be used uninitialized in this function [-Wuninitialized]
npm http 200 http://nj-npm.irisnpm.com/send/0.1.0
npm http GET http://nj-npm.irisnpm.com/send/-/send-0.1.0.tgz
npm http 200 http://nj-npm.irisnpm.com/request/-/request-2.9.100.tgz
ar rcs libhiredis.a net.o hiredis.o sds.o async.o
make[1]: Leaving directory `/root/tmp/tmp-3498pjmxgkw/build/package/node_modules/hiredis/deps/hiredis'
node-waf configure build
Setting srcdir to : /root/tmp/tmp-3498pjmxgkw/build/package/node_modules/hiredis
Setting blddir to : /root/tmp/tmp-3498pjmxgkw/build/package/node_modules/hiredis/build
Checking for program g++ or c++ : /opt/local/bin/g++
Checking for program cpp : /opt/local/bin/cpp
Checking for program ar : /opt/local/bin/ar
Checking for program ranlib : /opt/local/bin/ranlib
Checking for g++ : ok
Checking for node path : not found
Checking for node prefix : ok /opt/local
'configure' finished successfully (0.056s)
Waf: Entering directory `/root/tmp/tmp-3498pjmxgkw/build/package/node_modules/hiredis/build'
[1/3] cxx: hiredis.cc -> build/Release/hiredis_1.o
[2/3] cxx: reader.cc -> build/Release/reader_1.o
npm http 200 http://nj-npm.irisnpm.com/cookie-signature/0.0.1
npm http GET http://nj-npm.irisnpm.com/cookie-signature/-/cookie-signature-0.0.1.tgz
npm http 200 http://nj-npm.irisnpm.com/debug
npm http GET http://nj-npm.irisnpm.com/debug/-/debug-0.7.0.tgz
npm http 200 http://nj-npm.irisnpm.com/xml2js/-/xml2js-0.2.2.tgz
npm http 200 http://nj-npm.irisnpm.com/mime/-/mime-1.2.8.tgz
npm http 200 http://nj-npm.irisnpm.com/common/-/common-0.2.1.tgz
npm http 200 http://nj-npm.irisnpm.com/winston/-/winston-0.6.2.tgz
npm http 200 http://nj-npm.irisnpm.com/connect/-/connect-2.7.2.tgz
npm http 200 http://nj-npm.irisnpm.com/commander/-/commander-0.6.1.tgz
npm http 200 http://nj-npm.irisnpm.com/mkdirp/-/mkdirp-0.3.3.tgz
npm http 200 http://nj-npm.irisnpm.com/range-parser/-/range-parser-0.0.4.tgz
npm http GET http://nj-npm.irisnpm.com/sax
[3/3] cxx_link: build/Release/hiredis_1.o build/Release/reader_1.o -> build/Release/hiredis.node
ld: fatal: file Release/hiredis_1.o: wrong ELF class: ELFCLASS64
ld: fatal: file processing errors. No output written to /root/tmp/tmp-3498pjmxgkw/build/package/node_modules/hiredis/build/Release/hiredis.node
collect2: ld returned 1 exit status
Waf: Leaving directory `/root/tmp/tmp-3498pjmxgkw/build/package/node_modules/hiredis/build'
Build failed: -> task failed (err #1):
{task: cxx_link hiredis_1.o,reader_1.o -> hiredis.node}
make: *** [all] Error 1
cd deps/hiredis && gmake static
npm http 200 http://nj-npm.irisnpm.com/cookie/-/cookie-0.0.5.tgz
gmake[1]: Entering directory `/root/tmp/tmp-3498pjmxgkw/build/package/node_modules/hiredis/deps/hiredis'
gmake[1]: Nothing to be done for `static'.
gmake[1]: Leaving directory `/root/tmp/tmp-3498pjmxgkw/build/package/node_modules/hiredis/deps/hiredis'
node-waf configure build
npm http 200 http://nj-npm.irisnpm.com/buffer-crc32/-/buffer-crc32-0.1.1.tgz
npm http 200 http://nj-npm.irisnpm.com/mongodb/-/mongodb-1.2.8.tgz
Setting srcdir to : /root/tmp/tmp-3498pjmxgkw/build/package/node_modules/hiredis
Setting blddir to : /root/tmp/tmp-3498pjmxgkw/build/package/node_modules/hiredis/build
Checking for program g++ or c++ : /opt/local/bin/g++
Checking for program cpp : /opt/local/bin/cpp
Checking for program ar : /opt/local/bin/ar
Checking for program ranlib : /opt/local/bin/ranlib
Checking for g++ : ok
Checking for node path : not found
Checking for node prefix : ok /opt/local
'configure' finished successfully (0.056s)
Waf: Entering directory `/root/tmp/tmp-3498pjmxgkw/build/package/node_modules/hiredis/build'
[3/3] cxx_link: build/Release/hiredis_1.o build/Release/reader_1.o -> build/Release/hiredis.node
ld: fatal: file Release/hiredis_1.o: wrong ELF class: ELFCLASS64
ld: fatal: file processing errors. No output written to /root/tmp/tmp-3498pjmxgkw/build/package/node_modules/hiredis/build/Release/hiredis.node
collect2: ld returned 1 exit status
npm http 200 http://nj-npm.irisnpm.com/send/-/send-0.1.0.tgz
npm http 200 http://nj-npm.irisnpm.com/methods/-/methods-0.0.1.tgz
npm http 200 http://nj-npm.irisnpm.com/fresh/-/fresh-0.1.0.tgz
Waf: Leaving directory `/root/tmp/tmp-3498pjmxgkw/build/package/node_modules/hiredis/build'
Build failed: -> task failed (err #1):
{task: cxx_link hiredis_1.o,reader_1.o -> hiredis.node}
gmake: *** [all] Error 1
npm http 200 http://nj-npm.irisnpm.com/cookie-signature/-/cookie-signature-0.0.1.tgz
npm http 200 http://nj-npm.irisnpm.com/debug/-/debug-0.7.0.tgz
npm ERR! hiredis@0.1.14 preinstall: `make || gmake`
npm ERR! `sh "-c" "make || gmake"` failed with 2
npm ERR!
npm ERR! Failed at the hiredis@0.1.14 preinstall script.
npm ERR! This is most likely a problem with the hiredis package,
npm ERR! not with npm itself.
npm ERR! Tell the author that this fails on your system:
npm ERR! make || gmake
npm ERR! You can get their info via:
npm ERR! npm owner ls hiredis
npm ERR! There is likely additional logging output above.
npm ERR! System SunOS 5.11
npm ERR! command "/opt/local/bin/node" "/opt/local/bin/npm" "install"
npm ERR! cwd /root/tmp/tmp-3498pjmxgkw/build/package
npm ERR! node -v v0.8.8
npm ERR! npm -v 1.1.59
npm ERR! code ELIFECYCLE
npm WARN package.json methods@0.0.1 No README.md file found!
npm http 200 http://nj-npm.irisnpm.com/sax
npm http GET http://nj-npm.irisnpm.com/sax/-/sax-0.5.1.tgz
npm http 200 http://nj-npm.irisnpm.com/sax/-/sax-0.5.1.tgz
npm http GET http://nj-npm.irisnpm.com/async
npm http GET http://nj-npm.irisnpm.com/colors
npm http GET http://nj-npm.irisnpm.com/cycle
npm http GET http://nj-npm.irisnpm.com/eyes
npm http GET http://nj-npm.irisnpm.com/pkginfo
npm http GET http://nj-npm.irisnpm.com/stack-trace
npm http GET http://nj-npm.irisnpm.com/request
npm http 200 http://nj-npm.irisnpm.com/cycle
npm http GET http://nj-npm.irisnpm.com/cycle/-/cycle-1.0.1.tgz
npm http 200 http://nj-npm.irisnpm.com/eyes
npm http 200 http://nj-npm.irisnpm.com/pkginfo
npm http GET http://nj-npm.irisnpm.com/eyes/-/eyes-0.1.8.tgz
npm http GET http://nj-npm.irisnpm.com/pkginfo/-/pkginfo-0.2.3.tgz
npm http 200 http://nj-npm.irisnpm.com/colors
npm http GET http://nj-npm.irisnpm.com/colors/-/colors-0.6.0-1.tgz
npm http 200 http://nj-npm.irisnpm.com/cycle/-/cycle-1.0.1.tgz
npm http 200 http://nj-npm.irisnpm.com/stack-trace
npm http 200 http://nj-npm.irisnpm.com/async
npm http 200 http://nj-npm.irisnpm.com/eyes/-/eyes-0.1.8.tgz
npm http 304 http://nj-npm.irisnpm.com/request
npm http GET http://nj-npm.irisnpm.com/request/-/request-2.9.203.tgz
npm http GET http://nj-npm.irisnpm.com/stack-trace/-/stack-trace-0.0.6.tgz
npm http GET http://nj-npm.irisnpm.com/async/-/async-0.1.22.tgz
npm http 200 http://nj-npm.irisnpm.com/colors/-/colors-0.6.0-1.tgz
npm http 200 http://nj-npm.irisnpm.com/pkginfo/-/pkginfo-0.2.3.tgz
npm http 200 http://nj-npm.irisnpm.com/request/-/request-2.9.203.tgz
npm http 200 http://nj-npm.irisnpm.com/stack-trace/-/stack-trace-0.0.6.tgz
npm http 200 http://nj-npm.irisnpm.com/async/-/async-0.1.22.tgz
npm http GET http://nj-npm.irisnpm.com/bson/0.1.5
npm http 200 http://nj-npm.irisnpm.com/bson/0.1.5
npm http GET http://nj-npm.irisnpm.com/bson/-/bson-0.1.5.tgz
npm http 200 http://nj-npm.irisnpm.com/bson/-/bson-0.1.5.tgz
npm http GET http://nj-npm.irisnpm.com/mime/1.2.6
npm http 200 http://nj-npm.irisnpm.com/mime/1.2.6
{
npm http GET http://nj-npm.irisnpm.com/mime/-/mime-1.2.6.tgz
npm http 200 http://nj-npm.irisnpm.com/mime/-/mime-1.2.6.tgz
npm http GET http://nj-npm.irisnpm.com/qs/0.5.1
npm http GET http://nj-npm.irisnpm.com/formidable/1.0.11
npm http GET http://nj-npm.irisnpm.com/bytes/0.1.0
npm http GET http://nj-npm.irisnpm.com/pause/0.0.1
npm http 200 http://nj-npm.irisnpm.com/formidable/1.0.11
npm http GET http://nj-npm.irisnpm.com/formidable/-/formidable-1.0.11.tgz
npm http 200 http://nj-npm.irisnpm.com/pause/0.0.1
npm http GET http://nj-npm.irisnpm.com/pause/-/pause-0.0.1.tgz
npm http 200 http://nj-npm.irisnpm.com/formidable/-/formidable-1.0.11.tgz
npm http 200 http://nj-npm.irisnpm.com/pause/-/pause-0.0.1.tgz
npm http 200 http://nj-npm.irisnpm.com/qs/0.5.1
npm http GET http://nj-npm.irisnpm.com/qs/-/qs-0.5.1.tgz
npm http 200 http://nj-npm.irisnpm.com/bytes/0.1.0
npm http GET http://nj-npm.irisnpm.com/bytes/-/bytes-0.1.0.tgz
npm http 200 http://nj-npm.irisnpm.com/qs/-/qs-0.5.1.tgz
npm http 200 http://nj-npm.irisnpm.com/bytes/-/bytes-0.1.0.tgz
> bson@0.1.5 install /root/tmp/tmp-3498pjmxgkw/build/package/node_modules/mongojs/node_modules/mongodb/node_modules/bson
> node install.js || (exit 0)
================================================================================
= =
= Attempting to build bson c++ extension =
= Windows: no build will be attempted as binaries are prepackaged =
= Unix: on failure the package will still install without the C++ extension =
= =
================================================================================
node-gyp clean
node-gyp configure build
make[1]: Entering directory `/root/tmp/tmp-3498pjmxgkw/build/package/node_modules/mongojs/node_modules/mongodb/node_modules/bson/build'
CXX(target) Release/obj.target/bson/ext/bson.o
SOLINK_MODULE(target) Release/obj.target/bson.node
SOLINK_MODULE(target) Release/obj.target/bson.node: Finished
COPY Release/bson.node
make[1]: Leaving directory `/root/tmp/tmp-3498pjmxgkw/build/package/node_modules/mongojs/node_modules/mongodb/node_modules/bson/build'
child process exited with code 0
npm ERR!
npm ERR! Additional logging details can be found in:
npm ERR! /root/tmp/tmp-3498pjmxgkw/build/package/npm-debug.log
npm ERR! not ok code 0
help: For help with this error contact Nodejitsu Support:
help: webchat: <http://webchat.nodejitsu.com/>
help: irc: <irc://chat.freenode.net/#nodejitsu>
help: email: <support@nodejitsu.com>
help:
help: Copy and paste this output to a gist (http://gist.github.com/)
info: Nodejitsu not ok
Arunodas-MacBook-Pro:streamcoder Arunoda$
Arunodas-MacBook-Pro:streamcoder Arunoda$
Arunodas-MacBook-Pro:streamcoder Arunoda$ vi package.json
Arunodas-MacBook-Pro:streamcoder Arunoda$ jitsu deploy
info: Welcome to Nodejitsu arunodasusiripala
info: jitsu v0.11.4, node v0.8.16
info: It worked if it ends with Nodejitsu ok
info: Executing command deploy
info: Analyzing application dependencies in start-stream-server.js
info: Creating snapshot 0.0.1-1
info Uploading: [=============================] 100%
error: Error running command deploy
error: Nodejitsu Error (500): Internal Server Error
error: npm http GET http://nj-npm.irisnpm.com/express
npm http GET http://nj-npm.irisnpm.com/redis
npm http GET http://nj-npm.irisnpm.com/winstoon
npm http GET http://nj-npm.irisnpm.com/node-uuid
npm http GET http://nj-npm.irisnpm.com/readable-stream
npm http GET http://nj-npm.irisnpm.com/knox
npm http GET http://nj-npm.irisnpm.com/mongojs
npm http GET http://nj-npm.irisnpm.com/request
npm http GET https://github.com/bobmayo56/node-librato-metrics/archive/master.tar.gz
npm http 200 https://github.com/bobmayo56/node-librato-metrics/archive/master.tar.gz
npm http 200 http://nj-npm.irisnpm.com/winstoon
npm http GET http://nj-npm.irisnpm.com/winstoon/-/winstoon-0.1.3.tgz
npm http 200 http://nj-npm.irisnpm.com/redis
npm http 200 http://nj-npm.irisnpm.com/node-uuid
npm http GET http://nj-npm.irisnpm.com/redis/-/redis-0.8.2.tgz
npm http 200 http://nj-npm.irisnpm.com/readable-stream
npm http GET http://nj-npm.irisnpm.com/node-uuid/-/node-uuid-1.4.0.tgz
npm http GET http://nj-npm.irisnpm.com/readable-stream/-/readable-stream-0.1.0.tgz
npm http 200 http://nj-npm.irisnpm.com/winstoon/-/winstoon-0.1.3.tgz
npm http 200 http://nj-npm.irisnpm.com/express
npm http 200 http://nj-npm.irisnpm.com/knox
npm http GET http://nj-npm.irisnpm.com/express/-/express-3.0.6.tgz
npm http GET http://nj-npm.irisnpm.com/knox/-/knox-0.4.6.tgz
npm http 200 http://nj-npm.irisnpm.com/mongojs
npm http 200 http://nj-npm.irisnpm.com/redis/-/redis-0.8.2.tgz
npm http 200 http://nj-npm.irisnpm.com/request
npm http GET http://nj-npm.irisnpm.com/mongojs/-/mongojs-0.4.6.tgz
npm http GET http://nj-npm.irisnpm.com/request/-/request-2.12.0.tgz
npm http 200 http://nj-npm.irisnpm.com/express/-/express-3.0.6.tgz
npm http 200 http://nj-npm.irisnpm.com/readable-stream/-/readable-stream-0.1.0.tgz
npm http 200 http://nj-npm.irisnpm.com/node-uuid/-/node-uuid-1.4.0.tgz
npm http 200 http://nj-npm.irisnpm.com/knox/-/knox-0.4.6.tgz
npm http 200 http://nj-npm.irisnpm.com/mongojs/-/mongojs-0.4.6.tgz
npm http 200 http://nj-npm.irisnpm.com/request/-/request-2.12.0.tgz
npm http GET http://nj-npm.irisnpm.com/request/2.9.100
npm http GET http://nj-npm.irisnpm.com/winston
npm http GET http://nj-npm.irisnpm.com/sprintf
npm http GET http://nj-npm.irisnpm.com/mime
npm http GET http://nj-npm.irisnpm.com/xml2js
npm http GET http://nj-npm.irisnpm.com/common
npm http GET http://nj-npm.irisnpm.com/mongodb
npm http GET http://nj-npm.irisnpm.com/connect/2.7.2
npm http GET http://nj-npm.irisnpm.com/commander/0.6.1
npm http GET http://nj-npm.irisnpm.com/range-parser/0.0.4
npm http GET http://nj-npm.irisnpm.com/mkdirp/0.3.3
npm http GET http://nj-npm.irisnpm.com/cookie/0.0.5
npm http GET http://nj-npm.irisnpm.com/buffer-crc32/0.1.1
npm http GET http://nj-npm.irisnpm.com/fresh/0.1.0
npm http GET http://nj-npm.irisnpm.com/methods/0.0.1
npm http GET http://nj-npm.irisnpm.com/send/0.1.0
npm http GET http://nj-npm.irisnpm.com/cookie-signature/0.0.1
npm http GET http://nj-npm.irisnpm.com/debug
npm http 200 http://nj-npm.irisnpm.com/sprintf
npm http GET http://nj-npm.irisnpm.com/sprintf/-/sprintf-0.1.1.tgz
npm http 200 http://nj-npm.irisnpm.com/mime
npm http GET http://nj-npm.irisnpm.com/mime/-/mime-1.2.8.tgz
npm http 200 http://nj-npm.irisnpm.com/xml2js
npm http GET http://nj-npm.irisnpm.com/xml2js/-/xml2js-0.2.2.tgz
npm http 200 http://nj-npm.irisnpm.com/common
npm http GET http://nj-npm.irisnpm.com/common/-/common-0.2.1.tgz
npm http 200 http://nj-npm.irisnpm.com/winston
npm http 200 http://nj-npm.irisnpm.com/request/2.9.100
npm http GET http://nj-npm.irisnpm.com/winston/-/winston-0.6.2.tgz
npm http GET http://nj-npm.irisnpm.com/request/-/request-2.9.100.tgz
npm http 200 http://nj-npm.irisnpm.com/mkdirp/0.3.3
npm http GET http://nj-npm.irisnpm.com/mkdirp/-/mkdirp-0.3.3.tgz
npm http 200 http://nj-npm.irisnpm.com/connect/2.7.2
npm http GET http://nj-npm.irisnpm.com/connect/-/connect-2.7.2.tgz
npm http 200 http://nj-npm.irisnpm.com/range-parser/0.0.4
npm http GET http://nj-npm.irisnpm.com/range-parser/-/range-parser-0.0.4.tgz
npm http 200 http://nj-npm.irisnpm.com/commander/0.6.1
npm http GET http://nj-npm.irisnpm.com/commander/-/commander-0.6.1.tgz
npm http 200 http://nj-npm.irisnpm.com/buffer-crc32/0.1.1
npm http GET http://nj-npm.irisnpm.com/buffer-crc32/-/buffer-crc32-0.1.1.tgz
npm http 200 http://nj-npm.irisnpm.com/mongodb
npm http 200 http://nj-npm.irisnpm.com/methods/0.0.1
npm http 200 http://nj-npm.irisnpm.com/fresh/0.1.0
npm http 200 http://nj-npm.irisnpm.com/send/0.1.0
npm http 200 http://nj-npm.irisnpm.com/cookie/0.0.5
npm http GET http://nj-npm.irisnpm.com/mongodb/-/mongodb-1.2.8.tgz
npm http GET http://nj-npm.irisnpm.com/methods/-/methods-0.0.1.tgz
npm http GET http://nj-npm.irisnpm.com/fresh/-/fresh-0.1.0.tgz
npm http GET http://nj-npm.irisnpm.com/send/-/send-0.1.0.tgz
npm http GET http://nj-npm.irisnpm.com/cookie/-/cookie-0.0.5.tgz
npm http 200 http://nj-npm.irisnpm.com/cookie-signature/0.0.1
npm http GET http://nj-npm.irisnpm.com/cookie-signature/-/cookie-signature-0.0.1.tgz
npm http 200 http://nj-npm.irisnpm.com/sprintf/-/sprintf-0.1.1.tgz
npm http 200 http://nj-npm.irisnpm.com/mime/-/mime-1.2.8.tgz
npm http 200 http://nj-npm.irisnpm.com/xml2js/-/xml2js-0.2.2.tgz
npm http 200 http://nj-npm.irisnpm.com/common/-/common-0.2.1.tgz
npm http 200 http://nj-npm.irisnpm.com/debug
npm http 200 http://nj-npm.irisnpm.com/request/-/request-2.9.100.tgz
npm http 200 http://nj-npm.irisnpm.com/winston/-/winston-0.6.2.tgz
npm http GET http://nj-npm.irisnpm.com/debug/-/debug-0.7.0.tgz
npm http 200 http://nj-npm.irisnpm.com/connect/-/connect-2.7.2.tgz
npm http 200 http://nj-npm.irisnpm.com/mkdirp/-/mkdirp-0.3.3.tgz
npm http 200 http://nj-npm.irisnpm.com/range-parser/-/range-parser-0.0.4.tgz
npm http 200 http://nj-npm.irisnpm.com/mongodb/-/mongodb-1.2.8.tgz
npm http 200 http://nj-npm.irisnpm.com/fresh/-/fresh-0.1.0.tgz
npm http 200 http://nj-npm.irisnpm.com/buffer-crc32/-/buffer-crc32-0.1.1.tgz
npm http 200 http://nj-npm.irisnpm.com/commander/-/commander-0.6.1.tgz
npm http 200 http://nj-npm.irisnpm.com/methods/-/methods-0.0.1.tgz
npm http 200 http://nj-npm.irisnpm.com/cookie-signature/-/cookie-signature-0.0.1.tgz
npm http 200 http://nj-npm.irisnpm.com/send/-/send-0.1.0.tgz
npm http 200 http://nj-npm.irisnpm.com/cookie/-/cookie-0.0.5.tgz
npm WARN package.json methods@0.0.1 No README.md file found!
npm http 200 http://nj-npm.irisnpm.com/debug/-/debug-0.7.0.tgz
npm http GET http://nj-npm.irisnpm.com/sax
npm http 200 http://nj-npm.irisnpm.com/sax
npm http GET http://nj-npm.irisnpm.com/sax/-/sax-0.5.1.tgz
npm http 200 http://nj-npm.irisnpm.com/sax/-/sax-0.5.1.tgz
npm http GET http://nj-npm.irisnpm.com/async
npm http GET http://nj-npm.irisnpm.com/colors
npm http GET http://nj-npm.irisnpm.com/cycle
npm http GET http://nj-npm.irisnpm.com/eyes
npm http GET http://nj-npm.irisnpm.com/pkginfo
npm http GET http://nj-npm.irisnpm.com/stack-trace
npm http GET http://nj-npm.irisnpm.com/request
npm http 200 http://nj-npm.irisnpm.com/colors
npm http GET http://nj-npm.irisnpm.com/colors/-/colors-0.6.0-1.tgz
npm http 200 http://nj-npm.irisnpm.com/pkginfo
npm http GET http://nj-npm.irisnpm.com/pkginfo/-/pkginfo-0.2.3.tgz
npm http 200 http://nj-npm.irisnpm.com/eyes
npm http 200 http://nj-npm.irisnpm.com/cycle
npm http GET http://nj-npm.irisnpm.com/eyes/-/eyes-0.1.8.tgz
npm http GET http://nj-npm.irisnpm.com/cycle/-/cycle-1.0.1.tgz
npm http 200 http://nj-npm.irisnpm.com/async
npm http 304 http://nj-npm.irisnpm.com/request
npm http 200 http://nj-npm.irisnpm.com/stack-trace
npm http GET http://nj-npm.irisnpm.com/async/-/async-0.1.22.tgz
npm http GET http://nj-npm.irisnpm.com/stack-trace/-/stack-trace-0.0.6.tgz
npm http GET http://nj-npm.irisnpm.com/request/-/request-2.9.203.tgz
npm http 200 http://nj-npm.irisnpm.com/colors/-/colors-0.6.0-1.tgz
npm http 200 http://nj-npm.irisnpm.com/pkginfo/-/pkginfo-0.2.3.tgz
npm http 200 http://nj-npm.irisnpm.com/eyes/-/eyes-0.1.8.tgz
npm http 200 http://nj-npm.irisnpm.com/cycle/-/cycle-1.0.1.tgz
npm http 200 http://nj-npm.irisnpm.com/async/-/async-0.1.22.tgz
npm http 200 http://nj-npm.irisnpm.com/stack-trace/-/stack-trace-0.0.6.tgz
npm http 200 http://nj-npm.irisnpm.com/request/-/request-2.9.203.tgz
npm http GET http://nj-npm.irisnpm.com/bson/0.1.5
npm http 200 http://nj-npm.irisnpm.com/bson/0.1.5
npm http GET http://nj-npm.irisnpm.com/bson/-/bson-0.1.5.tgz
npm http GET http://nj-npm.irisnpm.com/mime/1.2.6
npm http 200 http://nj-npm.irisnpm.com/bson/-/bson-0.1.5.tgz
npm http 200 http://nj-npm.irisnpm.com/mime/1.2.6
npm http GET http://nj-npm.irisnpm.com/mime/-/mime-1.2.6.tgz
npm http 200 http://nj-npm.irisnpm.com/mime/-/mime-1.2.6.tgz
npm http GET http://nj-npm.irisnpm.com/qs/0.5.1
npm http GET http://nj-npm.irisnpm.com/formidable/1.0.11
npm http GET http://nj-npm.irisnpm.com/bytes/0.1.0
npm http GET http://nj-npm.irisnpm.com/pause/0.0.1
npm http 200 http://nj-npm.irisnpm.com/pause/0.0.1
npm http GET http://nj-npm.irisnpm.com/pause/-/pause-0.0.1.tgz
npm http 200 http://nj-npm.irisnpm.com/formidable/1.0.11
npm http GET http://nj-npm.irisnpm.com/formidable/-/formidable-1.0.11.tgz
npm http 200 http://nj-npm.irisnpm.com/pause/-/pause-0.0.1.tgz
npm http 200 http://nj-npm.irisnpm.com/formidable/-/formidable-1.0.11.tgz
npm http 200 http://nj-npm.irisnpm.com/qs/0.5.1
npm http 200 http://nj-npm.irisnpm.com/bytes/0.1.0
npm http GET http://nj-npm.irisnpm.com/qs/-/qs-0.5.1.tgz
npm http GET http://nj-npm.irisnpm.com/bytes/-/bytes-0.1.0.tgz
npm http 200 http://nj-npm.irisnpm.com/bytes/-/bytes-0.1.0.tgz
npm http 200 http://nj-npm.irisnpm.com/qs/-/qs-0.5.1.tgz
> bson@0.1.5 install /root/tmp/tmp-3498it1vbio/build/package/node_modules/mongojs/node_modules/mongodb/node_modules/bson
> node install.js || (exit 0)
================================================================================
= =
= Attempting to build bson c++ extension =
= Windows: no build will be attempted as binaries are prepackaged =
= Unix: on failure the package will still install without the C++ extension =
= =
================================================================================
node-gyp clean
node-gyp configure build
make[1]: Entering directory `/root/tmp/tmp-3498it1vbio/build/package/node_modules/mongojs/node_modules/mongodb/node_modules/bson/build'
CXX(target) Release/obj.target/bson/ext/bson.o
SOLINK_MODULE(target) Release/obj.target/bson.node
SOLINK_MODULE(target) Release/obj.target/bson.node: Finished
COPY Release/bson.node
make[1]: Leaving directory `/root/tmp/tmp-3498it1vbio/build/package/node_modules/mongojs/node_modules/mongodb/node_modules/bson/build'
child process exited with code 0
> lame@1.0.0 install /root/tmp/tmp-3498it1vbio/build/package/node_modules/lame
> node-gyp rebuild
make: Entering directory `/root/tmp/tmp-3498it1vbio/build/package/node_modules/lame/build'
deps/mpg123/test.target.mk:116: warning: overriding recipe for target `Release/test.node'
deps/lame/test.target.mk:124: warning: ignoring old recipe for target `Release/test.node'
CC(target) Release/obj.target/mp3lame/deps/lame/libmp3lame/VbrTag.o
CC(target) Release/obj.target/mp3lame/deps/lame/libmp3lame/bitstream.o
../deps/lame/libmp3lame/bitstream.c: In function 'do_gain_analysis':
../deps/lame/libmp3lame/bitstream.c:992:24: warning: unused variable 'rov' [-Wunused-variable]
../deps/lame/libmp3lame/bitstream.c:991:32: warning: unused variable 'rsv' [-Wunused-variable]
../deps/lame/libmp3lame/bitstream.c:990:34: warning: unused variable 'cfg' [-Wunused-variable]
CC(target) Release/obj.target/mp3lame/deps/lame/libmp3lame/encoder.o
CC(target) Release/obj.target/mp3lame/deps/lame/libmp3lame/fft.o
CC(target) Release/obj.target/mp3lame/deps/lame/libmp3lame/gain_analysis.o
CC(target) Release/obj.target/mp3lame/deps/lame/libmp3lame/id3tag.o
CC(target) Release/obj.target/mp3lame/deps/lame/libmp3lame/lame.o
CC(target) Release/obj.target/mp3lame/deps/lame/libmp3lame/newmdct.o
CC(target) Release/obj.target/mp3lame/deps/lame/libmp3lame/presets.o
CC(target) Release/obj.target/mp3lame/deps/lame/libmp3lame/psymodel.o
CC(target) Release/obj.target/mp3lame/deps/lame/libmp3lame/quantize.o
../deps/lame/libmp3lame/quantize.c: In function 'VBR_new_iteration_loop':
../deps/lame/libmp3lame/quantize.c:1734:28: warning: variable 'fullframebits' set but not used [-Wunused-but-set-variable]
CC(target) Release/obj.target/mp3lame/deps/lame/libmp3lame/quantize_pvt.o
CC(target) Release/obj.target/mp3lame/deps/lame/libmp3lame/reservoir.o
CC(target) Release/obj.target/mp3lame/deps/lame/libmp3lame/set_get.o
CC(target) Release/obj.target/mp3lame/deps/lame/libmp3lame/tables.o
CC(target) Release/obj.target/mp3lame/deps/lame/libmp3lame/takehiro.o
CC(target) Release/obj.target/mp3lame/deps/lame/libmp3lame/util.o
CC(target) Release/obj.target/mp3lame/deps/lame/libmp3lame/vbrquantize.o
CC(target) Release/obj.target/mp3lame/deps/lame/libmp3lame/version.o
AR(target) Release/obj.target/deps/lame/libmp3lame.node
CC(target) Release/obj.target/mpg123/deps/mpg123/src/libmpg123/compat.o
CC(target) Release/obj.target/mpg123/deps/mpg123/src/libmpg123/parse.o
CC(target) Release/obj.target/mpg123/deps/mpg123/src/libmpg123/frame.o
CC(target) Release/obj.target/mpg123/deps/mpg123/src/libmpg123/format.o
CC(target) Release/obj.target/mpg123/deps/mpg123/src/libmpg123/dct64.o
CC(target) Release/obj.target/mpg123/deps/mpg123/src/libmpg123/equalizer.o
CC(target) Release/obj.target/mpg123/deps/mpg123/src/libmpg123/id3.o
CC(target) Release/obj.target/mpg123/deps/mpg123/src/libmpg123/optimize.o
CC(target) Release/obj.target/mpg123/deps/mpg123/src/libmpg123/readers.o
CC(target) Release/obj.target/mpg123/deps/mpg123/src/libmpg123/tabinit.o
CC(target) Release/obj.target/mpg123/deps/mpg123/src/libmpg123/libmpg123.o
CC(target) Release/obj.target/mpg123/deps/mpg123/src/libmpg123/index.o
CC(target) Release/obj.target/mpg123/deps/mpg123/src/libmpg123/stringbuf.o
CC(target) Release/obj.target/mpg123/deps/mpg123/src/libmpg123/icy.o
CC(target) Release/obj.target/mpg123/deps/mpg123/src/libmpg123/icy2utf8.o
CC(target) Release/obj.target/mpg123/deps/mpg123/src/libmpg123/ntom.o
CC(target) Release/obj.target/mpg123/deps/mpg123/src/libmpg123/synth.o
CC(target) Release/obj.target/mpg123/deps/mpg123/src/libmpg123/synth_8bit.o
CC(target) Release/obj.target/mpg123/deps/mpg123/src/libmpg123/layer1.o
CC(target) Release/obj.target/mpg123/deps/mpg123/src/libmpg123/layer2.o
CC(target) Release/obj.target/mpg123/deps/mpg123/src/libmpg123/layer3.o
CC(target) Release/obj.target/mpg123/deps/mpg123/src/libmpg123/feature.o
CC(target) Release/obj.target/mpg123/deps/mpg123/src/libmpg123/dct64_x86_64.o
CC(target) Release/obj.target/mpg123/deps/mpg123/src/libmpg123/dct64_x86_64_float.o
CC(target) Release/obj.target/mpg123/deps/mpg123/src/libmpg123/synth_s32.o
CC(target) Release/obj.target/mpg123/deps/mpg123/src/libmpg123/synth_real.o
CC(target) Release/obj.target/mpg123/deps/mpg123/src/libmpg123/synth_stereo_x86_64.o
CC(target) Release/obj.target/mpg123/deps/mpg123/src/libmpg123/synth_stereo_x86_64_float.o
CC(target) Release/obj.target/mpg123/deps/mpg123/src/libmpg123/synth_stereo_x86_64_s32.o
CC(target) Release/obj.target/mpg123/deps/mpg123/src/libmpg123/synth_x86_64.o
CC(target) Release/obj.target/mpg123/deps/mpg123/src/libmpg123/synth_x86_64_s32.o
CC(target) Release/obj.target/mpg123/deps/mpg123/src/libmpg123/synth_x86_64_float.o
AR(target) Release/obj.target/deps/mpg123/libmpg123.node
CC(target) Release/obj.target/lamevectorroutines/deps/lame/libmp3lame/vector/xmm_quantize_sub.o
../deps/lame/libmp3lame/vector/xmm_quantize_sub.c: In function 'fht_SSE2':
../deps/lame/libmp3lame/vector/xmm_quantize_sub.c:172:20: warning: variable 'v_s2' set but not used [-Wunused-but-set-variable]
AR(target) Release/obj.target/deps/lame/liblamevectorroutines.node
CXX(target) Release/obj.target/bindings/src/bindings.o
CXX(target) Release/obj.target/bindings/src/node_lame.o
CXX(target) Release/obj.target/bindings/src/node_mpg123.o
SOLINK_MODULE(target) Release/obj.target/bindings.node
SOLINK_MODULE(target) Release/obj.target/bindings.node: Finished
COPY Release/bindings.node
make: Leaving directory `/root/tmp/tmp-3498it1vbio/build/package/node_modules/lame/build'
> vorbis@0.0.0 install /root/tmp/tmp-3498it1vbio/build/package/node_modules/vorbis
> node-gyp rebuild
make: Entering directory `/root/tmp/tmp-3498it1vbio/build/package/node_modules/vorbis/build'
{
"name": "ogg-to-mp3",
"version": "0.0.1-1",
"description": "Ogg to Mp3 transcoder",
"dependencies": {
"express": "3.x",
"redis": "0.8.x",
"hiredis": "0.1.x",
"winstoon": "0.1.x",
"ogg": "https://github.com/TooTallNate/node-ogg/archive/master.tar.gz",
"vorbis": "https://github.com/TooTallNate/node-vorbis/archive/master.tar.gz",
"lame": "https://github.com/arunoda/node-lame/archive/master.tar.gz",
"node-uuid": "1.4.x",
"readable-stream": "0.1.x",
"knox": "0.4.x",
"mongojs": "0.4.x",
"librato-metrics": "https://github.com/bobmayo56/node-librato-metrics/archive/master.tar.gz",
"request": "2.x.x"
},
"devDependencies": {
"nodemock": "0.2.x"
},
"engines": {
"node": "0.8.x",
"npm": "1.2.0"
},
"bundledDependencies": ["ogg", "vorbis", "lame", "hiredis"],
"private": true,
"subdomain": "arunodasusiripala.streamcoder",
"scripts": {
"start": "start-stream-server.js"
}
}
Sign up for free to join this conversation on GitHub. Already have an account? Sign in to comment
You can’t perform that action at this time.