Skip to content

Instantly share code, notes, and snippets.

Embed
What would you like to do?
Building Solution: SvgAndroid (Debug)
Building: SvgAndroidSample (Debug)
Build started 5/28/2013 7:28:10 PM.
__________________________________________________
Project "/Users/nischal/Desktop/monodroid-samples-master/SvgAndroid/SvgAndroidSample/SvgAndroidSample.csproj" (Build target(s)):
Target _CheckProjectItems:
CheckProjectItems Task
NativeLibraries:
JavaLibraries:
../SvgAndroid/Jars/svg-android-1.1.jar
JavaSourceFiles:
Target _ComputeAndroidAssetsPaths:
ResourceFiles:
Assets/svg/gradients.svg
Assets/svg/shapes.svg
Assets/svg/strokes.svg
Assets/svg/transformations.svg
IntermediateFiles:
Target _GenerateAndroidAssetsDir:
Skipping target "_GenerateAndroidAssetsDir" because its outputs are up-to-date.
Target _ComputeAndroidResourcePaths:
ResourceFiles:
Resources/layout/main.axml
Resources/drawable-hdpi/icon.png
Resources/drawable-ldpi/icon.png
Resources/drawable-mdpi/icon.png
Resources/drawable-xhdpi/icon.png
Resources/drawable-xxhdpi/icon.png
IntermediateFiles:
Target _GenerateAndroidResourceDir:
Skipping target "_GenerateAndroidResourceDir" because its outputs are up-to-date.
Target _ResolveMonoAndroidSdks:
MonoAndroid Tools: /Library/Frameworks/Xamarin.Android.framework/Versions/Current/lib/mandroid/
MonoAndroid Framework: /Library/Frameworks/Xamarin.Android.framework/Versions/Current/lib/mandroid/platforms/android-16;/Library/Frameworks/Xamarin.Android.framework/Versions/Current/lib/mono/2.1
MonoAndroid Binaries: /Library/Frameworks/Xamarin.Android.framework/Versions/Current/bin/
Android NDK:
Android SDK: /Users/nischal/Desktop/android-sdk-macosx/
Java SDK: /usr/
Target _ValidateAndroidPackageProperties:
GetAndroidPackageName Task
ManifestFile: /Users/nischal/Desktop/monodroid-samples-master/SvgAndroid/SvgAndroidSample/Properties/AndroidManifest.xml
AssemblyName: SvgAndroidSample
PackageName: SvgAndroidSample.SvgAndroidSample
Target _BuildDependencies:
Project "/Users/nischal/Desktop/monodroid-samples-master/SvgAndroid/SvgAndroid/SvgAndroid.csproj" (Build target(s)):
Target _ResolveMonoAndroidSdks:
MonoAndroid Tools: /Library/Frameworks/Xamarin.Android.framework/Versions/Current/lib/mandroid/
MonoAndroid Framework: /Library/Frameworks/Xamarin.Android.framework/Versions/Current/lib/mandroid/platforms/android-8;/Library/Frameworks/Xamarin.Android.framework/Versions/Current/lib/mono/2.1
Android SDK: /Users/nischal/Desktop/android-sdk-macosx/
Java SDK: /usr/
Target ResolveLibraryProjects:
No input files were specified for target ResolveLibraryProjects, skipping.
Target ExportJarToXml:
Skipping target "ExportJarToXml" because its outputs are up-to-date.
Target PrepareForBuild:
Configuration: Debug Platform: AnyCPU
Target GenerateBindings:
Skipping target "GenerateBindings" because its outputs are up-to-date.
Target GenerateSatelliteAssemblies:
No input files were specified for target GenerateSatelliteAssemblies, skipping.
Target CoreCompile:
Skipping target "CoreCompile" because its outputs are up-to-date.
Done building project "/Users/nischal/Desktop/monodroid-samples-master/SvgAndroid/SvgAndroid/SvgAndroid.csproj".
Resolved library outputs: /Users/nischal/Desktop/monodroid-samples-master/SvgAndroid/SvgAndroid/bin/Debug//SvgAndroid.dll
Target _ExtractLibraryProjectImports:
Assemblies:
/Library/Frameworks/Xamarin.Android.framework/Versions/Current/lib/mono/2.1/System.dll
/Library/Frameworks/Xamarin.Android.framework/Versions/Current/lib/mono/2.1/System.Xml.dll
/Library/Frameworks/Xamarin.Android.framework/Versions/Current/lib/mandroid/platforms/android-16/Mono.Android.dll
/Library/Frameworks/Xamarin.Android.framework/Versions/Current/lib/mono/2.1/System.Core.dll
/Users/nischal/Desktop/monodroid-samples-master/SvgAndroid/SvgAndroid/bin/Debug//SvgAndroid.dll
Jars:
ResolvedResourceDirectories:
Target _GetLibraryImports:
NativeLibraries:
Jars:
Target _CheckDuplicateJavaLibraries:
JavaSourceFiles:
JavaLibraries:
../SvgAndroid/Jars/svg-android-1.1.jar
Target _UpdateAndroidResgen:
Skipping target "_UpdateAndroidResgen" because its outputs are up-to-date.
Target PrepareForBuild:
Configuration: Debug Platform: AnyCPU
Target GenerateSatelliteAssemblies:
No input files were specified for target GenerateSatelliteAssemblies, skipping.
Target CoreCompile:
Tool /Library/Frameworks/Xamarin.Android.framework/Versions/Current/bin/smcs execution started with arguments: /noconfig /debug:full /debug+ /optimize- /out:obj/Debug/SvgAndroidSample.dll Resources/Resource.designer.cs Properties/AssemblyInfo.cs SampleActivity.cs /target:library /define:"DEBUG;__ANDROID__;__ANDROID_1__;__ANDROID_2__;__ANDROID_3__;__ANDROID_4__;__ANDROID_5__;__ANDROID_6__;__ANDROID_7__;__ANDROID_8__;__ANDROID_9__;__ANDROID_10__;__ANDROID_11__;__ANDROID_12__;__ANDROID_13__;__ANDROID_14__;__ANDROID_15__;__ANDROID_16__" /reference:/Library/Frameworks/Xamarin.Android.framework/Versions/Current/lib/mono/2.1/System.dll /reference:/Library/Frameworks/Xamarin.Android.framework/Versions/Current/lib/mono/2.1/System.Xml.dll /reference:/Library/Frameworks/Xamarin.Android.framework/Versions/Current/lib/mandroid/platforms/android-16/Mono.Android.dll /reference:/Library/Frameworks/Xamarin.Android.framework/Versions/Current/lib/mono/2.1/System.Core.dll /reference:/Users/nischal/Desktop/monodroid-samples-master/SvgAndroid/SvgAndroid/bin/Debug//SvgAndroid.dll /warn:4
SampleActivity.cs(34,78): warning CS0618: `Android.OS.Build.VERSION_CODES.Froyo' is obsolete: `This constant will be removed in the future version. Use Android.OS.BuildVersionCodes enum directly instead of this field.'
SampleActivity.cs(34,49): error CS0019: Operator `>=' cannot be applied to operands of type `Android.OS.BuildVersionCodes' and `int'
SampleActivity.cs(36,46): error CS1061: Type `Android.Views.View' does not contain a definition for `setLayerType' and no extension method `setLayerType' of type `Android.Views.View' could be found (are you missing a using directive or an assembly reference?)
/Library/Frameworks/Xamarin.Android.framework/Versions/4.6.7-4/lib/mandroid/platforms/android-16/Mono.Android.dll (Location of the symbol related to previous error)
SampleActivity.cs(37,43): error CS1061: Type `Android.Views.View' does not contain a definition for `setLayerType' and no extension method `setLayerType' of type `Android.Views.View' could be found (are you missing a using directive or an assembly reference?)
/Library/Frameworks/Xamarin.Android.framework/Versions/4.6.7-4/lib/mandroid/platforms/android-16/Mono.Android.dll (Location of the symbol related to previous error)
Task "Csc" execution -- FAILED
Done building target "CoreCompile" in project "/Users/nischal/Desktop/monodroid-samples-master/SvgAndroid/SvgAndroidSample/SvgAndroidSample.csproj".-- FAILED
Done building project "/Users/nischal/Desktop/monodroid-samples-master/SvgAndroid/SvgAndroidSample/SvgAndroidSample.csproj".-- FAILED
Build FAILED.
Warnings:
/Users/nischal/Desktop/monodroid-samples-master/SvgAndroid/SvgAndroidSample/SvgAndroidSample.csproj (Build) ->
/Library/Frameworks/Mono.framework/Versions/2.10.12/lib/mono/4.0/Microsoft.CSharp.Targets (CoreCompile target) ->
SampleActivity.cs(34,78): warning CS0618: `Android.OS.Build.VERSION_CODES.Froyo' is obsolete: `This constant will be removed in the future version. Use Android.OS.BuildVersionCodes enum directly instead of this field.'
Errors:
/Users/nischal/Desktop/monodroid-samples-master/SvgAndroid/SvgAndroidSample/SvgAndroidSample.csproj (Build) ->
/Library/Frameworks/Mono.framework/Versions/2.10.12/lib/mono/4.0/Microsoft.CSharp.Targets (CoreCompile target) ->
SampleActivity.cs(34,49): error CS0019: Operator `>=' cannot be applied to operands of type `Android.OS.BuildVersionCodes' and `int'
SampleActivity.cs(36,46): error CS1061: Type `Android.Views.View' does not contain a definition for `setLayerType' and no extension method `setLayerType' of type `Android.Views.View' could be found (are you missing a using directive or an assembly reference?)
SampleActivity.cs(37,43): error CS1061: Type `Android.Views.View' does not contain a definition for `setLayerType' and no extension method `setLayerType' of type `Android.Views.View' could be found (are you missing a using directive or an assembly reference?)
1 Warning(s)
3 Error(s)
Time Elapsed 00:00:01.3266110
---------------------- Done ----------------------
Build: 3 errors, 1 warning
Sign up for free to join this conversation on GitHub. Already have an account? Sign in to comment
You can’t perform that action at this time.