Skip to content

Instantly share code, notes, and snippets.

Embed
What would you like to do?
Building Solution: MapsAndLocationDemo (Debug)
Building: GooglePlayServices (Debug)
Build started 5/22/2013 8:09:58 PM.
__________________________________________________
Project "/Users/nischal/Desktop/monodroid-samples-master/MapsAndLocationDemo_v2/GooglePlayServices/GooglePlayServices.csproj" (Build target(s)):
Target _ResolveMonoAndroidSdks:
MonoAndroid Tools: /Library/Frameworks/Xamarin.Android.framework/Versions/Current/lib/mandroid/
MonoAndroid Framework: /Library/Frameworks/Xamarin.Android.framework/Versions/Current/lib/mandroid/platforms/android-14;/Library/Frameworks/Xamarin.Android.framework/Versions/Current/lib/mono/2.1
Android SDK: /Users/nischal/Desktop/android-sdk-macosx/
Java SDK: /usr/
Target ResolveLibraryProjects:
/Library/Frameworks/Mono.framework/External/xbuild/Xamarin/Android/Xamarin.Android.Bindings.targets: error : Error executing task CreateLibraryResourceArchive: Could not find a part of the path "/Users/nischal/Desktop/monodroid-samples-master/MapsAndLocationDemo_v2/google-play-services_lib/project.properties".
Task "CreateLibraryResourceArchive" execution -- FAILED
Done building target "ResolveLibraryProjects" in project "/Users/nischal/Desktop/monodroid-samples-master/MapsAndLocationDemo_v2/GooglePlayServices/GooglePlayServices.csproj".-- FAILED
Done building project "/Users/nischal/Desktop/monodroid-samples-master/MapsAndLocationDemo_v2/GooglePlayServices/GooglePlayServices.csproj".-- FAILED
Build FAILED.
Errors:
/Users/nischal/Desktop/monodroid-samples-master/MapsAndLocationDemo_v2/GooglePlayServices/GooglePlayServices.csproj (Build) ->
/Library/Frameworks/Mono.framework/External/xbuild/Xamarin/Android/Xamarin.Android.Bindings.targets (ResolveLibraryProjects target) ->
/Library/Frameworks/Mono.framework/External/xbuild/Xamarin/Android/Xamarin.Android.Bindings.targets: error : Error executing task CreateLibraryResourceArchive: Could not find a part of the path "/Users/nischal/Desktop/monodroid-samples-master/MapsAndLocationDemo_v2/google-play-services_lib/project.properties".
0 Warning(s)
1 Error(s)
Time Elapsed 00:00:00.0926990
---------------------- Done ----------------------
Build: 1 error, 0 warnings
Sign up for free to join this conversation on GitHub. Already have an account? Sign in to comment
You can’t perform that action at this time.