Skip to content

@attractedtofire /config.log
Last active

Embed URL

HTTPS clone URL

Subversion checkout URL

You can clone with
or
.
Download ZIP
This file contains any messages produced by compilers while
running configure, to aid debugging if configure makes a mistake.
configure:759: checking host system type
configure:782: checking for gcc
configure:886: checking whether the C compiler (gcc -march=x86-64 -mtune=generic -O2 -pipe -fstack-protector --param=ssp-buffer-size=4 -Wl,-O1,--sort-common,--as-needed,-z,relro) works
configure:902: gcc -o conftest -march=x86-64 -mtune=generic -O2 -pipe -fstack-protector --param=ssp-buffer-size=4 -D_FORTIFY_SOURCE=2 -Wl,-O1,--sort-common,--as-needed,-z,relro conftest.c 1>&5
configure:928: checking whether the C compiler (gcc -march=x86-64 -mtune=generic -O2 -pipe -fstack-protector --param=ssp-buffer-size=4 -Wl,-O1,--sort-common,--as-needed,-z,relro) is a cross-compiler
configure:933: checking whether we are using GNU C
configure:940: gcc -E conftest.c
configure:958: checking whether gcc accepts -g
configure:987: checking for Cygwin environment
configure:1001: gcc -c -march=x86-64 -mtune=generic -O2 -pipe -fstack-protector --param=ssp-buffer-size=4 -D_FORTIFY_SOURCE=2 conftest.c 1>&5
configure: In function 'main':
configure:995:20: error: '__CYGWIN32__' undeclared (first use in this function)
#define __CYGWIN__ __CYGWIN32__
^
configure:997:8: note: in expansion of macro '__CYGWIN__'
return __CYGWIN__;
^
configure:995:20: note: each undeclared identifier is reported only once for each function it appears in
#define __CYGWIN__ __CYGWIN32__
^
configure:997:8: note: in expansion of macro '__CYGWIN__'
return __CYGWIN__;
^
configure: failed program was:
#line 990 "configure"
#include "confdefs.h"
int main() {
#ifndef __CYGWIN__
#define __CYGWIN__ __CYGWIN32__
#endif
return __CYGWIN__;
; return 0; }
configure:1017: checking for mingw32 environment
configure:1027: gcc -c -march=x86-64 -mtune=generic -O2 -pipe -fstack-protector --param=ssp-buffer-size=4 -D_FORTIFY_SOURCE=2 conftest.c 1>&5
configure: In function 'main':
configure:1023:8: error: '__MINGW32__' undeclared (first use in this function)
return __MINGW32__;
^
configure:1023:8: note: each undeclared identifier is reported only once for each function it appears in
configure: failed program was:
#line 1020 "configure"
#include "confdefs.h"
int main() {
return __MINGW32__;
; return 0; }
configure:1045: checking for executable suffix
configure:1064: checking for full floating-point support
configure:1110: gcc -o conftest -march=x86-64 -mtune=generic -O2 -pipe -fstack-protector --param=ssp-buffer-size=4 -D_FORTIFY_SOURCE=2 -Wl,-O1,--sort-common,--as-needed,-z,relro conftest.c 1>&5
configure:1181: checking for pwd
configure:1219: checking for source directory
configure:1230: checking for build directory
configure:1298: checking for svnversion
configure:1357: checking for MacOSX App
configure:1369: checking for MacOSX architectures
configure:1398: checking for MacOSX SDK
configure:1452: checking how to build libraries
configure:1495: checking for ranlib
configure:1520: checking how to run the C preprocessor
configure:1539: gcc -E -D_FORTIFY_SOURCE=2 conftest.c >/dev/null 2>conftest.out
In file included from /usr/include/assert.h:36:0,
from configure:1534:
/usr/include/features.h:330:4: warning: #warning _FORTIFY_SOURCE requires compiling with optimization (-O) [-Wcpp]
# warning _FORTIFY_SOURCE requires compiling with optimization (-O)
^
configure: failed program was:
#line 1533 "configure"
#include "confdefs.h"
#include <assert.h>
Syntax Error
configure:1556: gcc -E -traditional-cpp -D_FORTIFY_SOURCE=2 conftest.c >/dev/null 2>conftest.out
In file included from /usr/include/assert.h:37:0,
from configure:1552:
/usr/include/features.h:330:4: warning: #warning _FORTIFY_SOURCE requires compiling with optimization (-O) [-Wcpp]
# warning _FORTIFY_SOURCE requires compiling with optimization (-O)
^
In file included from /usr/include/features.h:376:0,
from /usr/include/assert.h:37,
from configure:1552:
/usr/include/sys/cdefs.h:31:3: error: #error "You need a ISO C conforming compiler to use the glibc headers"
# error "You need a ISO C conforming compiler to use the glibc headers"
^
configure: failed program was:
#line 1550 "configure"
#include "confdefs.h"
#include <assert.h>
Syntax Error
configure:1573: gcc -nologo -E -D_FORTIFY_SOURCE=2 conftest.c >/dev/null 2>conftest.out
gcc: error: unrecognized command line option '-nologo'
configure: failed program was:
#line 1567 "configure"
#include "confdefs.h"
#include <assert.h>
Syntax Error
configure:1601: checking if 64bit support is requested
configure:1621: checking if 64bit Sparc VIS support is requested
configure:1645: checking system version (for dynamic loading)
configure:1671: checking for dlopen in -ldl
configure:1688: gcc -o conftest -march=x86-64 -mtune=generic -O2 -pipe -fstack-protector --param=ssp-buffer-size=4 -D_FORTIFY_SOURCE=2 -Wl,-O1,--sort-common,--as-needed,-z,relro conftest.c -ldl 1>&5
configure:1735: checking for ar
configure:3619: checking for additional include dirs
configure:3642: checking for additional library dirs
configure:3676: checking for a BSD compatible install
configure:3729: checking for flex
configure:3760: checking for yywrap in -lfl
configure:3777: gcc -o conftest -march=x86-64 -mtune=generic -O2 -pipe -fstack-protector --param=ssp-buffer-size=4 -D_FORTIFY_SOURCE=2 -Wl,-O1,--sort-common,--as-needed,-z,relro -Wl,--export-dynamic conftest.c -lfl 1>&5
configure:3842: checking for bison
configure:3911: checking for ranlib
configure:3940: checking for ar
configure:3971: checking for env
configure:4000: checking for perl
configure:4031: checking for ANSI C header files
configure:4042: /lib/cpp -D_FORTIFY_SOURCE=2 conftest.c >/dev/null 2>conftest.out
./configure: line 4041: /lib/cpp: No such file or directory
configure: failed program was:
#line 4034 "configure"
#include "confdefs.h"
#include <stdlib.h>
#include <stdarg.h>
#include <string.h>
#include <float.h>
configure:4136: checking for limits.h
configure:4144: /lib/cpp -D_FORTIFY_SOURCE=2 conftest.c >/dev/null 2>conftest.out
./configure: line 4143: /lib/cpp: No such file or directory
configure: failed program was:
#line 4139 "configure"
#include "confdefs.h"
#include <limits.h>
configure:4136: checking for termio.h
configure:4144: /lib/cpp -D_FORTIFY_SOURCE=2 conftest.c >/dev/null 2>conftest.out
./configure: line 4143: /lib/cpp: No such file or directory
configure: failed program was:
#line 4139 "configure"
#include "confdefs.h"
#include <termio.h>
configure:4136: checking for termios.h
configure:4144: /lib/cpp -D_FORTIFY_SOURCE=2 conftest.c >/dev/null 2>conftest.out
./configure: line 4143: /lib/cpp: No such file or directory
configure: failed program was:
#line 4139 "configure"
#include "confdefs.h"
#include <termios.h>
configure:4136: checking for unistd.h
configure:4144: /lib/cpp -D_FORTIFY_SOURCE=2 conftest.c >/dev/null 2>conftest.out
./configure: line 4143: /lib/cpp: No such file or directory
configure: failed program was:
#line 4139 "configure"
#include "confdefs.h"
#include <unistd.h>
configure:4136: checking for values.h
configure:4144: /lib/cpp -D_FORTIFY_SOURCE=2 conftest.c >/dev/null 2>conftest.out
./configure: line 4143: /lib/cpp: No such file or directory
configure: failed program was:
#line 4139 "configure"
#include "confdefs.h"
#include <values.h>
configure:4136: checking for f2c.h
configure:4144: /lib/cpp -D_FORTIFY_SOURCE=2 conftest.c >/dev/null 2>conftest.out
./configure: line 4143: /lib/cpp: No such file or directory
configure: failed program was:
#line 4139 "configure"
#include "confdefs.h"
#include <f2c.h>
configure:4136: checking for g2c.h
configure:4144: /lib/cpp -D_FORTIFY_SOURCE=2 conftest.c >/dev/null 2>conftest.out
./configure: line 4143: /lib/cpp: No such file or directory
configure: failed program was:
#line 4139 "configure"
#include "confdefs.h"
#include <g2c.h>
configure:4173: checking for sys/ioctl.h
configure:4181: /lib/cpp -D_FORTIFY_SOURCE=2 conftest.c >/dev/null 2>conftest.out
./configure: line 4180: /lib/cpp: No such file or directory
configure: failed program was:
#line 4176 "configure"
#include "confdefs.h"
#include <sys/ioctl.h>
configure:4173: checking for sys/mtio.h
configure:4181: /lib/cpp -D_FORTIFY_SOURCE=2 conftest.c >/dev/null 2>conftest.out
./configure: line 4180: /lib/cpp: No such file or directory
configure: failed program was:
#line 4176 "configure"
#include "confdefs.h"
#include <sys/mtio.h>
configure:4173: checking for sys/resource.h
configure:4181: /lib/cpp -D_FORTIFY_SOURCE=2 conftest.c >/dev/null 2>conftest.out
./configure: line 4180: /lib/cpp: No such file or directory
configure: failed program was:
#line 4176 "configure"
#include "confdefs.h"
#include <sys/resource.h>
configure:4173: checking for sys/time.h
configure:4181: /lib/cpp -D_FORTIFY_SOURCE=2 conftest.c >/dev/null 2>conftest.out
./configure: line 4180: /lib/cpp: No such file or directory
configure: failed program was:
#line 4176 "configure"
#include "confdefs.h"
#include <sys/time.h>
configure:4210: checking for sys/timeb.h
configure:4218: /lib/cpp -D_FORTIFY_SOURCE=2 conftest.c >/dev/null 2>conftest.out
./configure: line 4217: /lib/cpp: No such file or directory
configure: failed program was:
#line 4213 "configure"
#include "confdefs.h"
#include <sys/timeb.h>
configure:4210: checking for sys/types.h
configure:4218: /lib/cpp -D_FORTIFY_SOURCE=2 conftest.c >/dev/null 2>conftest.out
./configure: line 4217: /lib/cpp: No such file or directory
configure: failed program was:
#line 4213 "configure"
#include "confdefs.h"
#include <sys/types.h>
configure:4210: checking for sys/utsname.h
configure:4218: /lib/cpp -D_FORTIFY_SOURCE=2 conftest.c >/dev/null 2>conftest.out
./configure: line 4217: /lib/cpp: No such file or directory
configure: failed program was:
#line 4213 "configure"
#include "confdefs.h"
#include <sys/utsname.h>
configure:4247: checking for libintl.h
configure:4255: /lib/cpp -D_FORTIFY_SOURCE=2 conftest.c >/dev/null 2>conftest.out
./configure: line 4254: /lib/cpp: No such file or directory
configure: failed program was:
#line 4250 "configure"
#include "confdefs.h"
#include <libintl.h>
configure:4247: checking for iconv.h
configure:4255: /lib/cpp -D_FORTIFY_SOURCE=2 conftest.c >/dev/null 2>conftest.out
./configure: line 4254: /lib/cpp: No such file or directory
configure: failed program was:
#line 4250 "configure"
#include "confdefs.h"
#include <iconv.h>
configure:4284: checking for langinfo.h
configure:4292: /lib/cpp -D_FORTIFY_SOURCE=2 conftest.c >/dev/null 2>conftest.out
./configure: line 4291: /lib/cpp: No such file or directory
configure: failed program was:
#line 4287 "configure"
#include "confdefs.h"
#include <langinfo.h>
configure:4318: checking whether time.h and sys/time.h may both be included
configure:4330: gcc -c -march=x86-64 -mtune=generic -O2 -pipe -fstack-protector --param=ssp-buffer-size=4 -D_FORTIFY_SOURCE=2 conftest.c 1>&5
configure:4350: checking for off_t
./configure: line 4360: /lib/cpp: No such file or directory
configure:4380: checking for uid_t in sys/types.h
./configure: line 4386: /lib/cpp: No such file or directory
configure:4411: checking return type of signal handlers
configure:4431: gcc -c -march=x86-64 -mtune=generic -O2 -pipe -fstack-protector --param=ssp-buffer-size=4 -D_FORTIFY_SOURCE=2 conftest.c 1>&5
In file included from configure:4414:0:
confdefs.h:6:15: error: two or more data types in declaration specifiers
#define gid_t int
^
confdefs.h:5:15: error: two or more data types in declaration specifiers
#define uid_t int
^
confdefs.h:4:15: error: two or more data types in declaration specifiers
#define off_t long
^
configure: failed program was:
#line 4414 "configure"
#include "confdefs.h"
#include <sys/types.h>
#include <signal.h>
#ifdef signal
#undef signal
#endif
#ifdef __cplusplus
extern "C" void (*signal (int, void (*)(int)))(int);
#else
void (*signal ()) ();
#endif
int main() {
int i;
; return 0; }
configure:4449: checking for Cygwin environment
configure:4463: gcc -c -march=x86-64 -mtune=generic -O2 -pipe -fstack-protector --param=ssp-buffer-size=4 -D_FORTIFY_SOURCE=2 conftest.c 1>&5
configure: In function 'main':
configure:4457:20: error: '__CYGWIN32__' undeclared (first use in this function)
#define __CYGWIN__ __CYGWIN32__
^
configure:4459:8: note: in expansion of macro '__CYGWIN__'
return __CYGWIN__;
^
configure:4457:20: note: each undeclared identifier is reported only once for each function it appears in
#define __CYGWIN__ __CYGWIN32__
^
configure:4459:8: note: in expansion of macro '__CYGWIN__'
return __CYGWIN__;
^
configure: failed program was:
#line 4452 "configure"
#include "confdefs.h"
int main() {
#ifndef __CYGWIN__
#define __CYGWIN__ __CYGWIN32__
#endif
return __CYGWIN__;
; return 0; }
configure:4481: checking for ftime
configure:4507: gcc -o conftest -march=x86-64 -mtune=generic -O2 -pipe -fstack-protector --param=ssp-buffer-size=4 -D_FORTIFY_SOURCE=2 -Wl,-O1,--sort-common,--as-needed,-z,relro -Wl,--export-dynamic conftest.c 1>&5
configure:4481: checking for gethostname
configure:4507: gcc -o conftest -march=x86-64 -mtune=generic -O2 -pipe -fstack-protector --param=ssp-buffer-size=4 -D_FORTIFY_SOURCE=2 -Wl,-O1,--sort-common,--as-needed,-z,relro -Wl,--export-dynamic conftest.c 1>&5
configure:4481: checking for gettimeofday
configure:4507: gcc -o conftest -march=x86-64 -mtune=generic -O2 -pipe -fstack-protector --param=ssp-buffer-size=4 -D_FORTIFY_SOURCE=2 -Wl,-O1,--sort-common,--as-needed,-z,relro -Wl,--export-dynamic conftest.c 1>&5
configure:4481: checking for lseek
configure:4507: gcc -o conftest -march=x86-64 -mtune=generic -O2 -pipe -fstack-protector --param=ssp-buffer-size=4 -D_FORTIFY_SOURCE=2 -Wl,-O1,--sort-common,--as-needed,-z,relro -Wl,--export-dynamic conftest.c 1>&5
configure:4481: checking for nice
configure:4507: gcc -o conftest -march=x86-64 -mtune=generic -O2 -pipe -fstack-protector --param=ssp-buffer-size=4 -D_FORTIFY_SOURCE=2 -Wl,-O1,--sort-common,--as-needed,-z,relro -Wl,--export-dynamic conftest.c 1>&5
configure:4481: checking for time
configure:4507: gcc -o conftest -march=x86-64 -mtune=generic -O2 -pipe -fstack-protector --param=ssp-buffer-size=4 -D_FORTIFY_SOURCE=2 -Wl,-O1,--sort-common,--as-needed,-z,relro -Wl,--export-dynamic conftest.c 1>&5
configure:4481: checking for uname
configure:4507: gcc -o conftest -march=x86-64 -mtune=generic -O2 -pipe -fstack-protector --param=ssp-buffer-size=4 -D_FORTIFY_SOURCE=2 -Wl,-O1,--sort-common,--as-needed,-z,relro -Wl,--export-dynamic conftest.c 1>&5
configure:4533: checking for seteuid
configure:4559: gcc -o conftest -march=x86-64 -mtune=generic -O2 -pipe -fstack-protector --param=ssp-buffer-size=4 -D_FORTIFY_SOURCE=2 -Wl,-O1,--sort-common,--as-needed,-z,relro -Wl,--export-dynamic conftest.c 1>&5
configure:4533: checking for setpriority
configure:4559: gcc -o conftest -march=x86-64 -mtune=generic -O2 -pipe -fstack-protector --param=ssp-buffer-size=4 -D_FORTIFY_SOURCE=2 -Wl,-O1,--sort-common,--as-needed,-z,relro -Wl,--export-dynamic conftest.c 1>&5
configure:4533: checking for setreuid
configure:4559: gcc -o conftest -march=x86-64 -mtune=generic -O2 -pipe -fstack-protector --param=ssp-buffer-size=4 -D_FORTIFY_SOURCE=2 -Wl,-O1,--sort-common,--as-needed,-z,relro -Wl,--export-dynamic conftest.c 1>&5
configure:4533: checking for setruid
configure:4559: gcc -o conftest -march=x86-64 -mtune=generic -O2 -pipe -fstack-protector --param=ssp-buffer-size=4 -D_FORTIFY_SOURCE=2 -Wl,-O1,--sort-common,--as-needed,-z,relro -Wl,--export-dynamic conftest.c 1>&5
/tmp/cc1ViA1t.o: In function `main':
conftest.c:(.text.startup+0x7): undefined reference to `setruid'
collect2: error: ld returned 1 exit status
configure: failed program was:
#line 4536 "configure"
#include "confdefs.h"
/* System header to define __stub macros and hopefully few prototypes,
which can conflict with char setruid(); below. */
#include <assert.h>
/* Override any gcc2 internal prototype to avoid an error. */
/* We use char because int might match the return type of a gcc2
builtin and then its argument prototype would still apply. */
char setruid();
int main() {
/* The GNU C library defines this for functions which it implements
to always fail with ENOSYS. Some functions are actually named
something starting with __ and the normal name is an alias. */
#if defined (__stub_setruid) || defined (__stub___setruid)
choke me
#else
setruid();
#endif
; return 0; }
configure:4585: checking for drand48
configure:4611: gcc -o conftest -march=x86-64 -mtune=generic -O2 -pipe -fstack-protector --param=ssp-buffer-size=4 -D_FORTIFY_SOURCE=2 -Wl,-O1,--sort-common,--as-needed,-z,relro -Wl,--export-dynamic conftest.c 1>&5
configure:4637: checking for putenv
configure:4663: gcc -o conftest -march=x86-64 -mtune=generic -O2 -pipe -fstack-protector --param=ssp-buffer-size=4 -D_FORTIFY_SOURCE=2 -Wl,-O1,--sort-common,--as-needed,-z,relro -Wl,--export-dynamic conftest.c 1>&5
configure:4637: checking for setenv
configure:4663: gcc -o conftest -march=x86-64 -mtune=generic -O2 -pipe -fstack-protector --param=ssp-buffer-size=4 -D_FORTIFY_SOURCE=2 -Wl,-O1,--sort-common,--as-needed,-z,relro -Wl,--export-dynamic conftest.c 1>&5
configure:4689: checking for nanosleep
configure:4715: gcc -o conftest -march=x86-64 -mtune=generic -O2 -pipe -fstack-protector --param=ssp-buffer-size=4 -D_FORTIFY_SOURCE=2 -Wl,-O1,--sort-common,--as-needed,-z,relro -Wl,--export-dynamic conftest.c 1>&5
configure:4740: checking whether setpgrp takes no argument
configure:4766: gcc -o conftest -march=x86-64 -mtune=generic -O2 -pipe -fstack-protector --param=ssp-buffer-size=4 -D_FORTIFY_SOURCE=2 -Wl,-O1,--sort-common,--as-needed,-z,relro -Wl,--export-dynamic conftest.c 1>&5
configure: In function 'main':
configure:4759:2: warning: incompatible implicit declaration of built-in function 'exit' [enabled by default]
exit(0);
^
configure: failed program was:
#line 4746 "configure"
#include "confdefs.h"
#ifdef HAVE_UNISTD_H
#include <unistd.h>
#endif
/*
* If this system has a BSD-style setpgrp, which takes arguments, exit
* successfully.
*/
main()
{
if (setpgrp(1,1) == -1)
exit(0);
else
exit(1);
}
configure:4794: checking for long long int
configure:4803: gcc -c -march=x86-64 -mtune=generic -O2 -pipe -fstack-protector --param=ssp-buffer-size=4 -D_FORTIFY_SOURCE=2 conftest.c 1>&5
configure:4823: checking for W11
configure:4851: checking for X
configure:4916: /lib/cpp -D_FORTIFY_SOURCE=2 conftest.c >/dev/null 2>conftest.out
./configure: line 4915: /lib/cpp: No such file or directory
configure: failed program was:
#line 4911 "configure"
#include "confdefs.h"
#include <X11/Intrinsic.h>
configure:4992: gcc -o conftest -march=x86-64 -mtune=generic -O2 -pipe -fstack-protector --param=ssp-buffer-size=4 -D_FORTIFY_SOURCE=2 -Wl,-O1,--sort-common,--as-needed,-z,relro -Wl,--export-dynamic conftest.c -lXt 1>&5
configure:5162: checking for dnet_ntoa in -ldnet
configure:5179: gcc -o conftest -march=x86-64 -mtune=generic -O2 -pipe -fstack-protector --param=ssp-buffer-size=4 -D_FORTIFY_SOURCE=2 -Wl,-O1,--sort-common,--as-needed,-z,relro -Wl,--export-dynamic conftest.c -ldnet 1>&5
/usr/bin/ld: cannot find -ldnet
collect2: error: ld returned 1 exit status
configure: failed program was:
#line 5168 "configure"
#include "confdefs.h"
/* Override any gcc2 internal prototype to avoid an error. */
/* We use char because int might match the return type of a gcc2
builtin and then its argument prototype would still apply. */
char dnet_ntoa();
int main() {
dnet_ntoa()
; return 0; }
configure:5200: checking for dnet_ntoa in -ldnet_stub
configure:5217: gcc -o conftest -march=x86-64 -mtune=generic -O2 -pipe -fstack-protector --param=ssp-buffer-size=4 -D_FORTIFY_SOURCE=2 -Wl,-O1,--sort-common,--as-needed,-z,relro -Wl,--export-dynamic conftest.c -ldnet_stub 1>&5
/usr/bin/ld: cannot find -ldnet_stub
collect2: error: ld returned 1 exit status
configure: failed program was:
#line 5206 "configure"
#include "confdefs.h"
/* Override any gcc2 internal prototype to avoid an error. */
/* We use char because int might match the return type of a gcc2
builtin and then its argument prototype would still apply. */
char dnet_ntoa();
int main() {
dnet_ntoa()
; return 0; }
configure:5245: checking for gethostbyname
configure:5271: gcc -o conftest -march=x86-64 -mtune=generic -O2 -pipe -fstack-protector --param=ssp-buffer-size=4 -D_FORTIFY_SOURCE=2 -Wl,-O1,--sort-common,--as-needed,-z,relro -Wl,--export-dynamic conftest.c 1>&5
configure:5337: checking for connect
configure:5363: gcc -o conftest -march=x86-64 -mtune=generic -O2 -pipe -fstack-protector --param=ssp-buffer-size=4 -D_FORTIFY_SOURCE=2 -Wl,-O1,--sort-common,--as-needed,-z,relro -Wl,--export-dynamic conftest.c 1>&5
configure:5423: checking for remove
configure:5449: gcc -o conftest -march=x86-64 -mtune=generic -O2 -pipe -fstack-protector --param=ssp-buffer-size=4 -D_FORTIFY_SOURCE=2 -Wl,-O1,--sort-common,--as-needed,-z,relro -Wl,--export-dynamic conftest.c 1>&5
configure:5509: checking for shmat
configure:5535: gcc -o conftest -march=x86-64 -mtune=generic -O2 -pipe -fstack-protector --param=ssp-buffer-size=4 -D_FORTIFY_SOURCE=2 -Wl,-O1,--sort-common,--as-needed,-z,relro -Wl,--export-dynamic conftest.c 1>&5
configure:5604: checking for IceConnectionNumber in -lICE
configure:5621: gcc -o conftest -march=x86-64 -mtune=generic -O2 -pipe -fstack-protector --param=ssp-buffer-size=4 -D_FORTIFY_SOURCE=2 -Wl,-O1,--sort-common,--as-needed,-z,relro -Wl,--export-dynamic conftest.c -lICE 1>&5
configure:5659: checking whether to use Curses
configure:5678: checking for curses.h
configure:5686: /lib/cpp -D_FORTIFY_SOURCE=2 conftest.c >/dev/null 2>conftest.out
./configure: line 5685: /lib/cpp: No such file or directory
configure: failed program was:
#line 5681 "configure"
#include "confdefs.h"
#include <curses.h>
This file contains any messages produced by compilers while
running configure, to aid debugging if configure makes a mistake.
configure:759: checking host system type
configure:782: checking for gcc
configure:886: checking whether the C compiler (gcc -march=x86-64 -mtune=generic -O2 -pipe -fstack-protector --param=ssp-buffer-size=4 -Wl,-O1,--sort-common,--as-needed,-z,relro) works
configure:902: gcc -o conftest -march=x86-64 -mtune=generic -O2 -pipe -fstack-protector --param=ssp-buffer-size=4 -D_FORTIFY_SOURCE=2 -Wl,-O1,--sort-common,--as-needed,-z,relro conftest.c 1>&5
configure:928: checking whether the C compiler (gcc -march=x86-64 -mtune=generic -O2 -pipe -fstack-protector --param=ssp-buffer-size=4 -Wl,-O1,--sort-common,--as-needed,-z,relro) is a cross-compiler
configure:933: checking whether we are using GNU C
configure:940: gcc -E conftest.c
configure:958: checking whether gcc accepts -g
configure:987: checking for Cygwin environment
configure:1001: gcc -c -march=x86-64 -mtune=generic -O2 -pipe -fstack-protector --param=ssp-buffer-size=4 -D_FORTIFY_SOURCE=2 conftest.c 1>&5
configure: In function 'main':
configure:995:20: error: '__CYGWIN32__' undeclared (first use in this function)
#define __CYGWIN__ __CYGWIN32__
^
configure:997:8: note: in expansion of macro '__CYGWIN__'
return __CYGWIN__;
^
configure:995:20: note: each undeclared identifier is reported only once for each function it appears in
#define __CYGWIN__ __CYGWIN32__
^
configure:997:8: note: in expansion of macro '__CYGWIN__'
return __CYGWIN__;
^
configure: failed program was:
#line 990 "configure"
#include "confdefs.h"
int main() {
#ifndef __CYGWIN__
#define __CYGWIN__ __CYGWIN32__
#endif
return __CYGWIN__;
; return 0; }
configure:1017: checking for mingw32 environment
configure:1027: gcc -c -march=x86-64 -mtune=generic -O2 -pipe -fstack-protector --param=ssp-buffer-size=4 -D_FORTIFY_SOURCE=2 conftest.c 1>&5
configure: In function 'main':
configure:1023:8: error: '__MINGW32__' undeclared (first use in this function)
return __MINGW32__;
^
configure:1023:8: note: each undeclared identifier is reported only once for each function it appears in
configure: failed program was:
#line 1020 "configure"
#include "confdefs.h"
int main() {
return __MINGW32__;
; return 0; }
configure:1045: checking for executable suffix
configure:1064: checking for full floating-point support
configure:1110: gcc -o conftest -march=x86-64 -mtune=generic -O2 -pipe -fstack-protector --param=ssp-buffer-size=4 -D_FORTIFY_SOURCE=2 -Wl,-O1,--sort-common,--as-needed,-z,relro conftest.c 1>&5
configure:1181: checking for pwd
configure:1219: checking for source directory
configure:1230: checking for build directory
configure:1298: checking for svnversion
configure:1357: checking for MacOSX App
configure:1369: checking for MacOSX architectures
configure:1398: checking for MacOSX SDK
configure:1452: checking how to build libraries
configure:1495: checking for ranlib
configure:1520: checking how to run the C preprocessor
configure:1539: gcc -E -D_FORTIFY_SOURCE=2 conftest.c >/dev/null 2>conftest.out
In file included from /usr/include/assert.h:36:0,
from configure:1534:
/usr/include/features.h:330:4: warning: #warning _FORTIFY_SOURCE requires compiling with optimization (-O) [-Wcpp]
# warning _FORTIFY_SOURCE requires compiling with optimization (-O)
^
configure: failed program was:
#line 1533 "configure"
#include "confdefs.h"
#include <assert.h>
Syntax Error
configure:1556: gcc -E -traditional-cpp -D_FORTIFY_SOURCE=2 conftest.c >/dev/null 2>conftest.out
In file included from /usr/include/assert.h:37:0,
from configure:1552:
/usr/include/features.h:330:4: warning: #warning _FORTIFY_SOURCE requires compiling with optimization (-O) [-Wcpp]
# warning _FORTIFY_SOURCE requires compiling with optimization (-O)
^
In file included from /usr/include/features.h:376:0,
from /usr/include/assert.h:37,
from configure:1552:
/usr/include/sys/cdefs.h:31:3: error: #error "You need a ISO C conforming compiler to use the glibc headers"
# error "You need a ISO C conforming compiler to use the glibc headers"
^
configure: failed program was:
#line 1550 "configure"
#include "confdefs.h"
#include <assert.h>
Syntax Error
configure:1573: gcc -nologo -E -D_FORTIFY_SOURCE=2 conftest.c >/dev/null 2>conftest.out
gcc: error: unrecognized command line option '-nologo'
configure: failed program was:
#line 1567 "configure"
#include "confdefs.h"
#include <assert.h>
Syntax Error
configure:1601: checking if 64bit support is requested
configure:1621: checking if 64bit Sparc VIS support is requested
configure:1645: checking system version (for dynamic loading)
configure:1671: checking for dlopen in -ldl
configure:1688: gcc -o conftest -march=x86-64 -mtune=generic -O2 -pipe -fstack-protector --param=ssp-buffer-size=4 -D_FORTIFY_SOURCE=2 -Wl,-O1,--sort-common,--as-needed,-z,relro conftest.c -ldl 1>&5
configure:1735: checking for ar
configure:3619: checking for additional include dirs
configure:3642: checking for additional library dirs
configure:3676: checking for a BSD compatible install
configure:3729: checking for flex
configure:3760: checking for yywrap in -lfl
configure:3777: gcc -o conftest -march=x86-64 -mtune=generic -O2 -pipe -fstack-protector --param=ssp-buffer-size=4 -D_FORTIFY_SOURCE=2 -Wl,-O1,--sort-common,--as-needed,-z,relro -Wl,--export-dynamic conftest.c -lfl 1>&5
configure:3842: checking for bison
configure:3911: checking for ranlib
configure:3940: checking for ar
configure:3971: checking for env
configure:4000: checking for perl
configure:4031: checking for ANSI C header files
configure:4042: /lib/cpp -D_FORTIFY_SOURCE=2 conftest.c >/dev/null 2>conftest.out
./configure: line 4041: /lib/cpp: No such file or directory
configure: failed program was:
#line 4034 "configure"
#include "confdefs.h"
#include <stdlib.h>
#include <stdarg.h>
#include <string.h>
#include <float.h>
configure:4136: checking for limits.h
configure:4144: /lib/cpp -D_FORTIFY_SOURCE=2 conftest.c >/dev/null 2>conftest.out
./configure: line 4143: /lib/cpp: No such file or directory
configure: failed program was:
#line 4139 "configure"
#include "confdefs.h"
#include <limits.h>
configure:4136: checking for termio.h
configure:4144: /lib/cpp -D_FORTIFY_SOURCE=2 conftest.c >/dev/null 2>conftest.out
./configure: line 4143: /lib/cpp: No such file or directory
configure: failed program was:
#line 4139 "configure"
#include "confdefs.h"
#include <termio.h>
configure:4136: checking for termios.h
configure:4144: /lib/cpp -D_FORTIFY_SOURCE=2 conftest.c >/dev/null 2>conftest.out
./configure: line 4143: /lib/cpp: No such file or directory
configure: failed program was:
#line 4139 "configure"
#include "confdefs.h"
#include <termios.h>
configure:4136: checking for unistd.h
configure:4144: /lib/cpp -D_FORTIFY_SOURCE=2 conftest.c >/dev/null 2>conftest.out
./configure: line 4143: /lib/cpp: No such file or directory
configure: failed program was:
#line 4139 "configure"
#include "confdefs.h"
#include <unistd.h>
configure:4136: checking for values.h
configure:4144: /lib/cpp -D_FORTIFY_SOURCE=2 conftest.c >/dev/null 2>conftest.out
./configure: line 4143: /lib/cpp: No such file or directory
configure: failed program was:
#line 4139 "configure"
#include "confdefs.h"
#include <values.h>
configure:4136: checking for f2c.h
configure:4144: /lib/cpp -D_FORTIFY_SOURCE=2 conftest.c >/dev/null 2>conftest.out
./configure: line 4143: /lib/cpp: No such file or directory
configure: failed program was:
#line 4139 "configure"
#include "confdefs.h"
#include <f2c.h>
configure:4136: checking for g2c.h
configure:4144: /lib/cpp -D_FORTIFY_SOURCE=2 conftest.c >/dev/null 2>conftest.out
./configure: line 4143: /lib/cpp: No such file or directory
configure: failed program was:
#line 4139 "configure"
#include "confdefs.h"
#include <g2c.h>
configure:4173: checking for sys/ioctl.h
configure:4181: /lib/cpp -D_FORTIFY_SOURCE=2 conftest.c >/dev/null 2>conftest.out
./configure: line 4180: /lib/cpp: No such file or directory
configure: failed program was:
#line 4176 "configure"
#include "confdefs.h"
#include <sys/ioctl.h>
configure:4173: checking for sys/mtio.h
configure:4181: /lib/cpp -D_FORTIFY_SOURCE=2 conftest.c >/dev/null 2>conftest.out
./configure: line 4180: /lib/cpp: No such file or directory
configure: failed program was:
#line 4176 "configure"
#include "confdefs.h"
#include <sys/mtio.h>
configure:4173: checking for sys/resource.h
configure:4181: /lib/cpp -D_FORTIFY_SOURCE=2 conftest.c >/dev/null 2>conftest.out
./configure: line 4180: /lib/cpp: No such file or directory
configure: failed program was:
#line 4176 "configure"
#include "confdefs.h"
#include <sys/resource.h>
configure:4173: checking for sys/time.h
configure:4181: /lib/cpp -D_FORTIFY_SOURCE=2 conftest.c >/dev/null 2>conftest.out
./configure: line 4180: /lib/cpp: No such file or directory
configure: failed program was:
#line 4176 "configure"
#include "confdefs.h"
#include <sys/time.h>
configure:4210: checking for sys/timeb.h
configure:4218: /lib/cpp -D_FORTIFY_SOURCE=2 conftest.c >/dev/null 2>conftest.out
./configure: line 4217: /lib/cpp: No such file or directory
configure: failed program was:
#line 4213 "configure"
#include "confdefs.h"
#include <sys/timeb.h>
configure:4210: checking for sys/types.h
configure:4218: /lib/cpp -D_FORTIFY_SOURCE=2 conftest.c >/dev/null 2>conftest.out
./configure: line 4217: /lib/cpp: No such file or directory
configure: failed program was:
#line 4213 "configure"
#include "confdefs.h"
#include <sys/types.h>
configure:4210: checking for sys/utsname.h
configure:4218: /lib/cpp -D_FORTIFY_SOURCE=2 conftest.c >/dev/null 2>conftest.out
./configure: line 4217: /lib/cpp: No such file or directory
configure: failed program was:
#line 4213 "configure"
#include "confdefs.h"
#include <sys/utsname.h>
configure:4247: checking for libintl.h
configure:4255: /lib/cpp -D_FORTIFY_SOURCE=2 conftest.c >/dev/null 2>conftest.out
./configure: line 4254: /lib/cpp: No such file or directory
configure: failed program was:
#line 4250 "configure"
#include "confdefs.h"
#include <libintl.h>
configure:4247: checking for iconv.h
configure:4255: /lib/cpp -D_FORTIFY_SOURCE=2 conftest.c >/dev/null 2>conftest.out
./configure: line 4254: /lib/cpp: No such file or directory
configure: failed program was:
#line 4250 "configure"
#include "confdefs.h"
#include <iconv.h>
configure:4284: checking for langinfo.h
configure:4292: /lib/cpp -D_FORTIFY_SOURCE=2 conftest.c >/dev/null 2>conftest.out
./configure: line 4291: /lib/cpp: No such file or directory
configure: failed program was:
#line 4287 "configure"
#include "confdefs.h"
#include <langinfo.h>
configure:4318: checking whether time.h and sys/time.h may both be included
configure:4330: gcc -c -march=x86-64 -mtune=generic -O2 -pipe -fstack-protector --param=ssp-buffer-size=4 -D_FORTIFY_SOURCE=2 conftest.c 1>&5
configure:4350: checking for off_t
./configure: line 4360: /lib/cpp: No such file or directory
configure:4380: checking for uid_t in sys/types.h
./configure: line 4386: /lib/cpp: No such file or directory
configure:4411: checking return type of signal handlers
configure:4431: gcc -c -march=x86-64 -mtune=generic -O2 -pipe -fstack-protector --param=ssp-buffer-size=4 -D_FORTIFY_SOURCE=2 conftest.c 1>&5
In file included from configure:4414:0:
confdefs.h:6:15: error: two or more data types in declaration specifiers
#define gid_t int
^
confdefs.h:5:15: error: two or more data types in declaration specifiers
#define uid_t int
^
confdefs.h:4:15: error: two or more data types in declaration specifiers
#define off_t long
^
configure: failed program was:
#line 4414 "configure"
#include "confdefs.h"
#include <sys/types.h>
#include <signal.h>
#ifdef signal
#undef signal
#endif
#ifdef __cplusplus
extern "C" void (*signal (int, void (*)(int)))(int);
#else
void (*signal ()) ();
#endif
int main() {
int i;
; return 0; }
configure:4449: checking for Cygwin environment
configure:4463: gcc -c -march=x86-64 -mtune=generic -O2 -pipe -fstack-protector --param=ssp-buffer-size=4 -D_FORTIFY_SOURCE=2 conftest.c 1>&5
configure: In function 'main':
configure:4457:20: error: '__CYGWIN32__' undeclared (first use in this function)
#define __CYGWIN__ __CYGWIN32__
^
configure:4459:8: note: in expansion of macro '__CYGWIN__'
return __CYGWIN__;
^
configure:4457:20: note: each undeclared identifier is reported only once for each function it appears in
#define __CYGWIN__ __CYGWIN32__
^
configure:4459:8: note: in expansion of macro '__CYGWIN__'
return __CYGWIN__;
^
configure: failed program was:
#line 4452 "configure"
#include "confdefs.h"
int main() {
#ifndef __CYGWIN__
#define __CYGWIN__ __CYGWIN32__
#endif
return __CYGWIN__;
; return 0; }
configure:4481: checking for ftime
configure:4507: gcc -o conftest -march=x86-64 -mtune=generic -O2 -pipe -fstack-protector --param=ssp-buffer-size=4 -D_FORTIFY_SOURCE=2 -Wl,-O1,--sort-common,--as-needed,-z,relro -Wl,--export-dynamic conftest.c 1>&5
configure:4481: checking for gethostname
configure:4507: gcc -o conftest -march=x86-64 -mtune=generic -O2 -pipe -fstack-protector --param=ssp-buffer-size=4 -D_FORTIFY_SOURCE=2 -Wl,-O1,--sort-common,--as-needed,-z,relro -Wl,--export-dynamic conftest.c 1>&5
configure:4481: checking for gettimeofday
configure:4507: gcc -o conftest -march=x86-64 -mtune=generic -O2 -pipe -fstack-protector --param=ssp-buffer-size=4 -D_FORTIFY_SOURCE=2 -Wl,-O1,--sort-common,--as-needed,-z,relro -Wl,--export-dynamic conftest.c 1>&5
configure:4481: checking for lseek
configure:4507: gcc -o conftest -march=x86-64 -mtune=generic -O2 -pipe -fstack-protector --param=ssp-buffer-size=4 -D_FORTIFY_SOURCE=2 -Wl,-O1,--sort-common,--as-needed,-z,relro -Wl,--export-dynamic conftest.c 1>&5
configure:4481: checking for nice
configure:4507: gcc -o conftest -march=x86-64 -mtune=generic -O2 -pipe -fstack-protector --param=ssp-buffer-size=4 -D_FORTIFY_SOURCE=2 -Wl,-O1,--sort-common,--as-needed,-z,relro -Wl,--export-dynamic conftest.c 1>&5
configure:4481: checking for time
configure:4507: gcc -o conftest -march=x86-64 -mtune=generic -O2 -pipe -fstack-protector --param=ssp-buffer-size=4 -D_FORTIFY_SOURCE=2 -Wl,-O1,--sort-common,--as-needed,-z,relro -Wl,--export-dynamic conftest.c 1>&5
configure:4481: checking for uname
configure:4507: gcc -o conftest -march=x86-64 -mtune=generic -O2 -pipe -fstack-protector --param=ssp-buffer-size=4 -D_FORTIFY_SOURCE=2 -Wl,-O1,--sort-common,--as-needed,-z,relro -Wl,--export-dynamic conftest.c 1>&5
configure:4533: checking for seteuid
configure:4559: gcc -o conftest -march=x86-64 -mtune=generic -O2 -pipe -fstack-protector --param=ssp-buffer-size=4 -D_FORTIFY_SOURCE=2 -Wl,-O1,--sort-common,--as-needed,-z,relro -Wl,--export-dynamic conftest.c 1>&5
configure:4533: checking for setpriority
configure:4559: gcc -o conftest -march=x86-64 -mtune=generic -O2 -pipe -fstack-protector --param=ssp-buffer-size=4 -D_FORTIFY_SOURCE=2 -Wl,-O1,--sort-common,--as-needed,-z,relro -Wl,--export-dynamic conftest.c 1>&5
configure:4533: checking for setreuid
configure:4559: gcc -o conftest -march=x86-64 -mtune=generic -O2 -pipe -fstack-protector --param=ssp-buffer-size=4 -D_FORTIFY_SOURCE=2 -Wl,-O1,--sort-common,--as-needed,-z,relro -Wl,--export-dynamic conftest.c 1>&5
configure:4533: checking for setruid
configure:4559: gcc -o conftest -march=x86-64 -mtune=generic -O2 -pipe -fstack-protector --param=ssp-buffer-size=4 -D_FORTIFY_SOURCE=2 -Wl,-O1,--sort-common,--as-needed,-z,relro -Wl,--export-dynamic conftest.c 1>&5
/tmp/ccNPCOmp.o: In function `main':
conftest.c:(.text.startup+0x7): undefined reference to `setruid'
collect2: error: ld returned 1 exit status
configure: failed program was:
#line 4536 "configure"
#include "confdefs.h"
/* System header to define __stub macros and hopefully few prototypes,
which can conflict with char setruid(); below. */
#include <assert.h>
/* Override any gcc2 internal prototype to avoid an error. */
/* We use char because int might match the return type of a gcc2
builtin and then its argument prototype would still apply. */
char setruid();
int main() {
/* The GNU C library defines this for functions which it implements
to always fail with ENOSYS. Some functions are actually named
something starting with __ and the normal name is an alias. */
#if defined (__stub_setruid) || defined (__stub___setruid)
choke me
#else
setruid();
#endif
; return 0; }
configure:4585: checking for drand48
configure:4611: gcc -o conftest -march=x86-64 -mtune=generic -O2 -pipe -fstack-protector --param=ssp-buffer-size=4 -D_FORTIFY_SOURCE=2 -Wl,-O1,--sort-common,--as-needed,-z,relro -Wl,--export-dynamic conftest.c 1>&5
configure:4637: checking for putenv
configure:4663: gcc -o conftest -march=x86-64 -mtune=generic -O2 -pipe -fstack-protector --param=ssp-buffer-size=4 -D_FORTIFY_SOURCE=2 -Wl,-O1,--sort-common,--as-needed,-z,relro -Wl,--export-dynamic conftest.c 1>&5
configure:4637: checking for setenv
configure:4663: gcc -o conftest -march=x86-64 -mtune=generic -O2 -pipe -fstack-protector --param=ssp-buffer-size=4 -D_FORTIFY_SOURCE=2 -Wl,-O1,--sort-common,--as-needed,-z,relro -Wl,--export-dynamic conftest.c 1>&5
configure:4689: checking for nanosleep
configure:4715: gcc -o conftest -march=x86-64 -mtune=generic -O2 -pipe -fstack-protector --param=ssp-buffer-size=4 -D_FORTIFY_SOURCE=2 -Wl,-O1,--sort-common,--as-needed,-z,relro -Wl,--export-dynamic conftest.c 1>&5
configure:4740: checking whether setpgrp takes no argument
configure:4766: gcc -o conftest -march=x86-64 -mtune=generic -O2 -pipe -fstack-protector --param=ssp-buffer-size=4 -D_FORTIFY_SOURCE=2 -Wl,-O1,--sort-common,--as-needed,-z,relro -Wl,--export-dynamic conftest.c 1>&5
configure: In function 'main':
configure:4759:2: warning: incompatible implicit declaration of built-in function 'exit' [enabled by default]
exit(0);
^
configure: failed program was:
#line 4746 "configure"
#include "confdefs.h"
#ifdef HAVE_UNISTD_H
#include <unistd.h>
#endif
/*
* If this system has a BSD-style setpgrp, which takes arguments, exit
* successfully.
*/
main()
{
if (setpgrp(1,1) == -1)
exit(0);
else
exit(1);
}
configure:4794: checking for long long int
configure:4803: gcc -c -march=x86-64 -mtune=generic -O2 -pipe -fstack-protector --param=ssp-buffer-size=4 -D_FORTIFY_SOURCE=2 conftest.c 1>&5
configure:4823: checking for W11
configure:4851: checking for X
configure:4916: /lib/cpp -D_FORTIFY_SOURCE=2 conftest.c >/dev/null 2>conftest.out
./configure: line 4915: /lib/cpp: No such file or directory
configure: failed program was:
#line 4911 "configure"
#include "confdefs.h"
#include <X11/Intrinsic.h>
configure:4992: gcc -o conftest -march=x86-64 -mtune=generic -O2 -pipe -fstack-protector --param=ssp-buffer-size=4 -D_FORTIFY_SOURCE=2 -Wl,-O1,--sort-common,--as-needed,-z,relro -Wl,--export-dynamic conftest.c -lXt 1>&5
configure:5162: checking for dnet_ntoa in -ldnet
configure:5179: gcc -o conftest -march=x86-64 -mtune=generic -O2 -pipe -fstack-protector --param=ssp-buffer-size=4 -D_FORTIFY_SOURCE=2 -Wl,-O1,--sort-common,--as-needed,-z,relro -Wl,--export-dynamic conftest.c -ldnet 1>&5
/usr/bin/ld: cannot find -ldnet
collect2: error: ld returned 1 exit status
configure: failed program was:
#line 5168 "configure"
#include "confdefs.h"
/* Override any gcc2 internal prototype to avoid an error. */
/* We use char because int might match the return type of a gcc2
builtin and then its argument prototype would still apply. */
char dnet_ntoa();
int main() {
dnet_ntoa()
; return 0; }
configure:5200: checking for dnet_ntoa in -ldnet_stub
configure:5217: gcc -o conftest -march=x86-64 -mtune=generic -O2 -pipe -fstack-protector --param=ssp-buffer-size=4 -D_FORTIFY_SOURCE=2 -Wl,-O1,--sort-common,--as-needed,-z,relro -Wl,--export-dynamic conftest.c -ldnet_stub 1>&5
/usr/bin/ld: cannot find -ldnet_stub
collect2: error: ld returned 1 exit status
configure: failed program was:
#line 5206 "configure"
#include "confdefs.h"
/* Override any gcc2 internal prototype to avoid an error. */
/* We use char because int might match the return type of a gcc2
builtin and then its argument prototype would still apply. */
char dnet_ntoa();
int main() {
dnet_ntoa()
; return 0; }
configure:5245: checking for gethostbyname
configure:5271: gcc -o conftest -march=x86-64 -mtune=generic -O2 -pipe -fstack-protector --param=ssp-buffer-size=4 -D_FORTIFY_SOURCE=2 -Wl,-O1,--sort-common,--as-needed,-z,relro -Wl,--export-dynamic conftest.c 1>&5
configure:5337: checking for connect
configure:5363: gcc -o conftest -march=x86-64 -mtune=generic -O2 -pipe -fstack-protector --param=ssp-buffer-size=4 -D_FORTIFY_SOURCE=2 -Wl,-O1,--sort-common,--as-needed,-z,relro -Wl,--export-dynamic conftest.c 1>&5
configure:5423: checking for remove
configure:5449: gcc -o conftest -march=x86-64 -mtune=generic -O2 -pipe -fstack-protector --param=ssp-buffer-size=4 -D_FORTIFY_SOURCE=2 -Wl,-O1,--sort-common,--as-needed,-z,relro -Wl,--export-dynamic conftest.c 1>&5
configure:5509: checking for shmat
configure:5535: gcc -o conftest -march=x86-64 -mtune=generic -O2 -pipe -fstack-protector --param=ssp-buffer-size=4 -D_FORTIFY_SOURCE=2 -Wl,-O1,--sort-common,--as-needed,-z,relro -Wl,--export-dynamic conftest.c 1>&5
configure:5604: checking for IceConnectionNumber in -lICE
configure:5621: gcc -o conftest -march=x86-64 -mtune=generic -O2 -pipe -fstack-protector --param=ssp-buffer-size=4 -D_FORTIFY_SOURCE=2 -Wl,-O1,--sort-common,--as-needed,-z,relro -Wl,--export-dynamic conftest.c -lICE 1>&5
configure:5659: checking whether to use Curses
configure:5931: checking for gtty in -lcompat
configure:5948: gcc -o conftest -march=x86-64 -mtune=generic -O2 -pipe -fstack-protector --param=ssp-buffer-size=4 -D_FORTIFY_SOURCE=2 -Wl,-O1,--sort-common,--as-needed,-z,relro -Wl,--export-dynamic conftest.c -lcompat 1>&5
/usr/bin/ld: cannot find -lcompat
collect2: error: ld returned 1 exit status
configure: failed program was:
#line 5937 "configure"
#include "confdefs.h"
/* Override any gcc2 internal prototype to avoid an error. */
/* We use char because int might match the return type of a gcc2
builtin and then its argument prototype would still apply. */
char gtty();
int main() {
gtty()
; return 0; }
configure:5967: checking for gtty in -lbsd-compat
configure:5984: gcc -o conftest -march=x86-64 -mtune=generic -O2 -pipe -fstack-protector --param=ssp-buffer-size=4 -D_FORTIFY_SOURCE=2 -Wl,-O1,--sort-common,--as-needed,-z,relro -Wl,--export-dynamic conftest.c -lbsd-compat 1>&5
configure:6054: checking for library containing cuserid
configure:6070: gcc -o conftest -march=x86-64 -mtune=generic -O2 -pipe -fstack-protector --param=ssp-buffer-size=4 -D_FORTIFY_SOURCE=2 -Wl,-O1,--sort-common,--as-needed,-z,relro -Wl,--export-dynamic conftest.c 1>&5
configure:6118: checking for xdrmem_create
configure:6144: gcc -o conftest -march=x86-64 -mtune=generic -O2 -pipe -fstack-protector --param=ssp-buffer-size=4 -D_FORTIFY_SOURCE=2 -Wl,-O1,--sort-common,--as-needed,-z,relro -Wl,--export-dynamic conftest.c 1>&5
configure:6321: checking for asprintf
configure:6347: gcc -o conftest -march=x86-64 -mtune=generic -O2 -pipe -fstack-protector --param=ssp-buffer-size=4 -D_FORTIFY_SOURCE=2 -Wl,-O1,--sort-common,--as-needed,-z,relro -Wl,--export-dynamic conftest.c 1>&5
configure:6374: checking for atan
configure:6400: gcc -o conftest -march=x86-64 -mtune=generic -O2 -pipe -fstack-protector --param=ssp-buffer-size=4 -D_FORTIFY_SOURCE=2 -Wl,-O1,--sort-common,--as-needed,-z,relro -Wl,--export-dynamic conftest.c 1>&5
configure:6384:6: warning: conflicting types for built-in function 'atan' [enabled by default]
char atan();
^
/tmp/ccjfqm5i.o: In function `main':
conftest.c:(.text.startup+0x7): undefined reference to `atan'
collect2: error: ld returned 1 exit status
configure: failed program was:
#line 6377 "configure"
#include "confdefs.h"
/* System header to define __stub macros and hopefully few prototypes,
which can conflict with char atan(); below. */
#include <assert.h>
/* Override any gcc2 internal prototype to avoid an error. */
/* We use char because int might match the return type of a gcc2
builtin and then its argument prototype would still apply. */
char atan();
int main() {
/* The GNU C library defines this for functions which it implements
to always fail with ENOSYS. Some functions are actually named
something starting with __ and the normal name is an alias. */
#if defined (__stub_atan) || defined (__stub___atan)
choke me
#else
atan();
#endif
; return 0; }
configure:6418: checking for atan in -lm
configure:6435: gcc -o conftest -march=x86-64 -mtune=generic -O2 -pipe -fstack-protector --param=ssp-buffer-size=4 -D_FORTIFY_SOURCE=2 -Wl,-O1,--sort-common,--as-needed,-z,relro -Wl,--export-dynamic conftest.c -lm 1>&5
configure:6428:6: warning: conflicting types for built-in function 'atan' [enabled by default]
char atan();
^
configure:6462: checking for dlsym
configure:6488: gcc -o conftest -march=x86-64 -mtune=generic -O2 -pipe -fstack-protector --param=ssp-buffer-size=4 -D_FORTIFY_SOURCE=2 -Wl,-O1,--sort-common,--as-needed,-z,relro -Wl,--export-dynamic conftest.c 1>&5
/tmp/ccKLhDYm.o: In function `main':
conftest.c:(.text.startup+0x7): undefined reference to `dlsym'
collect2: error: ld returned 1 exit status
configure: failed program was:
#line 6465 "configure"
#include "confdefs.h"
/* System header to define __stub macros and hopefully few prototypes,
which can conflict with char dlsym(); below. */
#include <assert.h>
/* Override any gcc2 internal prototype to avoid an error. */
/* We use char because int might match the return type of a gcc2
builtin and then its argument prototype would still apply. */
char dlsym();
int main() {
/* The GNU C library defines this for functions which it implements
to always fail with ENOSYS. Some functions are actually named
something starting with __ and the normal name is an alias. */
#if defined (__stub_dlsym) || defined (__stub___dlsym)
choke me
#else
dlsym();
#endif
; return 0; }
configure:6506: checking for dlsym in -ldl
configure:6523: gcc -o conftest -march=x86-64 -mtune=generic -O2 -pipe -fstack-protector --param=ssp-buffer-size=4 -D_FORTIFY_SOURCE=2 -Wl,-O1,--sort-common,--as-needed,-z,relro -Wl,--export-dynamic conftest.c -ldl 1>&5
configure:6550: checking for iconv
configure:6576: gcc -o conftest -march=x86-64 -mtune=generic -O2 -pipe -fstack-protector --param=ssp-buffer-size=4 -D_FORTIFY_SOURCE=2 -Wl,-O1,--sort-common,--as-needed,-z,relro -Wl,--export-dynamic conftest.c 1>&5
configure:6800: checking for socket
configure:6826: gcc -o conftest -march=x86-64 -mtune=generic -O2 -pipe -fstack-protector --param=ssp-buffer-size=4 -D_FORTIFY_SOURCE=2 -Wl,-O1,--sort-common,--as-needed,-z,relro -Wl,--export-dynamic conftest.c 1>&5
configure:6909: checking for location of zlib includes
configure:6935: checking for zlib.h
configure:6943: /lib/cpp -D_FORTIFY_SOURCE=2 conftest.c >/dev/null 2>conftest.out
./configure: line 6942: /lib/cpp: No such file or directory
configure: failed program was:
#line 6938 "configure"
#include "confdefs.h"
#include <zlib.h>
patching file doc/python/example_ctypes.py
patching file general/g.parser/test.py
patching file gui/scripts/g.change.gui.py
patching file gui/scripts/g.extension.py
patching file gui/scripts/g.extension.rebuild.all.py
patching file gui/scripts/v.type_wrapper.py
patching file gui/wxpython/gui_modules/menuform.py
patching file gui/wxpython/scripts/d.rast3d.py
patching file gui/wxpython/scripts/p.cmd.py
patching file gui/wxpython/scripts/p.db.py
patching file gui/wxpython/scripts/p.mon.py
patching file gui/wxpython/scripts/p.rast.py
patching file gui/wxpython/scripts/p.vect.py
patching file imagery/i.atcorr/create_iwave.py
patching file include/Make/Platform.make.in
patching file lib/python/ctypes/ctypesgencore/ctypedescs.py
patching file lib/python/ctypes/ctypesgencore/descriptions.py
patching file lib/python/ctypes/ctypesgencore/expressions.py
patching file lib/python/ctypes/ctypesgencore/__init__.py
patching file lib/python/ctypes/ctypesgencore/messages.py
patching file lib/python/ctypes/ctypesgencore/options.py
patching file lib/python/ctypes/ctypesgencore/parser/cdeclarations.py
patching file lib/python/ctypes/ctypesgencore/parser/cgrammar.py
patching file lib/python/ctypes/ctypesgencore/parser/cparser.py
patching file lib/python/ctypes/ctypesgencore/parser/ctypesparser.py
patching file lib/python/ctypes/ctypesgencore/parser/datacollectingparser.py
patching file lib/python/ctypes/ctypesgencore/parser/__init__.py
patching file lib/python/ctypes/ctypesgencore/parser/pplexer.py
patching file lib/python/ctypes/ctypesgencore/parser/preprocessor.py
patching file lib/python/ctypes/ctypesgencore/printer/__init__.py
patching file lib/python/ctypes/ctypesgencore/printer/printer.py
patching file lib/python/ctypes/ctypesgencore/processor/dependencies.py
patching file lib/python/ctypes/ctypesgencore/processor/__init__.py
patching file lib/python/ctypes/ctypesgencore/processor/operations.py
patching file lib/python/ctypes/ctypesgencore/processor/pipeline.py
patching file lib/python/ctypes/ctypesgen.py
patching file visualization/nviz/src/draw.c
checking host system type... x86_64-unknown-linux-gnu
checking for gcc... gcc
checking whether the C compiler (gcc -march=x86-64 -mtune=generic -O2 -pipe -fstack-protector --param=ssp-buffer-size=4 -Wl,-O1,--sort-common,--as-needed,-z,relro) works... yes
checking whether the C compiler (gcc -march=x86-64 -mtune=generic -O2 -pipe -fstack-protector --param=ssp-buffer-size=4 -Wl,-O1,--sort-common,--as-needed,-z,relro) is a cross-compiler... no
checking whether we are using GNU C... yes
checking whether gcc accepts -g... yes
checking for Cygwin environment... no
checking for mingw32 environment... no
checking for executable suffix... no
checking for full floating-point support... yes
checking for pwd... /usr/bin/pwd
checking for source directory... /home/jusch/AUR/grass/src/grass-6.4.2
checking for build directory... /home/jusch/AUR/grass/src/grass-6.4.2
checking for svnversion... /usr/bin/svnversion
checking for MacOSX App... no
checking for MacOSX architectures... no
checking for MacOSX SDK... no
checking how to build libraries... shared
checking for ranlib... ranlib
checking how to run the C preprocessor... /lib/cpp
checking if 64bit support is requested... yes
checking if 64bit Sparc VIS support is requested... no
checking system version (for dynamic loading)... Linux-3.8.6-3-ck
checking for dlopen in -ldl... yes
checking for ar... ar
checking for additional include dirs...
checking for additional library dirs...
checking for a BSD compatible install... /usr/bin/install -c
checking for flex... flex
checking for yywrap in -lfl... yes
checking for bison... bison -y
checking for ranlib... ranlib
checking for ar... ar
checking for env... env
checking for perl... /usr/bin/perl
checking for ANSI C header files... no
checking for limits.h... no
checking for termio.h... no
checking for termios.h... no
checking for unistd.h... no
checking for values.h... no
checking for f2c.h... no
checking for g2c.h... no
checking for sys/ioctl.h... no
checking for sys/mtio.h... no
checking for sys/resource.h... no
checking for sys/time.h... no
checking for sys/timeb.h... no
checking for sys/types.h... no
checking for sys/utsname.h... no
checking for libintl.h... no
checking for iconv.h... no
checking for langinfo.h... no
checking whether time.h and sys/time.h may both be included... yes
checking for off_t... no
checking for uid_t in sys/types.h... no
checking return type of signal handlers... int
checking for Cygwin environment... no
checking for ftime... yes
checking for gethostname... yes
checking for gettimeofday... yes
checking for lseek... yes
checking for nice... yes
checking for time... yes
checking for uname... yes
checking for seteuid... yes
checking for setpriority... yes
checking for setreuid... yes
checking for setruid... no
checking for drand48... yes
checking for putenv... yes
checking for setenv... yes
checking for nanosleep... yes
checking whether setpgrp takes no argument... yes
checking for long long int... yes
checking for W11... no
checking for X... libraries , headers /usr/include
checking for dnet_ntoa in -ldnet... no
checking for dnet_ntoa in -ldnet_stub... no
checking for gethostbyname... yes
checking for connect... yes
checking for remove... yes
checking for shmat... yes
checking for IceConnectionNumber in -lICE... yes
checking whether to use Curses... yes
checking for curses.h... no
configure: error: *** Unable to locate curses includes.
patching file doc/python/example_ctypes.py
patching file general/g.parser/test.py
patching file gui/scripts/g.change.gui.py
patching file gui/scripts/g.extension.py
patching file gui/scripts/g.extension.rebuild.all.py
patching file gui/scripts/v.type_wrapper.py
patching file gui/wxpython/gui_modules/menuform.py
patching file gui/wxpython/scripts/d.rast3d.py
patching file gui/wxpython/scripts/p.cmd.py
patching file gui/wxpython/scripts/p.db.py
patching file gui/wxpython/scripts/p.mon.py
patching file gui/wxpython/scripts/p.rast.py
patching file gui/wxpython/scripts/p.vect.py
patching file imagery/i.atcorr/create_iwave.py
patching file include/Make/Platform.make.in
patching file lib/python/ctypes/ctypesgencore/ctypedescs.py
patching file lib/python/ctypes/ctypesgencore/descriptions.py
patching file lib/python/ctypes/ctypesgencore/expressions.py
patching file lib/python/ctypes/ctypesgencore/__init__.py
patching file lib/python/ctypes/ctypesgencore/messages.py
patching file lib/python/ctypes/ctypesgencore/options.py
patching file lib/python/ctypes/ctypesgencore/parser/cdeclarations.py
patching file lib/python/ctypes/ctypesgencore/parser/cgrammar.py
patching file lib/python/ctypes/ctypesgencore/parser/cparser.py
patching file lib/python/ctypes/ctypesgencore/parser/ctypesparser.py
patching file lib/python/ctypes/ctypesgencore/parser/datacollectingparser.py
patching file lib/python/ctypes/ctypesgencore/parser/__init__.py
patching file lib/python/ctypes/ctypesgencore/parser/pplexer.py
patching file lib/python/ctypes/ctypesgencore/parser/preprocessor.py
patching file lib/python/ctypes/ctypesgencore/printer/__init__.py
patching file lib/python/ctypes/ctypesgencore/printer/printer.py
patching file lib/python/ctypes/ctypesgencore/processor/dependencies.py
patching file lib/python/ctypes/ctypesgencore/processor/__init__.py
patching file lib/python/ctypes/ctypesgencore/processor/operations.py
patching file lib/python/ctypes/ctypesgencore/processor/pipeline.py
patching file lib/python/ctypes/ctypesgen.py
patching file visualization/nviz/src/draw.c
checking host system type... x86_64-unknown-linux-gnu
checking for gcc... gcc
checking whether the C compiler (gcc -march=x86-64 -mtune=generic -O2 -pipe -fstack-protector --param=ssp-buffer-size=4 -Wl,-O1,--sort-common,--as-needed,-z,relro) works... yes
checking whether the C compiler (gcc -march=x86-64 -mtune=generic -O2 -pipe -fstack-protector --param=ssp-buffer-size=4 -Wl,-O1,--sort-common,--as-needed,-z,relro) is a cross-compiler... no
checking whether we are using GNU C... yes
checking whether gcc accepts -g... yes
checking for Cygwin environment... no
checking for mingw32 environment... no
checking for executable suffix... no
checking for full floating-point support... yes
checking for pwd... /usr/bin/pwd
checking for source directory... /home/jusch/AUR/grass/src/grass-6.4.2
checking for build directory... /home/jusch/AUR/grass/src/grass-6.4.2
checking for svnversion... /usr/bin/svnversion
checking for MacOSX App... no
checking for MacOSX architectures... no
checking for MacOSX SDK... no
checking how to build libraries... shared
checking for ranlib... ranlib
checking how to run the C preprocessor... /lib/cpp
checking if 64bit support is requested... yes
checking if 64bit Sparc VIS support is requested... no
checking system version (for dynamic loading)... Linux-3.8.6-3-ck
checking for dlopen in -ldl... yes
checking for ar... ar
checking for additional include dirs...
checking for additional library dirs...
checking for a BSD compatible install... /usr/bin/install -c
checking for flex... flex
checking for yywrap in -lfl... yes
checking for bison... bison -y
checking for ranlib... ranlib
checking for ar... ar
checking for env... env
checking for perl... /usr/bin/perl
checking for ANSI C header files... no
checking for limits.h... no
checking for termio.h... no
checking for termios.h... no
checking for unistd.h... no
checking for values.h... no
checking for f2c.h... no
checking for g2c.h... no
checking for sys/ioctl.h... no
checking for sys/mtio.h... no
checking for sys/resource.h... no
checking for sys/time.h... no
checking for sys/timeb.h... no
checking for sys/types.h... no
checking for sys/utsname.h... no
checking for libintl.h... no
checking for iconv.h... no
checking for langinfo.h... no
checking whether time.h and sys/time.h may both be included... yes
checking for off_t... no
checking for uid_t in sys/types.h... no
checking return type of signal handlers... int
checking for Cygwin environment... no
checking for ftime... yes
checking for gethostname... yes
checking for gettimeofday... yes
checking for lseek... yes
checking for nice... yes
checking for time... yes
checking for uname... yes
checking for seteuid... yes
checking for setpriority... yes
checking for setreuid... yes
checking for setruid... no
checking for drand48... yes
checking for putenv... yes
checking for setenv... yes
checking for nanosleep... yes
checking whether setpgrp takes no argument... yes
checking for long long int... yes
checking for W11... no
checking for X... libraries , headers /usr/include
checking for dnet_ntoa in -ldnet... no
checking for dnet_ntoa in -ldnet_stub... no
checking for gethostbyname... yes
checking for connect... yes
checking for remove... yes
checking for shmat... yes
checking for IceConnectionNumber in -lICE... yes
checking whether to use Curses... no
checking for gtty in -lcompat... no
checking for gtty in -lbsd-compat... yes
checking for library containing cuserid... none required
checking for xdrmem_create... yes
checking for asprintf... yes
checking for atan... no
checking for atan in -lm... yes
checking for dlsym... no
checking for dlsym in -ldl... yes
checking for iconv... yes
checking for socket... yes
checking for location of zlib includes...
checking for zlib.h... no
configure: error: *** Unable to locate zlib includes
Sign up for free to join this conversation on GitHub. Already have an account? Sign in to comment
Something went wrong with that request. Please try again.