public
Created

Awestruct issue

  • Download Gist
gem_make.out
1 2 3 4 5 6 7 8 9 10 11 12
[bartek@chronos arquillian.github.com (develop)]$ cat /var/lib/gems/1.8/gems/RedCloth-4.2.5/ext/redcloth_scan/gem_make.out
/usr/bin/ruby1.8 extconf.rb
checking for main() in -lc... yes
creating Makefile
 
make
gcc -I. -I. -I/usr/lib/ruby/1.8/x86_64-linux -I. -fPIC -fno-strict-aliasing -g -g -O2 -fPIC -O0 -Wall -Werror -c redcloth_inline.c
ragel/redcloth_inline.c.rl: In function ‘red_block’:
ragel/redcloth_inline.c.rl:99:9: error: variable ‘attr_regs’ set but not used [-Werror=unused-but-set-variable]
cc1: all warnings being treated as errors
 
make: *** [redcloth_inline.o] Error 1
install awestruct
1 2 3 4 5 6 7 8 9 10 11 12 13 14 15 16 17 18 19 20 21 22 23 24 25
[bartek@chronos arquillian.github.com (develop)]$ sudo gem install awestruct
[sudo] password for bartek:
Invalid gemspec in [/var/lib/gems/1.8/specifications/json-1.5.4.gemspec]: invalid date format in specification: "2011-08-31 00:00:00.000000000Z"
Invalid gemspec in [/var/lib/gems/1.8/specifications/json-1.5.4.gemspec]: invalid date format in specification: "2011-08-31 00:00:00.000000000Z"
 
 
Building native extensions. This could take a while...
ERROR: Error installing awestruct:
ERROR: Failed to build gem native extension.
 
/usr/bin/ruby1.8 extconf.rb
checking for main() in -lc... yes
creating Makefile
 
make
gcc -I. -I. -I/usr/lib/ruby/1.8/x86_64-linux -I. -fPIC -fno-strict-aliasing -g -g -O2 -fPIC -O0 -Wall -Werror -c redcloth_inline.c
ragel/redcloth_inline.c.rl: In function ‘red_block’:
ragel/redcloth_inline.c.rl:99:9: error: variable ‘attr_regs’ set but not used [-Werror=unused-but-set-variable]
cc1: all warnings being treated as errors
 
make: *** [redcloth_inline.o] Error 1
 
 
Gem files will remain installed in /var/lib/gems/1.8/gems/RedCloth-4.2.5 for inspection.
Results logged to /var/lib/gems/1.8/gems/RedCloth-4.2.5/ext/redcloth_scan/gem_make.out
ruby --version
1 2
[bartek@chronos arquillian.github.com (develop)]$ ruby --version
ruby 1.8.7 (2011-06-30 patchlevel 352) [x86_64-linux]

Please sign in to comment on this gist.

Something went wrong with that request. Please try again.