Skip to content

Instantly share code, notes, and snippets.

Embed
What would you like to do?
[ 10%] Building C object src/external/libxpc/CMakeFiles/xpc_obj.dir/src/activity.m.o
In file included from /home/bquast/Downloads/darling-git/src/darling/src/external/libxpc/src/activity.m:22:
In file included from /home/bquast/Downloads/darling-git/src/darling/src/external/libxpc/internal-include/xpc/util.h:29:
In file included from /home/bquast/Downloads/darling-git/src/darling/Developer/Platforms/MacOSX.platform/Developer/SDKs/MacOSX.sdk/usr/include/os/log.h:11:
/home/bquast/Downloads/darling-git/src/darling/Developer/Platforms/MacOSX.platform/Developer/SDKs/MacOSX.sdk/usr/include/os/trace.h:55:16: warning: GCC does not allow 'format' attribute in this position on a function definition [-Wgcc-compat]
__attribute__((format(printf, 1, 2)))
^
1 warning generated.
In file included from /home/bquast/Downloads/darling-git/src/darling/src/external/libxpc/src/activity.m:22:
In file included from /home/bquast/Downloads/darling-git/src/darling/src/external/libxpc/internal-include/xpc/util.h:29:
In file included from /home/bquast/Downloads/darling-git/src/darling/Developer/Platforms/MacOSX.platform/Developer/SDKs/MacOSX.sdk/usr/include/os/log.h:11:
/home/bquast/Downloads/darling-git/src/darling/Developer/Platforms/MacOSX.platform/Developer/SDKs/MacOSX.sdk/usr/include/os/trace.h:55:16: warning: GCC does not allow 'format' attribute in this position on a function definition [-Wgcc-compat]
__attribute__((format(printf, 1, 2)))
^
1 warning generated.
[ 10%] Building C object src/external/libxpc/CMakeFiles/xpc_obj.dir/src/array.m.o
In file included from /home/bquast/Downloads/darling-git/src/darling/src/external/libxpc/src/array.m:21:
In file included from /home/bquast/Downloads/darling-git/src/darling/src/external/libxpc/internal-include/xpc/util.h:29:
In file included from /home/bquast/Downloads/darling-git/src/darling/Developer/Platforms/MacOSX.platform/Developer/SDKs/MacOSX.sdk/usr/include/os/log.h:11:
/home/bquast/Downloads/darling-git/src/darling/Developer/Platforms/MacOSX.platform/Developer/SDKs/MacOSX.sdk/usr/include/os/trace.h:55:16: warning: GCC does not allow 'format' attribute in this position on a function definition [-Wgcc-compat]
__attribute__((format(printf, 1, 2)))
^
1 warning generated.
In file included from /home/bquast/Downloads/darling-git/src/darling/src/external/libxpc/src/array.m:21:
In file included from /home/bquast/Downloads/darling-git/src/darling/src/external/libxpc/internal-include/xpc/util.h:29:
In file included from /home/bquast/Downloads/darling-git/src/darling/Developer/Platforms/MacOSX.platform/Developer/SDKs/MacOSX.sdk/usr/include/os/log.h:11:
/home/bquast/Downloads/darling-git/src/darling/Developer/Platforms/MacOSX.platform/Developer/SDKs/MacOSX.sdk/usr/include/os/trace.h:55:16: warning: GCC does not allow 'format' attribute in this position on a function definition [-Wgcc-compat]
__attribute__((format(printf, 1, 2)))
^
1 warning generated.
[ 10%] Building C object src/external/libxpc/CMakeFiles/xpc_obj.dir/src/base.m.o
[ 10%] Building C object src/external/libxpc/CMakeFiles/xpc_obj.dir/src/bool.m.o
In file included from /home/bquast/Downloads/darling-git/src/darling/src/external/libxpc/src/bool.m:21:
In file included from /home/bquast/Downloads/darling-git/src/darling/src/external/libxpc/internal-include/xpc/util.h:29:
In file included from /home/bquast/Downloads/darling-git/src/darling/Developer/Platforms/MacOSX.platform/Developer/SDKs/MacOSX.sdk/usr/include/os/log.h:11:
/home/bquast/Downloads/darling-git/src/darling/Developer/Platforms/MacOSX.platform/Developer/SDKs/MacOSX.sdk/usr/include/os/trace.h:55:16: warning: GCC does not allow 'format' attribute in this position on a function definition [-Wgcc-compat]
__attribute__((format(printf, 1, 2)))
^
1 warning generated.
In file included from /home/bquast/Downloads/darling-git/src/darling/src/external/libxpc/src/bool.m:21:
In file included from /home/bquast/Downloads/darling-git/src/darling/src/external/libxpc/internal-include/xpc/util.h:29:
In file included from /home/bquast/Downloads/darling-git/src/darling/Developer/Platforms/MacOSX.platform/Developer/SDKs/MacOSX.sdk/usr/include/os/log.h:11:
/home/bquast/Downloads/darling-git/src/darling/Developer/Platforms/MacOSX.platform/Developer/SDKs/MacOSX.sdk/usr/include/os/trace.h:55:16: warning: GCC does not allow 'format' attribute in this position on a function definition [-Wgcc-compat]
__attribute__((format(printf, 1, 2)))
^
1 warning generated.
[ 10%] Building C object src/external/libxpc/CMakeFiles/xpc_obj.dir/src/bundle.m.o
In file included from /home/bquast/Downloads/darling-git/src/darling/src/external/libxpc/src/bundle.m:24:
In file included from /home/bquast/Downloads/darling-git/src/darling/src/external/libxpc/internal-include/xpc/util.h:29:
In file included from /home/bquast/Downloads/darling-git/src/darling/Developer/Platforms/MacOSX.platform/Developer/SDKs/MacOSX.sdk/usr/include/os/log.h:11:
/home/bquast/Downloads/darling-git/src/darling/Developer/Platforms/MacOSX.platform/Developer/SDKs/MacOSX.sdk/usr/include/os/trace.h:55:16: warning: GCC does not allow 'format' attribute in this position on a function definition [-Wgcc-compat]
__attribute__((format(printf, 1, 2)))
^
1 warning generated.
In file included from /home/bquast/Downloads/darling-git/src/darling/src/external/libxpc/src/bundle.m:24:
In file included from /home/bquast/Downloads/darling-git/src/darling/src/external/libxpc/internal-include/xpc/util.h:29:
In file included from /home/bquast/Downloads/darling-git/src/darling/Developer/Platforms/MacOSX.platform/Developer/SDKs/MacOSX.sdk/usr/include/os/log.h:11:
/home/bquast/Downloads/darling-git/src/darling/Developer/Platforms/MacOSX.platform/Developer/SDKs/MacOSX.sdk/usr/include/os/trace.h:55:16: warning: GCC does not allow 'format' attribute in this position on a function definition [-Wgcc-compat]
__attribute__((format(printf, 1, 2)))
^
1 warning generated.
[ 10%] Building C object src/external/libxpc/CMakeFiles/xpc_obj.dir/src/coalition.m.o
In file included from /home/bquast/Downloads/darling-git/src/darling/src/external/libxpc/src/coalition.m:21:
In file included from /home/bquast/Downloads/darling-git/src/darling/src/external/libxpc/internal-include/xpc/util.h:29:
In file included from /home/bquast/Downloads/darling-git/src/darling/Developer/Platforms/MacOSX.platform/Developer/SDKs/MacOSX.sdk/usr/include/os/log.h:11:
/home/bquast/Downloads/darling-git/src/darling/Developer/Platforms/MacOSX.platform/Developer/SDKs/MacOSX.sdk/usr/include/os/trace.h:55:16: warning: GCC does not allow 'format' attribute in this position on a function definition [-Wgcc-compat]
__attribute__((format(printf, 1, 2)))
^
1 warning generated.
In file included from /home/bquast/Downloads/darling-git/src/darling/src/external/libxpc/src/coalition.m:21:
In file included from /home/bquast/Downloads/darling-git/src/darling/src/external/libxpc/internal-include/xpc/util.h:29:
In file included from /home/bquast/Downloads/darling-git/src/darling/Developer/Platforms/MacOSX.platform/Developer/SDKs/MacOSX.sdk/usr/include/os/log.h:11:
/home/bquast/Downloads/darling-git/src/darling/Developer/Platforms/MacOSX.platform/Developer/SDKs/MacOSX.sdk/usr/include/os/trace.h:55:16: warning: GCC does not allow 'format' attribute in this position on a function definition [-Wgcc-compat]
__attribute__((format(printf, 1, 2)))
^
1 warning generated.
[ 10%] Building C object src/external/libxpc/CMakeFiles/xpc_obj.dir/src/connection.m.o
In file included from /home/bquast/Downloads/darling-git/src/darling/src/external/libxpc/src/connection.m:23:
In file included from /home/bquast/Downloads/darling-git/src/darling/src/external/libxpc/internal-include/xpc/util.h:29:
In file included from /home/bquast/Downloads/darling-git/src/darling/Developer/Platforms/MacOSX.platform/Developer/SDKs/MacOSX.sdk/usr/include/os/log.h:11:
/home/bquast/Downloads/darling-git/src/darling/Developer/Platforms/MacOSX.platform/Developer/SDKs/MacOSX.sdk/usr/include/os/trace.h:55:16: warning: GCC does not allow 'format' attribute in this position on a function definition [-Wgcc-compat]
__attribute__((format(printf, 1, 2)))
^
1 warning generated.
In file included from /home/bquast/Downloads/darling-git/src/darling/src/external/libxpc/src/connection.m:23:
In file included from /home/bquast/Downloads/darling-git/src/darling/src/external/libxpc/internal-include/xpc/util.h:29:
In file included from /home/bquast/Downloads/darling-git/src/darling/Developer/Platforms/MacOSX.platform/Developer/SDKs/MacOSX.sdk/usr/include/os/log.h:11:
/home/bquast/Downloads/darling-git/src/darling/Developer/Platforms/MacOSX.platform/Developer/SDKs/MacOSX.sdk/usr/include/os/trace.h:55:16: warning: GCC does not allow 'format' attribute in this position on a function definition [-Wgcc-compat]
__attribute__((format(printf, 1, 2)))
^
1 warning generated.
[ 10%] Building C object src/external/libxpc/CMakeFiles/xpc_obj.dir/src/data.m.o
In file included from /home/bquast/Downloads/darling-git/src/darling/src/external/libxpc/src/data.m:21:
In file included from /home/bquast/Downloads/darling-git/src/darling/src/external/libxpc/internal-include/xpc/util.h:29:
In file included from /home/bquast/Downloads/darling-git/src/darling/Developer/Platforms/MacOSX.platform/Developer/SDKs/MacOSX.sdk/usr/include/os/log.h:11:
/home/bquast/Downloads/darling-git/src/darling/Developer/Platforms/MacOSX.platform/Developer/SDKs/MacOSX.sdk/usr/include/os/trace.h:55:16: warning: GCC does not allow 'format' attribute in this position on a function definition [-Wgcc-compat]
__attribute__((format(printf, 1, 2)))
^
1 warning generated.
In file included from /home/bquast/Downloads/darling-git/src/darling/src/external/libxpc/src/data.m:21:
In file included from /home/bquast/Downloads/darling-git/src/darling/src/external/libxpc/internal-include/xpc/util.h:29:
In file included from /home/bquast/Downloads/darling-git/src/darling/Developer/Platforms/MacOSX.platform/Developer/SDKs/MacOSX.sdk/usr/include/os/log.h:11:
/home/bquast/Downloads/darling-git/src/darling/Developer/Platforms/MacOSX.platform/Developer/SDKs/MacOSX.sdk/usr/include/os/trace.h:55:16: warning: GCC does not allow 'format' attribute in this position on a function definition [-Wgcc-compat]
__attribute__((format(printf, 1, 2)))
^
1 warning generated.
[ 10%] Building C object src/external/libxpc/CMakeFiles/xpc_obj.dir/src/date.m.o
In file included from /home/bquast/Downloads/darling-git/src/darling/src/external/libxpc/src/date.m:21:
In file included from /home/bquast/Downloads/darling-git/src/darling/src/external/libxpc/internal-include/xpc/util.h:29:
In file included from /home/bquast/Downloads/darling-git/src/darling/Developer/Platforms/MacOSX.platform/Developer/SDKs/MacOSX.sdk/usr/include/os/log.h:11:
/home/bquast/Downloads/darling-git/src/darling/Developer/Platforms/MacOSX.platform/Developer/SDKs/MacOSX.sdk/usr/include/os/trace.h:55:16: warning: GCC does not allow 'format' attribute in this position on a function definition [-Wgcc-compat]
__attribute__((format(printf, 1, 2)))
^
1 warning generated.
In file included from /home/bquast/Downloads/darling-git/src/darling/src/external/libxpc/src/date.m:21:
In file included from /home/bquast/Downloads/darling-git/src/darling/src/external/libxpc/internal-include/xpc/util.h:29:
In file included from /home/bquast/Downloads/darling-git/src/darling/Developer/Platforms/MacOSX.platform/Developer/SDKs/MacOSX.sdk/usr/include/os/log.h:11:
/home/bquast/Downloads/darling-git/src/darling/Developer/Platforms/MacOSX.platform/Developer/SDKs/MacOSX.sdk/usr/include/os/trace.h:55:16: warning: GCC does not allow 'format' attribute in this position on a function definition [-Wgcc-compat]
__attribute__((format(printf, 1, 2)))
^
1 warning generated.
[ 10%] Building C object src/external/libxpc/CMakeFiles/xpc_obj.dir/src/dictionary.m.o
In file included from /home/bquast/Downloads/darling-git/src/darling/src/external/libxpc/src/dictionary.m:21:
In file included from /home/bquast/Downloads/darling-git/src/darling/src/external/libxpc/internal-include/xpc/util.h:29:
In file included from /home/bquast/Downloads/darling-git/src/darling/Developer/Platforms/MacOSX.platform/Developer/SDKs/MacOSX.sdk/usr/include/os/log.h:11:
/home/bquast/Downloads/darling-git/src/darling/Developer/Platforms/MacOSX.platform/Developer/SDKs/MacOSX.sdk/usr/include/os/trace.h:55:16: warning: GCC does not allow 'format' attribute in this position on a function definition [-Wgcc-compat]
__attribute__((format(printf, 1, 2)))
^
1 warning generated.
In file included from /home/bquast/Downloads/darling-git/src/darling/src/external/libxpc/src/dictionary.m:21:
In file included from /home/bquast/Downloads/darling-git/src/darling/src/external/libxpc/internal-include/xpc/util.h:29:
In file included from /home/bquast/Downloads/darling-git/src/darling/Developer/Platforms/MacOSX.platform/Developer/SDKs/MacOSX.sdk/usr/include/os/log.h:11:
/home/bquast/Downloads/darling-git/src/darling/Developer/Platforms/MacOSX.platform/Developer/SDKs/MacOSX.sdk/usr/include/os/trace.h:55:16: warning: GCC does not allow 'format' attribute in this position on a function definition [-Wgcc-compat]
__attribute__((format(printf, 1, 2)))
^
1 warning generated.
[ 10%] Building C object src/external/libxpc/CMakeFiles/xpc_obj.dir/src/double.m.o
In file included from /home/bquast/Downloads/darling-git/src/darling/src/external/libxpc/src/double.m:21:
In file included from /home/bquast/Downloads/darling-git/src/darling/src/external/libxpc/internal-include/xpc/util.h:29:
In file included from /home/bquast/Downloads/darling-git/src/darling/Developer/Platforms/MacOSX.platform/Developer/SDKs/MacOSX.sdk/usr/include/os/log.h:11:
/home/bquast/Downloads/darling-git/src/darling/Developer/Platforms/MacOSX.platform/Developer/SDKs/MacOSX.sdk/usr/include/os/trace.h:55:16: warning: GCC does not allow 'format' attribute in this position on a function definition [-Wgcc-compat]
__attribute__((format(printf, 1, 2)))
^
1 warning generated.
In file included from /home/bquast/Downloads/darling-git/src/darling/src/external/libxpc/src/double.m:21:
In file included from /home/bquast/Downloads/darling-git/src/darling/src/external/libxpc/internal-include/xpc/util.h:29:
In file included from /home/bquast/Downloads/darling-git/src/darling/Developer/Platforms/MacOSX.platform/Developer/SDKs/MacOSX.sdk/usr/include/os/log.h:11:
/home/bquast/Downloads/darling-git/src/darling/Developer/Platforms/MacOSX.platform/Developer/SDKs/MacOSX.sdk/usr/include/os/trace.h:55:16: warning: GCC does not allow 'format' attribute in this position on a function definition [-Wgcc-compat]
__attribute__((format(printf, 1, 2)))
^
1 warning generated.
[ 10%] Building C object src/external/libxpc/CMakeFiles/xpc_obj.dir/src/endpoint.m.o
In file included from /home/bquast/Downloads/darling-git/src/darling/src/external/libxpc/src/endpoint.m:21:
In file included from /home/bquast/Downloads/darling-git/src/darling/src/external/libxpc/internal-include/xpc/util.h:29:
In file included from /home/bquast/Downloads/darling-git/src/darling/Developer/Platforms/MacOSX.platform/Developer/SDKs/MacOSX.sdk/usr/include/os/log.h:11:
/home/bquast/Downloads/darling-git/src/darling/Developer/Platforms/MacOSX.platform/Developer/SDKs/MacOSX.sdk/usr/include/os/trace.h:55:16: warning: GCC does not allow 'format' attribute in this position on a function definition [-Wgcc-compat]
__attribute__((format(printf, 1, 2)))
^
1 warning generated.
In file included from /home/bquast/Downloads/darling-git/src/darling/src/external/libxpc/src/endpoint.m:21:
In file included from /home/bquast/Downloads/darling-git/src/darling/src/external/libxpc/internal-include/xpc/util.h:29:
In file included from /home/bquast/Downloads/darling-git/src/darling/Developer/Platforms/MacOSX.platform/Developer/SDKs/MacOSX.sdk/usr/include/os/log.h:11:
/home/bquast/Downloads/darling-git/src/darling/Developer/Platforms/MacOSX.platform/Developer/SDKs/MacOSX.sdk/usr/include/os/trace.h:55:16: warning: GCC does not allow 'format' attribute in this position on a function definition [-Wgcc-compat]
__attribute__((format(printf, 1, 2)))
^
1 warning generated.
[ 10%] Building C object src/external/libxpc/CMakeFiles/xpc_obj.dir/src/error.m.o
In file included from /home/bquast/Downloads/darling-git/src/darling/src/external/libxpc/src/error.m:23:
In file included from /home/bquast/Downloads/darling-git/src/darling/src/external/libxpc/internal-include/xpc/util.h:29:
In file included from /home/bquast/Downloads/darling-git/src/darling/Developer/Platforms/MacOSX.platform/Developer/SDKs/MacOSX.sdk/usr/include/os/log.h:11:
/home/bquast/Downloads/darling-git/src/darling/Developer/Platforms/MacOSX.platform/Developer/SDKs/MacOSX.sdk/usr/include/os/trace.h:55:16: warning: GCC does not allow 'format' attribute in this position on a function definition [-Wgcc-compat]
__attribute__((format(printf, 1, 2)))
^
1 warning generated.
In file included from /home/bquast/Downloads/darling-git/src/darling/src/external/libxpc/src/error.m:23:
In file included from /home/bquast/Downloads/darling-git/src/darling/src/external/libxpc/internal-include/xpc/util.h:29:
In file included from /home/bquast/Downloads/darling-git/src/darling/Developer/Platforms/MacOSX.platform/Developer/SDKs/MacOSX.sdk/usr/include/os/log.h:11:
/home/bquast/Downloads/darling-git/src/darling/Developer/Platforms/MacOSX.platform/Developer/SDKs/MacOSX.sdk/usr/include/os/trace.h:55:16: warning: GCC does not allow 'format' attribute in this position on a function definition [-Wgcc-compat]
__attribute__((format(printf, 1, 2)))
^
1 warning generated.
[ 10%] Building C object src/external/libxpc/CMakeFiles/xpc_obj.dir/src/event.m.o
In file included from /home/bquast/Downloads/darling-git/src/darling/src/external/libxpc/src/event.m:21:
In file included from /home/bquast/Downloads/darling-git/src/darling/src/external/libxpc/internal-include/xpc/util.h:29:
In file included from /home/bquast/Downloads/darling-git/src/darling/Developer/Platforms/MacOSX.platform/Developer/SDKs/MacOSX.sdk/usr/include/os/log.h:11:
/home/bquast/Downloads/darling-git/src/darling/Developer/Platforms/MacOSX.platform/Developer/SDKs/MacOSX.sdk/usr/include/os/trace.h:55:16: warning: GCC does not allow 'format' attribute in this position on a function definition [-Wgcc-compat]
__attribute__((format(printf, 1, 2)))
^
1 warning generated.
In file included from /home/bquast/Downloads/darling-git/src/darling/src/external/libxpc/src/event.m:21:
In file included from /home/bquast/Downloads/darling-git/src/darling/src/external/libxpc/internal-include/xpc/util.h:29:
In file included from /home/bquast/Downloads/darling-git/src/darling/Developer/Platforms/MacOSX.platform/Developer/SDKs/MacOSX.sdk/usr/include/os/log.h:11:
/home/bquast/Downloads/darling-git/src/darling/Developer/Platforms/MacOSX.platform/Developer/SDKs/MacOSX.sdk/usr/include/os/trace.h:55:16: warning: GCC does not allow 'format' attribute in this position on a function definition [-Wgcc-compat]
__attribute__((format(printf, 1, 2)))
^
1 warning generated.
[ 10%] Building C object src/external/libxpc/CMakeFiles/xpc_obj.dir/src/fd.m.o
In file included from /home/bquast/Downloads/darling-git/src/darling/src/external/libxpc/src/fd.m:21:
In file included from /home/bquast/Downloads/darling-git/src/darling/src/external/libxpc/internal-include/xpc/util.h:29:
In file included from /home/bquast/Downloads/darling-git/src/darling/Developer/Platforms/MacOSX.platform/Developer/SDKs/MacOSX.sdk/usr/include/os/log.h:11:
/home/bquast/Downloads/darling-git/src/darling/Developer/Platforms/MacOSX.platform/Developer/SDKs/MacOSX.sdk/usr/include/os/trace.h:55:16: warning: GCC does not allow 'format' attribute in this position on a function definition [-Wgcc-compat]
__attribute__((format(printf, 1, 2)))
^
1 warning generated.
In file included from /home/bquast/Downloads/darling-git/src/darling/src/external/libxpc/src/fd.m:21:
In file included from /home/bquast/Downloads/darling-git/src/darling/src/external/libxpc/internal-include/xpc/util.h:29:
In file included from /home/bquast/Downloads/darling-git/src/darling/Developer/Platforms/MacOSX.platform/Developer/SDKs/MacOSX.sdk/usr/include/os/log.h:11:
/home/bquast/Downloads/darling-git/src/darling/Developer/Platforms/MacOSX.platform/Developer/SDKs/MacOSX.sdk/usr/include/os/trace.h:55:16: warning: GCC does not allow 'format' attribute in this position on a function definition [-Wgcc-compat]
__attribute__((format(printf, 1, 2)))
^
1 warning generated.
[ 10%] Building C object src/external/libxpc/CMakeFiles/xpc_obj.dir/src/file_transfer.m.o
In file included from /home/bquast/Downloads/darling-git/src/darling/src/external/libxpc/src/file_transfer.m:22:
In file included from /home/bquast/Downloads/darling-git/src/darling/src/external/libxpc/internal-include/xpc/util.h:29:
In file included from /home/bquast/Downloads/darling-git/src/darling/Developer/Platforms/MacOSX.platform/Developer/SDKs/MacOSX.sdk/usr/include/os/log.h:11:
/home/bquast/Downloads/darling-git/src/darling/Developer/Platforms/MacOSX.platform/Developer/SDKs/MacOSX.sdk/usr/include/os/trace.h:55:16: warning: GCC does not allow 'format' attribute in this position on a function definition [-Wgcc-compat]
__attribute__((format(printf, 1, 2)))
^
1 warning generated.
In file included from /home/bquast/Downloads/darling-git/src/darling/src/external/libxpc/src/file_transfer.m:22:
In file included from /home/bquast/Downloads/darling-git/src/darling/src/external/libxpc/internal-include/xpc/util.h:29:
In file included from /home/bquast/Downloads/darling-git/src/darling/Developer/Platforms/MacOSX.platform/Developer/SDKs/MacOSX.sdk/usr/include/os/log.h:11:
/home/bquast/Downloads/darling-git/src/darling/Developer/Platforms/MacOSX.platform/Developer/SDKs/MacOSX.sdk/usr/include/os/trace.h:55:16: warning: GCC does not allow 'format' attribute in this position on a function definition [-Wgcc-compat]
__attribute__((format(printf, 1, 2)))
^
1 warning generated.
[ 10%] Building C object src/external/libxpc/CMakeFiles/xpc_obj.dir/src/int64.m.o
In file included from /home/bquast/Downloads/darling-git/src/darling/src/external/libxpc/src/int64.m:21:
In file included from /home/bquast/Downloads/darling-git/src/darling/src/external/libxpc/internal-include/xpc/util.h:29:
In file included from /home/bquast/Downloads/darling-git/src/darling/Developer/Platforms/MacOSX.platform/Developer/SDKs/MacOSX.sdk/usr/include/os/log.h:11:
/home/bquast/Downloads/darling-git/src/darling/Developer/Platforms/MacOSX.platform/Developer/SDKs/MacOSX.sdk/usr/include/os/trace.h:55:16: warning: GCC does not allow 'format' attribute in this position on a function definition [-Wgcc-compat]
__attribute__((format(printf, 1, 2)))
^
1 warning generated.
In file included from /home/bquast/Downloads/darling-git/src/darling/src/external/libxpc/src/int64.m:21:
In file included from /home/bquast/Downloads/darling-git/src/darling/src/external/libxpc/internal-include/xpc/util.h:29:
In file included from /home/bquast/Downloads/darling-git/src/darling/Developer/Platforms/MacOSX.platform/Developer/SDKs/MacOSX.sdk/usr/include/os/log.h:11:
/home/bquast/Downloads/darling-git/src/darling/Developer/Platforms/MacOSX.platform/Developer/SDKs/MacOSX.sdk/usr/include/os/trace.h:55:16: warning: GCC does not allow 'format' attribute in this position on a function definition [-Wgcc-compat]
__attribute__((format(printf, 1, 2)))
^
1 warning generated.
[ 10%] Building C object src/external/libxpc/CMakeFiles/xpc_obj.dir/src/launchd.m.o
In file included from /home/bquast/Downloads/darling-git/src/darling/src/external/libxpc/src/launchd.m:22:
In file included from /home/bquast/Downloads/darling-git/src/darling/src/external/libxpc/internal-include/xpc/util.h:29:
In file included from /home/bquast/Downloads/darling-git/src/darling/Developer/Platforms/MacOSX.platform/Developer/SDKs/MacOSX.sdk/usr/include/os/log.h:11:
/home/bquast/Downloads/darling-git/src/darling/Developer/Platforms/MacOSX.platform/Developer/SDKs/MacOSX.sdk/usr/include/os/trace.h:55:16: warning: GCC does not allow 'format' attribute in this position on a function definition [-Wgcc-compat]
__attribute__((format(printf, 1, 2)))
^
1 warning generated.
In file included from /home/bquast/Downloads/darling-git/src/darling/src/external/libxpc/src/launchd.m:22:
In file included from /home/bquast/Downloads/darling-git/src/darling/src/external/libxpc/internal-include/xpc/util.h:29:
In file included from /home/bquast/Downloads/darling-git/src/darling/Developer/Platforms/MacOSX.platform/Developer/SDKs/MacOSX.sdk/usr/include/os/log.h:11:
/home/bquast/Downloads/darling-git/src/darling/Developer/Platforms/MacOSX.platform/Developer/SDKs/MacOSX.sdk/usr/include/os/trace.h:55:16: warning: GCC does not allow 'format' attribute in this position on a function definition [-Wgcc-compat]
__attribute__((format(printf, 1, 2)))
^
1 warning generated.
[ 10%] Building C object src/external/libxpc/CMakeFiles/xpc_obj.dir/src/mach_recv.m.o
In file included from /home/bquast/Downloads/darling-git/src/darling/src/external/libxpc/src/mach_recv.m:22:
In file included from /home/bquast/Downloads/darling-git/src/darling/src/external/libxpc/internal-include/xpc/util.h:29:
In file included from /home/bquast/Downloads/darling-git/src/darling/Developer/Platforms/MacOSX.platform/Developer/SDKs/MacOSX.sdk/usr/include/os/log.h:11:
/home/bquast/Downloads/darling-git/src/darling/Developer/Platforms/MacOSX.platform/Developer/SDKs/MacOSX.sdk/usr/include/os/trace.h:55:16: warning: GCC does not allow 'format' attribute in this position on a function definition [-Wgcc-compat]
__attribute__((format(printf, 1, 2)))
^
1 warning generated.
In file included from /home/bquast/Downloads/darling-git/src/darling/src/external/libxpc/src/mach_recv.m:22:
In file included from /home/bquast/Downloads/darling-git/src/darling/src/external/libxpc/internal-include/xpc/util.h:29:
In file included from /home/bquast/Downloads/darling-git/src/darling/Developer/Platforms/MacOSX.platform/Developer/SDKs/MacOSX.sdk/usr/include/os/log.h:11:
/home/bquast/Downloads/darling-git/src/darling/Developer/Platforms/MacOSX.platform/Developer/SDKs/MacOSX.sdk/usr/include/os/trace.h:55:16: warning: GCC does not allow 'format' attribute in this position on a function definition [-Wgcc-compat]
__attribute__((format(printf, 1, 2)))
^
1 warning generated.
[ 10%] Building C object src/external/libxpc/CMakeFiles/xpc_obj.dir/src/mach_send.m.o
In file included from /home/bquast/Downloads/darling-git/src/darling/src/external/libxpc/src/mach_send.m:22:
In file included from /home/bquast/Downloads/darling-git/src/darling/src/external/libxpc/internal-include/xpc/util.h:29:
In file included from /home/bquast/Downloads/darling-git/src/darling/Developer/Platforms/MacOSX.platform/Developer/SDKs/MacOSX.sdk/usr/include/os/log.h:11:
/home/bquast/Downloads/darling-git/src/darling/Developer/Platforms/MacOSX.platform/Developer/SDKs/MacOSX.sdk/usr/include/os/trace.h:55:16: warning: GCC does not allow 'format' attribute in this position on a function definition [-Wgcc-compat]
__attribute__((format(printf, 1, 2)))
^
1 warning generated.
In file included from /home/bquast/Downloads/darling-git/src/darling/src/external/libxpc/src/mach_send.m:22:
In file included from /home/bquast/Downloads/darling-git/src/darling/src/external/libxpc/internal-include/xpc/util.h:29:
In file included from /home/bquast/Downloads/darling-git/src/darling/Developer/Platforms/MacOSX.platform/Developer/SDKs/MacOSX.sdk/usr/include/os/log.h:11:
/home/bquast/Downloads/darling-git/src/darling/Developer/Platforms/MacOSX.platform/Developer/SDKs/MacOSX.sdk/usr/include/os/trace.h:55:16: warning: GCC does not allow 'format' attribute in this position on a function definition [-Wgcc-compat]
__attribute__((format(printf, 1, 2)))
^
1 warning generated.
[ 10%] Building C object src/external/libxpc/CMakeFiles/xpc_obj.dir/src/misc.m.o
In file included from /home/bquast/Downloads/darling-git/src/darling/src/external/libxpc/src/misc.m:21:
In file included from /home/bquast/Downloads/darling-git/src/darling/src/external/libxpc/internal-include/xpc/util.h:29:
In file included from /home/bquast/Downloads/darling-git/src/darling/Developer/Platforms/MacOSX.platform/Developer/SDKs/MacOSX.sdk/usr/include/os/log.h:11:
/home/bquast/Downloads/darling-git/src/darling/Developer/Platforms/MacOSX.platform/Developer/SDKs/MacOSX.sdk/usr/include/os/trace.h:55:16: warning: GCC does not allow 'format' attribute in this position on a function definition [-Wgcc-compat]
__attribute__((format(printf, 1, 2)))
^
1 warning generated.
In file included from /home/bquast/Downloads/darling-git/src/darling/src/external/libxpc/src/misc.m:21:
In file included from /home/bquast/Downloads/darling-git/src/darling/src/external/libxpc/internal-include/xpc/util.h:29:
In file included from /home/bquast/Downloads/darling-git/src/darling/Developer/Platforms/MacOSX.platform/Developer/SDKs/MacOSX.sdk/usr/include/os/log.h:11:
/home/bquast/Downloads/darling-git/src/darling/Developer/Platforms/MacOSX.platform/Developer/SDKs/MacOSX.sdk/usr/include/os/trace.h:55:16: warning: GCC does not allow 'format' attribute in this position on a function definition [-Wgcc-compat]
__attribute__((format(printf, 1, 2)))
^
1 warning generated.
[ 10%] Building C object src/external/libxpc/CMakeFiles/xpc_obj.dir/src/null.m.o
In file included from /home/bquast/Downloads/darling-git/src/darling/src/external/libxpc/src/null.m:21:
In file included from /home/bquast/Downloads/darling-git/src/darling/src/external/libxpc/internal-include/xpc/util.h:29:
In file included from /home/bquast/Downloads/darling-git/src/darling/Developer/Platforms/MacOSX.platform/Developer/SDKs/MacOSX.sdk/usr/include/os/log.h:11:
/home/bquast/Downloads/darling-git/src/darling/Developer/Platforms/MacOSX.platform/Developer/SDKs/MacOSX.sdk/usr/include/os/trace.h:55:16: warning: GCC does not allow 'format' attribute in this position on a function definition [-Wgcc-compat]
__attribute__((format(printf, 1, 2)))
^
1 warning generated.
In file included from /home/bquast/Downloads/darling-git/src/darling/src/external/libxpc/src/null.m:21:
In file included from /home/bquast/Downloads/darling-git/src/darling/src/external/libxpc/internal-include/xpc/util.h:29:
In file included from /home/bquast/Downloads/darling-git/src/darling/Developer/Platforms/MacOSX.platform/Developer/SDKs/MacOSX.sdk/usr/include/os/log.h:11:
/home/bquast/Downloads/darling-git/src/darling/Developer/Platforms/MacOSX.platform/Developer/SDKs/MacOSX.sdk/usr/include/os/trace.h:55:16: warning: GCC does not allow 'format' attribute in this position on a function definition [-Wgcc-compat]
__attribute__((format(printf, 1, 2)))
^
1 warning generated.
[ 10%] Building C object src/external/libxpc/CMakeFiles/xpc_obj.dir/src/pipe.m.o
In file included from /home/bquast/Downloads/darling-git/src/darling/src/external/libxpc/src/pipe.m:24:
In file included from /home/bquast/Downloads/darling-git/src/darling/src/external/libxpc/internal-include/xpc/util.h:29:
In file included from /home/bquast/Downloads/darling-git/src/darling/Developer/Platforms/MacOSX.platform/Developer/SDKs/MacOSX.sdk/usr/include/os/log.h:11:
/home/bquast/Downloads/darling-git/src/darling/Developer/Platforms/MacOSX.platform/Developer/SDKs/MacOSX.sdk/usr/include/os/trace.h:55:16: warning: GCC does not allow 'format' attribute in this position on a function definition [-Wgcc-compat]
__attribute__((format(printf, 1, 2)))
^
1 warning generated.
In file included from /home/bquast/Downloads/darling-git/src/darling/src/external/libxpc/src/pipe.m:24:
In file included from /home/bquast/Downloads/darling-git/src/darling/src/external/libxpc/internal-include/xpc/util.h:29:
In file included from /home/bquast/Downloads/darling-git/src/darling/Developer/Platforms/MacOSX.platform/Developer/SDKs/MacOSX.sdk/usr/include/os/log.h:11:
/home/bquast/Downloads/darling-git/src/darling/Developer/Platforms/MacOSX.platform/Developer/SDKs/MacOSX.sdk/usr/include/os/trace.h:55:16: warning: GCC does not allow 'format' attribute in this position on a function definition [-Wgcc-compat]
__attribute__((format(printf, 1, 2)))
^
1 warning generated.
[ 10%] Building C object src/external/libxpc/CMakeFiles/xpc_obj.dir/src/plist.m.o
In file included from /home/bquast/Downloads/darling-git/src/darling/src/external/libxpc/src/plist.m:32:
In file included from /home/bquast/Downloads/darling-git/src/darling/src/external/libxpc/internal-include/xpc/util.h:29:
In file included from /home/bquast/Downloads/darling-git/src/darling/Developer/Platforms/MacOSX.platform/Developer/SDKs/MacOSX.sdk/usr/include/os/log.h:11:
/home/bquast/Downloads/darling-git/src/darling/Developer/Platforms/MacOSX.platform/Developer/SDKs/MacOSX.sdk/usr/include/os/trace.h:55:16: warning: GCC does not allow 'format' attribute in this position on a function definition [-Wgcc-compat]
__attribute__((format(printf, 1, 2)))
^
1 warning generated.
In file included from /home/bquast/Downloads/darling-git/src/darling/src/external/libxpc/src/plist.m:32:
In file included from /home/bquast/Downloads/darling-git/src/darling/src/external/libxpc/internal-include/xpc/util.h:29:
In file included from /home/bquast/Downloads/darling-git/src/darling/Developer/Platforms/MacOSX.platform/Developer/SDKs/MacOSX.sdk/usr/include/os/log.h:11:
/home/bquast/Downloads/darling-git/src/darling/Developer/Platforms/MacOSX.platform/Developer/SDKs/MacOSX.sdk/usr/include/os/trace.h:55:16: warning: GCC does not allow 'format' attribute in this position on a function definition [-Wgcc-compat]
__attribute__((format(printf, 1, 2)))
^
1 warning generated.
[ 10%] Building C object src/external/libxpc/CMakeFiles/xpc_obj.dir/src/pointer.m.o
In file included from /home/bquast/Downloads/darling-git/src/darling/src/external/libxpc/src/pointer.m:21:
In file included from /home/bquast/Downloads/darling-git/src/darling/src/external/libxpc/internal-include/xpc/util.h:29:
In file included from /home/bquast/Downloads/darling-git/src/darling/Developer/Platforms/MacOSX.platform/Developer/SDKs/MacOSX.sdk/usr/include/os/log.h:11:
/home/bquast/Downloads/darling-git/src/darling/Developer/Platforms/MacOSX.platform/Developer/SDKs/MacOSX.sdk/usr/include/os/trace.h:55:16: warning: GCC does not allow 'format' attribute in this position on a function definition [-Wgcc-compat]
__attribute__((format(printf, 1, 2)))
^
1 warning generated.
In file included from /home/bquast/Downloads/darling-git/src/darling/src/external/libxpc/src/pointer.m:21:
In file included from /home/bquast/Downloads/darling-git/src/darling/src/external/libxpc/internal-include/xpc/util.h:29:
In file included from /home/bquast/Downloads/darling-git/src/darling/Developer/Platforms/MacOSX.platform/Developer/SDKs/MacOSX.sdk/usr/include/os/log.h:11:
/home/bquast/Downloads/darling-git/src/darling/Developer/Platforms/MacOSX.platform/Developer/SDKs/MacOSX.sdk/usr/include/os/trace.h:55:16: warning: GCC does not allow 'format' attribute in this position on a function definition [-Wgcc-compat]
__attribute__((format(printf, 1, 2)))
^
1 warning generated.
[ 10%] Building C object src/external/libxpc/CMakeFiles/xpc_obj.dir/src/runtime.m.o
In file included from /home/bquast/Downloads/darling-git/src/darling/src/external/libxpc/src/runtime.m:21:
In file included from /home/bquast/Downloads/darling-git/src/darling/src/external/libxpc/internal-include/xpc/util.h:29:
In file included from /home/bquast/Downloads/darling-git/src/darling/Developer/Platforms/MacOSX.platform/Developer/SDKs/MacOSX.sdk/usr/include/os/log.h:11:
/home/bquast/Downloads/darling-git/src/darling/Developer/Platforms/MacOSX.platform/Developer/SDKs/MacOSX.sdk/usr/include/os/trace.h:55:16: warning: GCC does not allow 'format' attribute in this position on a function definition [-Wgcc-compat]
__attribute__((format(printf, 1, 2)))
^
In file included from /home/bquast/Downloads/darling-git/src/darling/src/external/libxpc/src/runtime.m:34:
In file included from /home/bquast/Downloads/darling-git/src/darling/framework-include/AppKit/NSApplication.h:21:
In file included from /home/bquast/Downloads/darling-git/src/darling/framework-include/AppKit/NSGraphics.h:21:
In file included from /home/bquast/Downloads/darling-git/src/darling/framework-include/ApplicationServices/ApplicationServices.h:25:
In file included from /home/bquast/Downloads/darling-git/src/darling/framework-include/CoreGraphics/CoreGraphics.h:36:
In file included from /home/bquast/Downloads/darling-git/src/darling/framework-include/CoreGraphics/CGEvent.h:27:
/home/bquast/Downloads/darling-git/src/darling/framework-include/CoreGraphics/CoreGraphicsPrivate.h:4:10: fatal error: 'IOKit/hidsystem/IOLLEvent.h' file not found
#include <IOKit/hidsystem/IOLLEvent.h>
^~~~~~~~~~~~~~~~~~~~~~~~~~~~~
1 warning and 1 error generated.
make[2]: *** [src/external/libxpc/CMakeFiles/xpc_obj.dir/build.make:468: src/external/libxpc/CMakeFiles/xpc_obj.dir/src/runtime.m.o] Error 1
make[1]: *** [CMakeFiles/Makefile2:36570: src/external/libxpc/CMakeFiles/xpc_obj.dir/all] Error 2
make: *** [Makefile:136: all] Error 2
==> ERROR: A failure occurred in build().
Aborting...
Sign up for free to join this conversation on GitHub. Already have an account? Sign in to comment