Skip to content

Embed URL

HTTPS clone URL

Subversion checkout URL

You can clone with
or
.
Download ZIP
/Applications/Xcode.app/Contents/Developer/usr/bin/make all-recursive
Making all in lib
./arm/arm2gnu.pl < arm/armbits.s > armbits-gnu.S
./arm/arm2gnu.pl < arm/armopts.s > armopts-gnu.S
./arm/arm2gnu.pl < arm/armfrag.s > armfrag-gnu.S
./arm/arm2gnu.pl < arm/armidct.s > armidct-gnu.S
./arm/arm2gnu.pl < arm/armloop.s > armloop-gnu.S
/Applications/Xcode.app/Contents/Developer/usr/bin/make all-am
CC apiwrapper.lo
clang: warning: argument unused during compilation: '-fforce-addr'
CC bitpack.lo
clang: warning: argument unused during compilation: '-fforce-addr'
CC decapiwrapper.lo
clang: warning: argument unused during compilation: '-fforce-addr'
CC decinfo.lo
clang: warning: argument unused during compilation: '-fforce-addr'
CC decode.lo
clang: warning: argument unused during compilation: '-fforce-addr'
CC dequant.lo
clang: warning: argument unused during compilation: '-fforce-addr'
CC fragment.lo
clang: warning: argument unused during compilation: '-fforce-addr'
CC huffdec.lo
clang: warning: argument unused during compilation: '-fforce-addr'
CC idct.lo
clang: warning: argument unused during compilation: '-fforce-addr'
CC info.lo
clang: warning: argument unused during compilation: '-fforce-addr'
CC internal.lo
clang: warning: argument unused during compilation: '-fforce-addr'
CC quant.lo
clang: warning: argument unused during compilation: '-fforce-addr'
CC state.lo
clang: warning: argument unused during compilation: '-fforce-addr'
state.c:719:21: warning: comparison of unsigned enum expression < 0 is always false
[-Wtautological-compare]
_info->colorspace<0||_info->colorspace>=TH_CS_NSPACES||
~~~~~~~~~~~~~~~~~^~
state.c:720:20: warning: comparison of unsigned enum expression < 0 is always false
[-Wtautological-compare]
_info->pixel_fmt<0||_info->pixel_fmt>=TH_PF_NFORMATS||
~~~~~~~~~~~~~~~~^~
2 warnings generated.
CC armcpu.lo
clang: warning: argument unused during compilation: '-fforce-addr'
CC armstate.lo
clang: warning: argument unused during compilation: '-fforce-addr'
CPPAS armbits-gnu.lo
armbits-gnu.S:24:2: error: unknown directive
.type oc_pack_read1_arm, %function; oc_pack_read1_arm: @ PROC
^
armbits-gnu.S:37:2: error: unknown directive
.size oc_pack_read1_arm, .-oc_pack_read1_arm @ ENDP
^
armbits-gnu.S:39:2: error: unknown directive
.type oc_pack_read_arm, %function; oc_pack_read_arm: @ PROC
^
armbits-gnu.S:70:2: error: invalid instruction
LDRHIB r14,[r11],#1 @ r14 = *ptr++
^
armbits-gnu.S:76:2: error: invalid instruction
LDRHIB r14,[r11],#1 @ r14 = *ptr++
^
armbits-gnu.S:82:2: error: invalid instruction
LDRHIB r14,[r11],#1 @ r14 = *ptr++
^
armbits-gnu.S:88:2: error: invalid instruction
LDRHIB r14,[r11],#1 @ r14 = *ptr++
^
armbits-gnu.S:107:2: error: invalid instruction
LDRLOB r14,[r11] @ (LO) r14 = *ptr
^
armbits-gnu.S:121:2: error: unknown directive
.size oc_pack_read_arm, .-oc_pack_read_arm @ ENDP
^
armbits-gnu.S:125:2: error: unknown directive
.type oc_huff_token_decode_arm, %function; oc_huff_token_decode_arm: @ PROC
^
armbits-gnu.S:186:2: error: invalid instruction
LDRHIB r14,[r3],#1 @ r14 = *ptr++
^
armbits-gnu.S:191:2: error: invalid instruction
LDRHIB r14,[r3],#1 @ r14 = *ptr++
^
armbits-gnu.S:201:2: error: invalid instruction
LDRHIB r14,[r3],#1 @ r14 = *ptr++
^
armbits-gnu.S:208:2: error: invalid instruction
LDRHIB r14,[r3],#1 @ (HI) r14 = *ptr++
^
armbits-gnu.S:228:2: error: unknown directive
.size oc_huff_token_decode_arm, .-oc_huff_token_decode_arm @ ENDP
^
armbits-gnu.S:231:23: error: unexpected token in '.section' directive
.section .note.GNU-stack,"",%progbits
^
make[4]: *** [armbits-gnu.lo] Error 1
make[3]: *** [all] Error 2
make[2]: *** [all-recursive] Error 1
make[1]: *** [all] Error 2
make: *** [build/theora.framework/theora] Error 1
Hawkeye:OgvKit brion$
Sign up for free to join this conversation on GitHub. Already have an account? Sign in to comment
Something went wrong with that request. Please try again.