Skip to content

Instantly share code, notes, and snippets.

Embed
What would you like to do?
(Yet)succesfully deal-ii installation over Arch
Performing C++ SOURCE FILE Test DEAL_II_HAVE_AVX failed with the following compile output:
Change Dir: /tmp/makepkg/deal-ii/src/build/CMakeFiles/CMakeTmp
Run Build Command(s):/usr/bin/make -f Makefile cmTC_fdb88/fast && /usr/bin/make -f CMakeFiles/cmTC_fdb88.dir/build.make CMakeFiles/cmTC_fdb88.dir/build
make[1]: Entering directory '/tmp/makepkg/deal-ii/src/build/CMakeFiles/CMakeTmp'
Building CXX object CMakeFiles/cmTC_fdb88.dir/src.cxx.o
/usr/bin/c++ -DDEAL_II_HAVE_AVX -march=x86-64 -mtune=generic -O2 -pipe -fno-plt -Wno-unknown-pragmas -Wno-cpp -o CMakeFiles/cmTC_fdb88.dir/src.cxx.o -c /tmp/makepkg/deal-ii/src/build/CMakeFiles/CMakeTmp/src.cxx
/tmp/makepkg/deal-ii/src/build/CMakeFiles/CMakeTmp/src.cxx:3:6: error: #error "__AVX__ flag not set, no support for AVX"
3 | #error "__AVX__ flag not set, no support for AVX"
| ^~~~~
/tmp/makepkg/deal-ii/src/build/CMakeFiles/CMakeTmp/src.cxx: In function ‘int main()’:
/tmp/makepkg/deal-ii/src/build/CMakeFiles/CMakeTmp/src.cxx:35:9: warning: AVX vector return without AVX enabled changes the ABI [-Wpsabi]
35 | b = _mm256_set1_pd (static_cast<volatile double>(2.25));
| ~~^~~~~~~~~~~~~~~~~~~~~~~~~~~~~~~~~~~~~~~~~~~~~~~~~~~~~
make[1]: *** [CMakeFiles/cmTC_fdb88.dir/build.make:78: CMakeFiles/cmTC_fdb88.dir/src.cxx.o] Error 1
make[1]: Leaving directory '/tmp/makepkg/deal-ii/src/build/CMakeFiles/CMakeTmp'
make: *** [Makefile:127: cmTC_fdb88/fast] Error 2
...and run output:
Return value: 1
Source file was:
#ifndef __AVX__
#error "__AVX__ flag not set, no support for AVX"
#endif
#include <x86intrin.h>
class VectorizedArray
{
public:
VectorizedArray &
operator += (const VectorizedArray &vec)
{
data = _mm256_add_pd (data, vec.data);
return *this;
}
__m256d data;
};
inline
VectorizedArray
operator + (const VectorizedArray &u, const VectorizedArray &v)
{
VectorizedArray tmp = u;
return tmp+=v;
}
int main()
{
__m256d a, b;
const unsigned int vector_bytes = sizeof(__m256d);
const int n_vectors = vector_bytes/sizeof(double);
__m256d * data =
reinterpret_cast<__m256d*>(_mm_malloc (2*vector_bytes, vector_bytes));
double * ptr = reinterpret_cast<double*>(&a);
ptr[0] = static_cast<volatile double>(1.0);
for (int i=1; i<n_vectors; ++i)
ptr[i] = 0.0;
b = _mm256_set1_pd (static_cast<volatile double>(2.25));
data[0] = _mm256_add_pd (a, b);
data[1] = _mm256_mul_pd (b, data[0]);
ptr = reinterpret_cast<double*>(&data[1]);
int return_value = 0;
if (ptr[0] != 7.3125)
return_value = 1;
for (int i=1; i<n_vectors; ++i)
if (ptr[i] != 5.0625)
return_value = 1;
VectorizedArray c, d, e;
c.data = b;
d.data = b;
e = c + d;
ptr = reinterpret_cast<double*>(&e.data);
for (int i=0; i<n_vectors; ++i)
if (ptr[i] != 4.5)
return_value = 1;
_mm_free (data);
return return_value;
}
Performing C++ SOURCE FILE Test DEAL_II_HAVE_AVX512 failed with the following compile output:
Change Dir: /tmp/makepkg/deal-ii/src/build/CMakeFiles/CMakeTmp
Run Build Command(s):/usr/bin/make -f Makefile cmTC_204d5/fast && /usr/bin/make -f CMakeFiles/cmTC_204d5.dir/build.make CMakeFiles/cmTC_204d5.dir/build
make[1]: Entering directory '/tmp/makepkg/deal-ii/src/build/CMakeFiles/CMakeTmp'
Building CXX object CMakeFiles/cmTC_204d5.dir/src.cxx.o
/usr/bin/c++ -DDEAL_II_HAVE_AVX512 -march=x86-64 -mtune=generic -O2 -pipe -fno-plt -Wno-unknown-pragmas -Wno-cpp -o CMakeFiles/cmTC_204d5.dir/src.cxx.o -c /tmp/makepkg/deal-ii/src/build/CMakeFiles/CMakeTmp/src.cxx
/tmp/makepkg/deal-ii/src/build/CMakeFiles/CMakeTmp/src.cxx:3:6: error: #error "__AVX512F__ flag not set, no support for AVX512"
3 | #error "__AVX512F__ flag not set, no support for AVX512"
| ^~~~~
/tmp/makepkg/deal-ii/src/build/CMakeFiles/CMakeTmp/src.cxx: In function ‘int main()’:
/tmp/makepkg/deal-ii/src/build/CMakeFiles/CMakeTmp/src.cxx:18:9: warning: AVX512F vector return without AVX512F enabled changes the ABI [-Wpsabi]
18 | b = _mm512_set1_pd(x);
| ~~^~~~~~~~~~~~~~~~~~~
make[1]: *** [CMakeFiles/cmTC_204d5.dir/build.make:78: CMakeFiles/cmTC_204d5.dir/src.cxx.o] Error 1
make[1]: Leaving directory '/tmp/makepkg/deal-ii/src/build/CMakeFiles/CMakeTmp'
make: *** [Makefile:127: cmTC_204d5/fast] Error 2
...and run output:
Return value: 1
Source file was:
#ifndef __AVX512F__
#error "__AVX512F__ flag not set, no support for AVX512"
#endif
#include <x86intrin.h>
int main()
{
__m512d a, b;
const unsigned int vector_bytes = sizeof(__m512d);
const int n_vectors = vector_bytes/sizeof(double);
__m512d * data =
reinterpret_cast<__m512d*>(_mm_malloc (2*vector_bytes, vector_bytes));
double * ptr = reinterpret_cast<double*>(&a);
ptr[0] = static_cast<volatile double>(1.0);
for (int i=1; i<n_vectors; ++i)
ptr[i] = 0.0;
const volatile double x = 2.25;
b = _mm512_set1_pd(x);
data[0] = _mm512_add_pd (a, b);
data[1] = _mm512_mul_pd (b, data[0]);
ptr = reinterpret_cast<double*>(&data[1]);
int return_value = 0;
if (ptr[0] != 7.3125)
return_value = 1;
for (int i=1; i<n_vectors; ++i)
if (ptr[i] != 5.0625)
return_value = 1;
_mm_free (data);
return return_value;
}
Performing C++ SOURCE FILE Test DEAL_II_HAVE_ALTIVEC failed with the following compile output:
Change Dir: /tmp/makepkg/deal-ii/src/build/CMakeFiles/CMakeTmp
Run Build Command(s):/usr/bin/make -f Makefile cmTC_f2721/fast && /usr/bin/make -f CMakeFiles/cmTC_f2721.dir/build.make CMakeFiles/cmTC_f2721.dir/build
make[1]: Entering directory '/tmp/makepkg/deal-ii/src/build/CMakeFiles/CMakeTmp'
Building CXX object CMakeFiles/cmTC_f2721.dir/src.cxx.o
/usr/bin/c++ -DDEAL_II_HAVE_ALTIVEC -march=x86-64 -mtune=generic -O2 -pipe -fno-plt -Wno-unknown-pragmas -Wno-cpp -o CMakeFiles/cmTC_f2721.dir/src.cxx.o -c /tmp/makepkg/deal-ii/src/build/CMakeFiles/CMakeTmp/src.cxx
/tmp/makepkg/deal-ii/src/build/CMakeFiles/CMakeTmp/src.cxx:3:6: error: #error "__ALTIVEC__ flag not set, no support for Altivec"
3 | #error "__ALTIVEC__ flag not set, no support for Altivec"
| ^~~~~
/tmp/makepkg/deal-ii/src/build/CMakeFiles/CMakeTmp/src.cxx:5:14: fatal error: altivec.h: No such file or directory
5 | #include <altivec.h>
| ^~~~~~~~~~~
compilation terminated.
make[1]: *** [CMakeFiles/cmTC_f2721.dir/build.make:78: CMakeFiles/cmTC_f2721.dir/src.cxx.o] Error 1
make[1]: Leaving directory '/tmp/makepkg/deal-ii/src/build/CMakeFiles/CMakeTmp'
make: *** [Makefile:127: cmTC_f2721/fast] Error 2
...and run output:
Return value: 1
Source file was:
#ifndef __ALTIVEC__
#error "__ALTIVEC__ flag not set, no support for Altivec"
#endif
#include <altivec.h>
#undef vector
#undef pixel
#undef bool
int main()
{
__vector double a, b, data1, data2;
const int n_vectors = sizeof(a)/sizeof(double);
double * ptr = reinterpret_cast<double*>(&a);
ptr[0] = static_cast<volatile double>(1.0);
for (int i=1; i<n_vectors; ++i)
ptr[i] = 0.0;
b = vec_splats (static_cast<volatile double>(2.25));
data1 = vec_add (a, b);
data2 = vec_mul (b, data1);
ptr = reinterpret_cast<double*>(&data2);
int return_value = 0;
if (ptr[0] != 7.3125)
return_value += 1;
for (int i=1; i<n_vectors; ++i)
if (ptr[i] != 5.0625)
return_value += 2;
b = vec_splats (static_cast<volatile double>(-1.0));
data1 = vec_abs(vec_mul (b, data2));
vec_vsx_st(data1, 0, ptr);
b = vec_vsx_ld(0, ptr);
ptr = reinterpret_cast<double*>(&b);
if (ptr[0] != 7.3125)
return_value += 4;
for (int i=1; i<n_vectors; ++i)
if (ptr[i] != 5.0625)
return_value += 8;
return return_value;
}
Performing C++ SOURCE FILE Test DEAL_II_HAVE_CXX20_FEATURES failed with the following output:
Change Dir: /tmp/makepkg/deal-ii/src/build/CMakeFiles/CMakeTmp
Run Build Command(s):/usr/bin/make -f Makefile cmTC_d9fe7/fast && /usr/bin/make -f CMakeFiles/cmTC_d9fe7.dir/build.make CMakeFiles/cmTC_d9fe7.dir/build
make[1]: Entering directory '/tmp/makepkg/deal-ii/src/build/CMakeFiles/CMakeTmp'
Building CXX object CMakeFiles/cmTC_d9fe7.dir/src.cxx.o
/usr/bin/c++ -DDEAL_II_HAVE_CXX20_FEATURES -march=x86-64 -mtune=generic -O2 -pipe -fno-plt -Wno-unknown-pragmas -Wno-cpp -pedantic -fPIC -Wall -Wextra -Wmissing-braces -Woverloaded-virtual -Wpointer-arith -Wsign-compare -Wsuggest-override -Wswitch -Wsynth -Wwrite-strings -Wno-placement-new -Wno-deprecated-declarations -Wno-literal-suffix -Wno-psabi -Wno-class-memaccess -fopenmp-simd -O0 -ggdb -o CMakeFiles/cmTC_d9fe7.dir/src.cxx.o -c /tmp/makepkg/deal-ii/src/build/CMakeFiles/CMakeTmp/src.cxx
/tmp/makepkg/deal-ii/src/build/CMakeFiles/CMakeTmp/src.cxx:6:8: error: #error "insufficient support for C++20"
6 | # error "insufficient support for C++20"
| ^~~~~
/tmp/makepkg/deal-ii/src/build/CMakeFiles/CMakeTmp/src.cxx:10:8: error: #error "insufficient support for C++20"
10 | # error "insufficient support for C++20"
| ^~~~~
make[1]: *** [CMakeFiles/cmTC_d9fe7.dir/build.make:78: CMakeFiles/cmTC_d9fe7.dir/src.cxx.o] Error 1
make[1]: Leaving directory '/tmp/makepkg/deal-ii/src/build/CMakeFiles/CMakeTmp'
make: *** [Makefile:127: cmTC_d9fe7/fast] Error 2
Source file was:
#include <cmath>
#include <ranges>
#if __cplusplus < 201709L && !defined(_MSC_VER) && !defined(__INTEL_COMPILER)
# error "insufficient support for C++20"
#endif
#if !(defined __cpp_lib_ranges) || (__cpp_lib_ranges < 201911)
# error "insufficient support for C++20"
#endif
int main()
{
}
Performing C++ SOURCE FILE Test DEAL_II_HAVE_FLAG_Wno_unused_command_line_argument failed with the following output:
Change Dir: /tmp/makepkg/deal-ii/src/build/CMakeFiles/CMakeTmp
Run Build Command(s):/usr/bin/make -f Makefile cmTC_6324b/fast && /usr/bin/make -f CMakeFiles/cmTC_6324b.dir/build.make CMakeFiles/cmTC_6324b.dir/build
make[1]: Entering directory '/tmp/makepkg/deal-ii/src/build/CMakeFiles/CMakeTmp'
Building CXX object CMakeFiles/cmTC_6324b.dir/src.cxx.o
/usr/bin/c++ -DDEAL_II_HAVE_FLAG_Wno_unused_command_line_argument -march=x86-64 -mtune=generic -O2 -pipe -fno-plt -Wno-unknown-pragmas -Wno-cpp -pedantic -fPIC -Wall -Wextra -Wmissing-braces -Woverloaded-virtual -Wpointer-arith -Wsign-compare -Wsuggest-override -Wswitch -Wsynth -Wwrite-strings -Wno-placement-new -Wno-deprecated-declarations -Wno-literal-suffix -Wno-psabi -Wno-class-memaccess -fopenmp-simd -O0 -ggdb -Wunused-command-line-argument -o CMakeFiles/cmTC_6324b.dir/src.cxx.o -c /tmp/makepkg/deal-ii/src/build/CMakeFiles/CMakeTmp/src.cxx
c++: error: unrecognized command-line option '-Wunused-command-line-argument'; did you mean '-Wunused-dummy-argument'?
make[1]: *** [CMakeFiles/cmTC_6324b.dir/build.make:78: CMakeFiles/cmTC_6324b.dir/src.cxx.o] Error 1
make[1]: Leaving directory '/tmp/makepkg/deal-ii/src/build/CMakeFiles/CMakeTmp'
make: *** [Makefile:127: cmTC_6324b/fast] Error 2
Source file was:
int main() { return 0; }
Performing C++ SOURCE FILE Test DEAL_II_HAVE_COMPLEX_OPERATOR_OVERLOADS failed with the following output:
Change Dir: /tmp/makepkg/deal-ii/src/build/CMakeFiles/CMakeTmp
Run Build Command(s):/usr/bin/make -f Makefile cmTC_2900e/fast && /usr/bin/make -f CMakeFiles/cmTC_2900e.dir/build.make CMakeFiles/cmTC_2900e.dir/build
make[1]: Entering directory '/tmp/makepkg/deal-ii/src/build/CMakeFiles/CMakeTmp'
Building CXX object CMakeFiles/cmTC_2900e.dir/src.cxx.o
/usr/bin/c++ -DDEAL_II_HAVE_COMPLEX_OPERATOR_OVERLOADS -march=x86-64 -mtune=generic -O2 -pipe -fno-plt -Wno-unknown-pragmas -Wno-cpp -pedantic -fPIC -Wall -Wextra -Wmissing-braces -Woverloaded-virtual -Wpointer-arith -Wsign-compare -Wsuggest-override -Wswitch -Wsynth -Wwrite-strings -Wno-placement-new -Wno-deprecated-declarations -Wno-literal-suffix -Wno-psabi -Wno-class-memaccess -fopenmp-simd -O0 -ggdb -Werror -o CMakeFiles/cmTC_2900e.dir/src.cxx.o -c /tmp/makepkg/deal-ii/src/build/CMakeFiles/CMakeTmp/src.cxx
/tmp/makepkg/deal-ii/src/build/CMakeFiles/CMakeTmp/src.cxx: In function ‘int main()’:
/tmp/makepkg/deal-ii/src/build/CMakeFiles/CMakeTmp/src.cxx:6:14: error: no match for ‘operator*’ (operand types are ‘double’ and ‘std::complex<float>’)
6 | double() * std::complex<float>();
In file included from /tmp/makepkg/deal-ii/src/build/CMakeFiles/CMakeTmp/src.cxx:2:
/usr/include/c++/11.1.0/complex:392:5: note: candidate: ‘template<class _Tp> std::complex<_Tp> std::operator*(const std::complex<_Tp>&, const std::complex<_Tp>&)’
392 | operator*(const complex<_Tp>& __x, const complex<_Tp>& __y)
| ^~~~~~~~
/usr/include/c++/11.1.0/complex:392:5: note: template argument deduction/substitution failed:
/tmp/makepkg/deal-ii/src/build/CMakeFiles/CMakeTmp/src.cxx:6:36: note: mismatched types ‘const std::complex<_Tp>’ and ‘double’
6 | double() * std::complex<float>();
| ^
In file included from /tmp/makepkg/deal-ii/src/build/CMakeFiles/CMakeTmp/src.cxx:2:
/usr/include/c++/11.1.0/complex:401:5: note: candidate: ‘template<class _Tp> std::complex<_Tp> std::operator*(const std::complex<_Tp>&, const _Tp&)’
401 | operator*(const complex<_Tp>& __x, const _Tp& __y)
| ^~~~~~~~
/usr/include/c++/11.1.0/complex:401:5: note: template argument deduction/substitution failed:
/tmp/makepkg/deal-ii/src/build/CMakeFiles/CMakeTmp/src.cxx:6:36: note: mismatched types ‘const std::complex<_Tp>’ and ‘double’
6 | double() * std::complex<float>();
| ^
In file included from /tmp/makepkg/deal-ii/src/build/CMakeFiles/CMakeTmp/src.cxx:2:
/usr/include/c++/11.1.0/complex:410:5: note: candidate: ‘template<class _Tp> std::complex<_Tp> std::operator*(const _Tp&, const std::complex<_Tp>&)’
410 | operator*(const _Tp& __x, const complex<_Tp>& __y)
| ^~~~~~~~
/usr/include/c++/11.1.0/complex:410:5: note: template argument deduction/substitution failed:
/tmp/makepkg/deal-ii/src/build/CMakeFiles/CMakeTmp/src.cxx:6:36: note: deduced conflicting types for parameter ‘_Tp’ (‘double’ and ‘float’)
6 | double() * std::complex<float>();
| ^
/tmp/makepkg/deal-ii/src/build/CMakeFiles/CMakeTmp/src.cxx:7:27: error: no match for ‘operator*’ (operand types are ‘std::complex<float>’ and ‘double’)
7 | std::complex<float>() * double();
In file included from /tmp/makepkg/deal-ii/src/build/CMakeFiles/CMakeTmp/src.cxx:2:
/usr/include/c++/11.1.0/complex:392:5: note: candidate: ‘template<class _Tp> std::complex<_Tp> std::operator*(const std::complex<_Tp>&, const std::complex<_Tp>&)’
392 | operator*(const complex<_Tp>& __x, const complex<_Tp>& __y)
| ^~~~~~~~
/usr/include/c++/11.1.0/complex:392:5: note: template argument deduction/substitution failed:
/tmp/makepkg/deal-ii/src/build/CMakeFiles/CMakeTmp/src.cxx:7:36: note: mismatched types ‘const std::complex<_Tp>’ and ‘double’
7 | std::complex<float>() * double();
| ^
In file included from /tmp/makepkg/deal-ii/src/build/CMakeFiles/CMakeTmp/src.cxx:2:
/usr/include/c++/11.1.0/complex:401:5: note: candidate: ‘template<class _Tp> std::complex<_Tp> std::operator*(const std::complex<_Tp>&, const _Tp&)’
401 | operator*(const complex<_Tp>& __x, const _Tp& __y)
| ^~~~~~~~
/usr/include/c++/11.1.0/complex:401:5: note: template argument deduction/substitution failed:
/tmp/makepkg/deal-ii/src/build/CMakeFiles/CMakeTmp/src.cxx:7:36: note: deduced conflicting types for parameter ‘const _Tp’ (‘float’ and ‘double’)
7 | std::complex<float>() * double();
| ^
In file included from /tmp/makepkg/deal-ii/src/build/CMakeFiles/CMakeTmp/src.cxx:2:
/usr/include/c++/11.1.0/complex:410:5: note: candidate: ‘template<class _Tp> std::complex<_Tp> std::operator*(const _Tp&, const std::complex<_Tp>&)’
410 | operator*(const _Tp& __x, const complex<_Tp>& __y)
| ^~~~~~~~
/usr/include/c++/11.1.0/complex:410:5: note: template argument deduction/substitution failed:
/tmp/makepkg/deal-ii/src/build/CMakeFiles/CMakeTmp/src.cxx:7:36: note: mismatched types ‘const std::complex<_Tp>’ and ‘double’
7 | std::complex<float>() * double();
| ^
/tmp/makepkg/deal-ii/src/build/CMakeFiles/CMakeTmp/src.cxx:8:13: error: no match for ‘operator*’ (operand types are ‘float’ and ‘std::complex<double>’)
8 | float() * std::complex<double>();
In file included from /tmp/makepkg/deal-ii/src/build/CMakeFiles/CMakeTmp/src.cxx:2:
/usr/include/c++/11.1.0/complex:392:5: note: candidate: ‘template<class _Tp> std::complex<_Tp> std::operator*(const std::complex<_Tp>&, const std::complex<_Tp>&)’
392 | operator*(const complex<_Tp>& __x, const complex<_Tp>& __y)
| ^~~~~~~~
/usr/include/c++/11.1.0/complex:392:5: note: template argument deduction/substitution failed:
/tmp/makepkg/deal-ii/src/build/CMakeFiles/CMakeTmp/src.cxx:8:36: note: mismatched types ‘const std::complex<_Tp>’ and ‘float’
8 | float() * std::complex<double>();
| ^
In file included from /tmp/makepkg/deal-ii/src/build/CMakeFiles/CMakeTmp/src.cxx:2:
/usr/include/c++/11.1.0/complex:401:5: note: candidate: ‘template<class _Tp> std::complex<_Tp> std::operator*(const std::complex<_Tp>&, const _Tp&)’
401 | operator*(const complex<_Tp>& __x, const _Tp& __y)
| ^~~~~~~~
/usr/include/c++/11.1.0/complex:401:5: note: template argument deduction/substitution failed:
/tmp/makepkg/deal-ii/src/build/CMakeFiles/CMakeTmp/src.cxx:8:36: note: mismatched types ‘const std::complex<_Tp>’ and ‘float’
8 | float() * std::complex<double>();
| ^
In file included from /tmp/makepkg/deal-ii/src/build/CMakeFiles/CMakeTmp/src.cxx:2:
/usr/include/c++/11.1.0/complex:410:5: note: candidate: ‘template<class _Tp> std::complex<_Tp> std::operator*(const _Tp&, const std::complex<_Tp>&)’
410 | operator*(const _Tp& __x, const complex<_Tp>& __y)
| ^~~~~~~~
/usr/include/c++/11.1.0/complex:410:5: note: template argument deduction/substitution failed:
/tmp/makepkg/deal-ii/src/build/CMakeFiles/CMakeTmp/src.cxx:8:36: note: deduced conflicting types for parameter ‘_Tp’ (‘float’ and ‘double’)
8 | float() * std::complex<double>();
| ^
/tmp/makepkg/deal-ii/src/build/CMakeFiles/CMakeTmp/src.cxx:9:28: error: no match for ‘operator*’ (operand types are ‘std::complex<double>’ and ‘float’)
9 | std::complex<double>() * float();
In file included from /tmp/makepkg/deal-ii/src/build/CMakeFiles/CMakeTmp/src.cxx:2:
/usr/include/c++/11.1.0/complex:392:5: note: candidate: ‘template<class _Tp> std::complex<_Tp> std::operator*(const std::complex<_Tp>&, const std::complex<_Tp>&)’
392 | operator*(const complex<_Tp>& __x, const complex<_Tp>& __y)
| ^~~~~~~~
/usr/include/c++/11.1.0/complex:392:5: note: template argument deduction/substitution failed:
/tmp/makepkg/deal-ii/src/build/CMakeFiles/CMakeTmp/src.cxx:9:36: note: mismatched types ‘const std::complex<_Tp>’ and ‘float’
9 | std::complex<double>() * float();
| ^
In file included from /tmp/makepkg/deal-ii/src/build/CMakeFiles/CMakeTmp/src.cxx:2:
/usr/include/c++/11.1.0/complex:401:5: note: candidate: ‘template<class _Tp> std::complex<_Tp> std::operator*(const std::complex<_Tp>&, const _Tp&)’
401 | operator*(const complex<_Tp>& __x, const _Tp& __y)
| ^~~~~~~~
/usr/include/c++/11.1.0/complex:401:5: note: template argument deduction/substitution failed:
/tmp/makepkg/deal-ii/src/build/CMakeFiles/CMakeTmp/src.cxx:9:36: note: deduced conflicting types for parameter ‘const _Tp’ (‘double’ and ‘float’)
9 | std::complex<double>() * float();
| ^
In file included from /tmp/makepkg/deal-ii/src/build/CMakeFiles/CMakeTmp/src.cxx:2:
/usr/include/c++/11.1.0/complex:410:5: note: candidate: ‘template<class _Tp> std::complex<_Tp> std::operator*(const _Tp&, const std::complex<_Tp>&)’
410 | operator*(const _Tp& __x, const complex<_Tp>& __y)
| ^~~~~~~~
/usr/include/c++/11.1.0/complex:410:5: note: template argument deduction/substitution failed:
/tmp/makepkg/deal-ii/src/build/CMakeFiles/CMakeTmp/src.cxx:9:36: note: mismatched types ‘const std::complex<_Tp>’ and ‘float’
9 | std::complex<double>() * float();
| ^
/tmp/makepkg/deal-ii/src/build/CMakeFiles/CMakeTmp/src.cxx:10:28: error: no match for ‘operator*’ (operand types are ‘std::complex<double>’ and ‘std::complex<float>’)
10 | std::complex<double>() * std::complex<float>();
| ~~~~~~~~~~~~~~~~~ ^ ~~~~~~~~~~~~~~~~
| | |
| complex<double> complex<float>
In file included from /tmp/makepkg/deal-ii/src/build/CMakeFiles/CMakeTmp/src.cxx:2:
/usr/include/c++/11.1.0/complex:392:5: note: candidate: ‘template<class _Tp> std::complex<_Tp> std::operator*(const std::complex<_Tp>&, const std::complex<_Tp>&)’
392 | operator*(const complex<_Tp>& __x, const complex<_Tp>& __y)
| ^~~~~~~~
/usr/include/c++/11.1.0/complex:392:5: note: template argument deduction/substitution failed:
/tmp/makepkg/deal-ii/src/build/CMakeFiles/CMakeTmp/src.cxx:10:50: note: deduced conflicting types for parameter ‘_Tp’ (‘double’ and ‘float’)
10 | std::complex<double>() * std::complex<float>();
| ^
In file included from /tmp/makepkg/deal-ii/src/build/CMakeFiles/CMakeTmp/src.cxx:2:
/usr/include/c++/11.1.0/complex:401:5: note: candidate: ‘template<class _Tp> std::complex<_Tp> std::operator*(const std::complex<_Tp>&, const _Tp&)’
401 | operator*(const complex<_Tp>& __x, const _Tp& __y)
| ^~~~~~~~
/usr/include/c++/11.1.0/complex:401:5: note: template argument deduction/substitution failed:
/tmp/makepkg/deal-ii/src/build/CMakeFiles/CMakeTmp/src.cxx:10:50: note: deduced conflicting types for parameter ‘const _Tp’ (‘double’ and ‘std::complex<float>’)
10 | std::complex<double>() * std::complex<float>();
| ^
In file included from /tmp/makepkg/deal-ii/src/build/CMakeFiles/CMakeTmp/src.cxx:2:
/usr/include/c++/11.1.0/complex:410:5: note: candidate: ‘template<class _Tp> std::complex<_Tp> std::operator*(const _Tp&, const std::complex<_Tp>&)’
410 | operator*(const _Tp& __x, const complex<_Tp>& __y)
| ^~~~~~~~
/usr/include/c++/11.1.0/complex:410:5: note: template argument deduction/substitution failed:
/tmp/makepkg/deal-ii/src/build/CMakeFiles/CMakeTmp/src.cxx:10:50: note: deduced conflicting types for parameter ‘_Tp’ (‘std::complex<double>’ and ‘float’)
10 | std::complex<double>() * std::complex<float>();
| ^
/tmp/makepkg/deal-ii/src/build/CMakeFiles/CMakeTmp/src.cxx:11:27: error: no match for ‘operator*’ (operand types are ‘std::complex<float>’ and ‘std::complex<double>’)
11 | std::complex<float>() * std::complex<double>();
| ~~~~~~~~~~~~~~~~ ^ ~~~~~~~~~~~~~~~~~
| | |
| complex<float> complex<double>
In file included from /tmp/makepkg/deal-ii/src/build/CMakeFiles/CMakeTmp/src.cxx:2:
/usr/include/c++/11.1.0/complex:392:5: note: candidate: ‘template<class _Tp> std::complex<_Tp> std::operator*(const std::complex<_Tp>&, const std::complex<_Tp>&)’
392 | operator*(const complex<_Tp>& __x, const complex<_Tp>& __y)
| ^~~~~~~~
/usr/include/c++/11.1.0/complex:392:5: note: template argument deduction/substitution failed:
/tmp/makepkg/deal-ii/src/build/CMakeFiles/CMakeTmp/src.cxx:11:50: note: deduced conflicting types for parameter ‘_Tp’ (‘float’ and ‘double’)
11 | std::complex<float>() * std::complex<double>();
| ^
In file included from /tmp/makepkg/deal-ii/src/build/CMakeFiles/CMakeTmp/src.cxx:2:
/usr/include/c++/11.1.0/complex:401:5: note: candidate: ‘template<class _Tp> std::complex<_Tp> std::operator*(const std::complex<_Tp>&, const _Tp&)’
401 | operator*(const complex<_Tp>& __x, const _Tp& __y)
| ^~~~~~~~
/usr/include/c++/11.1.0/complex:401:5: note: template argument deduction/substitution failed:
/tmp/makepkg/deal-ii/src/build/CMakeFiles/CMakeTmp/src.cxx:11:50: note: deduced conflicting types for parameter ‘const _Tp’ (‘float’ and ‘std::complex<double>’)
11 | std::complex<float>() * std::complex<double>();
| ^
In file included from /tmp/makepkg/deal-ii/src/build/CMakeFiles/CMakeTmp/src.cxx:2:
/usr/include/c++/11.1.0/complex:410:5: note: candidate: ‘template<class _Tp> std::complex<_Tp> std::operator*(const _Tp&, const std::complex<_Tp>&)’
410 | operator*(const _Tp& __x, const complex<_Tp>& __y)
| ^~~~~~~~
/usr/include/c++/11.1.0/complex:410:5: note: template argument deduction/substitution failed:
/tmp/makepkg/deal-ii/src/build/CMakeFiles/CMakeTmp/src.cxx:11:50: note: deduced conflicting types for parameter ‘_Tp’ (‘std::complex<float>’ and ‘double’)
11 | std::complex<float>() * std::complex<double>();
| ^
make[1]: *** [CMakeFiles/cmTC_2900e.dir/build.make:78: CMakeFiles/cmTC_2900e.dir/src.cxx.o] Error 1
make[1]: Leaving directory '/tmp/makepkg/deal-ii/src/build/CMakeFiles/CMakeTmp'
make: *** [Makefile:127: cmTC_2900e/fast] Error 2
Source file was:
#include <complex>
int main()
{
double() * std::complex<float>();
std::complex<float>() * double();
float() * std::complex<double>();
std::complex<double>() * float();
std::complex<double>() * std::complex<float>();
std::complex<float>() * std::complex<double>();
return 0;
}
Performing C++ SOURCE FILE Test DEAL_II_COMPILER_HAS_FUSE_LD_LLD failed with the following output:
Change Dir: /tmp/makepkg/deal-ii/src/build/CMakeFiles/CMakeTmp
Run Build Command(s):/usr/bin/make -f Makefile cmTC_e383d/fast && /usr/bin/make -f CMakeFiles/cmTC_e383d.dir/build.make CMakeFiles/cmTC_e383d.dir/build
make[1]: Entering directory '/tmp/makepkg/deal-ii/src/build/CMakeFiles/CMakeTmp'
Building CXX object CMakeFiles/cmTC_e383d.dir/src.cxx.o
/usr/bin/c++ -DDEAL_II_COMPILER_HAS_FUSE_LD_LLD -march=x86-64 -mtune=generic -O2 -pipe -fno-plt -Wno-unknown-pragmas -Wno-cpp -Werror -shared -fPIC -fuse-ld=lld -o CMakeFiles/cmTC_e383d.dir/src.cxx.o -c /tmp/makepkg/deal-ii/src/build/CMakeFiles/CMakeTmp/src.cxx
Linking CXX executable cmTC_e383d
/usr/bin/cmake -E cmake_link_script CMakeFiles/cmTC_e383d.dir/link.txt --verbose=1
/usr/bin/c++ -march=x86-64 -mtune=generic -O2 -pipe -fno-plt -Wno-unknown-pragmas -Wno-cpp -Werror -shared -fPIC -fuse-ld=lld -rdynamic CMakeFiles/cmTC_e383d.dir/src.cxx.o -o cmTC_e383d -Wl,-O1,--sort-common,-z,relro,-z,now
collect2: fatal error: cannot find ‘ld’
compilation terminated.
make[1]: *** [CMakeFiles/cmTC_e383d.dir/build.make:99: cmTC_e383d] Error 1
make[1]: Leaving directory '/tmp/makepkg/deal-ii/src/build/CMakeFiles/CMakeTmp'
make: *** [Makefile:127: cmTC_e383d/fast] Error 2
Source file was:
#include <iostream>
void foo() { std::cout << "Hello, world!" << std::endl; }
Performing C++ SOURCE FILE Test DEAL_II_DELETED_MOVE_CONSTRUCTOR_BUG_OK failed with the following output:
Change Dir: /tmp/makepkg/deal-ii/src/build/CMakeFiles/CMakeTmp
Run Build Command(s):/usr/bin/make -f Makefile cmTC_ce0b6/fast && /usr/bin/make -f CMakeFiles/cmTC_ce0b6.dir/build.make CMakeFiles/cmTC_ce0b6.dir/build
make[1]: Entering directory '/tmp/makepkg/deal-ii/src/build/CMakeFiles/CMakeTmp'
Building CXX object CMakeFiles/cmTC_ce0b6.dir/src.cxx.o
/usr/bin/c++ -DDEAL_II_DELETED_MOVE_CONSTRUCTOR_BUG_OK -march=x86-64 -mtune=generic -O2 -pipe -fno-plt -Wno-unknown-pragmas -Wno-cpp -O3 -DNDEBUG -o CMakeFiles/cmTC_ce0b6.dir/src.cxx.o -c /tmp/makepkg/deal-ii/src/build/CMakeFiles/CMakeTmp/src.cxx
/tmp/makepkg/deal-ii/src/build/CMakeFiles/CMakeTmp/src.cxx: In function ‘void unlucky(Maybe<int>&&)’:
/tmp/makepkg/deal-ii/src/build/CMakeFiles/CMakeTmp/src.cxx:10:66: error: use of deleted function ‘Maybe<int>::Maybe(Maybe<int>&&)’
10 | void unlucky(Maybe<int> &&x) { Maybe<int> var{(Maybe<int> &&) x}; }
| ^
/tmp/makepkg/deal-ii/src/build/CMakeFiles/CMakeTmp/src.cxx:6:29: note: ‘Maybe<int>::Maybe(Maybe<int>&&)’ is implicitly deleted because the default definition would be ill-formed:
6 | template <class T> struct Maybe {
| ^~~~~
/tmp/makepkg/deal-ii/src/build/CMakeFiles/CMakeTmp/src.cxx:6:29: error: use of deleted function ‘NonMovable::NonMovable(NonMovable&&)’
/tmp/makepkg/deal-ii/src/build/CMakeFiles/CMakeTmp/src.cxx:4:5: note: declared here
4 | NonMovable(NonMovable &&) = delete;
| ^~~~~~~~~~
make[1]: *** [CMakeFiles/cmTC_ce0b6.dir/build.make:78: CMakeFiles/cmTC_ce0b6.dir/src.cxx.o] Error 1
make[1]: Leaving directory '/tmp/makepkg/deal-ii/src/build/CMakeFiles/CMakeTmp'
make: *** [Makefile:127: cmTC_ce0b6/fast] Error 2
Source file was:
struct NonMovable {
NonMovable() = default;
NonMovable(NonMovable &&) = delete;
};
template <class T> struct Maybe {
NonMovable mMember;
template <typename U> Maybe(Maybe<U> &&) : mMember() {}
};
void unlucky(Maybe<int> &&x) { Maybe<int> var{(Maybe<int> &&) x}; }
int main() { return 0; }
Performing C SOURCE FILE Test CMAKE_HAVE_LIBC_PTHREAD failed with the following output:
Change Dir: /tmp/makepkg/deal-ii/src/build/CMakeFiles/CMakeTmp
Run Build Command(s):/usr/bin/make -f Makefile cmTC_b434a/fast && /usr/bin/make -f CMakeFiles/cmTC_b434a.dir/build.make CMakeFiles/cmTC_b434a.dir/build
make[1]: Entering directory '/tmp/makepkg/deal-ii/src/build/CMakeFiles/CMakeTmp'
Building C object CMakeFiles/cmTC_b434a.dir/src.c.o
/usr/bin/cc -DCMAKE_HAVE_LIBC_PTHREAD -O3 -DNDEBUG -o CMakeFiles/cmTC_b434a.dir/src.c.o -c /tmp/makepkg/deal-ii/src/build/CMakeFiles/CMakeTmp/src.c
Linking C executable cmTC_b434a
/usr/bin/cmake -E cmake_link_script CMakeFiles/cmTC_b434a.dir/link.txt --verbose=1
/usr/bin/cc -O3 -DNDEBUG -rdynamic CMakeFiles/cmTC_b434a.dir/src.c.o -o cmTC_b434a
/usr/bin/ld: CMakeFiles/cmTC_b434a.dir/src.c.o: in function `main':
src.c:(.text.startup+0x23): undefined reference to `pthread_create'
/usr/bin/ld: src.c:(.text.startup+0x2c): undefined reference to `pthread_detach'
/usr/bin/ld: src.c:(.text.startup+0x35): undefined reference to `pthread_cancel'
/usr/bin/ld: src.c:(.text.startup+0x40): undefined reference to `pthread_join'
collect2: error: ld returned 1 exit status
make[1]: *** [CMakeFiles/cmTC_b434a.dir/build.make:99: cmTC_b434a] Error 1
make[1]: Leaving directory '/tmp/makepkg/deal-ii/src/build/CMakeFiles/CMakeTmp'
make: *** [Makefile:127: cmTC_b434a/fast] Error 2
Source file was:
#include <pthread.h>
static void* test_func(void* data)
{
return data;
}
int main(void)
{
pthread_t thread;
pthread_create(&thread, NULL, test_func, NULL);
pthread_detach(thread);
pthread_cancel(thread);
pthread_join(thread, NULL);
pthread_atfork(NULL, NULL, NULL);
pthread_exit(NULL);
return 0;
}
Determining if the function pthread_create exists in the pthreads failed with the following output:
Change Dir: /tmp/makepkg/deal-ii/src/build/CMakeFiles/CMakeTmp
Run Build Command(s):/usr/bin/make -f Makefile cmTC_0e5bc/fast && /usr/bin/make -f CMakeFiles/cmTC_0e5bc.dir/build.make CMakeFiles/cmTC_0e5bc.dir/build
make[1]: Entering directory '/tmp/makepkg/deal-ii/src/build/CMakeFiles/CMakeTmp'
Building C object CMakeFiles/cmTC_0e5bc.dir/CheckFunctionExists.c.o
/usr/bin/cc -DCHECK_FUNCTION_EXISTS=pthread_create -O3 -DNDEBUG -o CMakeFiles/cmTC_0e5bc.dir/CheckFunctionExists.c.o -c /usr/share/cmake-3.21/Modules/CheckFunctionExists.c
Linking C executable cmTC_0e5bc
/usr/bin/cmake -E cmake_link_script CMakeFiles/cmTC_0e5bc.dir/link.txt --verbose=1
/usr/bin/cc -DCHECK_FUNCTION_EXISTS=pthread_create -O3 -DNDEBUG -rdynamic CMakeFiles/cmTC_0e5bc.dir/CheckFunctionExists.c.o -o cmTC_0e5bc -lpthreads
/usr/bin/ld: cannot find -lpthreads
collect2: error: ld returned 1 exit status
make[1]: *** [CMakeFiles/cmTC_0e5bc.dir/build.make:99: cmTC_0e5bc] Error 1
make[1]: Leaving directory '/tmp/makepkg/deal-ii/src/build/CMakeFiles/CMakeTmp'
make: *** [Makefile:127: cmTC_0e5bc/fast] Error 2
Determining if the Fortran sgemm exists failed with the following output:
Change Dir: /tmp/makepkg/deal-ii/src/build/CMakeFiles/CMakeTmp
Run Build Command(s):/usr/bin/make -f Makefile cmTC_7dbf6/fast && /usr/bin/make -f CMakeFiles/cmTC_7dbf6.dir/build.make CMakeFiles/cmTC_7dbf6.dir/build
make[1]: Entering directory '/tmp/makepkg/deal-ii/src/build/CMakeFiles/CMakeTmp'
Building Fortran object CMakeFiles/cmTC_7dbf6.dir/testFortranCompiler.f.o
/usr/bin/gfortran -O3 -DNDEBUG -O3 -c /tmp/makepkg/deal-ii/src/build/CMakeFiles/CMakeTmp/testFortranCompiler.f -o CMakeFiles/cmTC_7dbf6.dir/testFortranCompiler.f.o
Linking Fortran executable cmTC_7dbf6
/usr/bin/cmake -E cmake_link_script CMakeFiles/cmTC_7dbf6.dir/link.txt --verbose=1
/usr/bin/gfortran -O3 -DNDEBUG -O3 CMakeFiles/cmTC_7dbf6.dir/testFortranCompiler.f.o -o cmTC_7dbf6
/usr/bin/ld: CMakeFiles/cmTC_7dbf6.dir/testFortranCompiler.f.o: in function `main':
testFortranCompiler.f:(.text.startup+0x1d): undefined reference to `sgemm_'
collect2: error: ld returned 1 exit status
make[1]: *** [CMakeFiles/cmTC_7dbf6.dir/build.make:99: cmTC_7dbf6] Error 1
make[1]: Leaving directory '/tmp/makepkg/deal-ii/src/build/CMakeFiles/CMakeTmp'
make: *** [Makefile:127: cmTC_7dbf6/fast] Error 2
Performing C++ SOURCE FILE Test DEAL_II_HAS_AUTO_PTR failed with the following output:
Change Dir: /tmp/makepkg/deal-ii/src/build/CMakeFiles/CMakeTmp
Run Build Command(s):/usr/bin/make -f Makefile cmTC_4b7f6/fast && /usr/bin/make -f CMakeFiles/cmTC_4b7f6.dir/build.make CMakeFiles/cmTC_4b7f6.dir/build
make[1]: Entering directory '/tmp/makepkg/deal-ii/src/build/CMakeFiles/CMakeTmp'
Building CXX object CMakeFiles/cmTC_4b7f6.dir/src.cxx.o
/usr/bin/c++ -DDEAL_II_HAS_AUTO_PTR -march=x86-64 -mtune=generic -O2 -pipe -fno-plt -Wno-unknown-pragmas -Wno-cpp -Werror -O3 -DNDEBUG -o CMakeFiles/cmTC_4b7f6.dir/src.cxx.o -c /tmp/makepkg/deal-ii/src/build/CMakeFiles/CMakeTmp/src.cxx
/tmp/makepkg/deal-ii/src/build/CMakeFiles/CMakeTmp/src.cxx: In function ‘int main()’:
/tmp/makepkg/deal-ii/src/build/CMakeFiles/CMakeTmp/src.cxx:9:12: error: ‘template<class> class std::auto_ptr’ is deprecated: use 'std::unique_ptr' instead [-Werror=deprecated-declarations]
9 | std::auto_ptr<int> x(i);
| ^~~~~~~~
In file included from /usr/include/c++/11.1.0/memory:76,
from /tmp/makepkg/deal-ii/src/build/CMakeFiles/CMakeTmp/src.cxx:2:
/usr/include/c++/11.1.0/bits/unique_ptr.h:57:28: note: declared here
57 | template<typename> class auto_ptr;
| ^~~~~~~~
cc1plus: all warnings being treated as errors
make[1]: *** [CMakeFiles/cmTC_4b7f6.dir/build.make:78: CMakeFiles/cmTC_4b7f6.dir/src.cxx.o] Error 1
make[1]: Leaving directory '/tmp/makepkg/deal-ii/src/build/CMakeFiles/CMakeTmp'
make: *** [Makefile:127: cmTC_4b7f6/fast] Error 2
Source file was:
#include <memory>
#include <boost/config.hpp>
int main()
{
#ifndef BOOST_NO_AUTO_PTR
int *i = new int;
std::auto_ptr<int> x(i);
#endif
return 0;
}
Determining if the KOKKOS_ENABLE_CUDA_LAMBDA exist failed with the following output:
Change Dir: /tmp/makepkg/deal-ii/src/build/CMakeFiles/CMakeTmp
Run Build Command(s):/usr/bin/make -f Makefile cmTC_65950/fast && /usr/bin/make -f CMakeFiles/cmTC_65950.dir/build.make CMakeFiles/cmTC_65950.dir/build
make[1]: Entering directory '/tmp/makepkg/deal-ii/src/build/CMakeFiles/CMakeTmp'
Building C object CMakeFiles/cmTC_65950.dir/CheckSymbolExists.c.o
/usr/bin/cc -march=x86-64 -mtune=generic -O2 -pipe -fno-plt -Wno-unknown-pragmas -Wno-cpp -O3 -DNDEBUG -o CMakeFiles/cmTC_65950.dir/CheckSymbolExists.c.o -c /tmp/makepkg/deal-ii/src/build/CMakeFiles/CMakeTmp/CheckSymbolExists.c
/tmp/makepkg/deal-ii/src/build/CMakeFiles/CMakeTmp/CheckSymbolExists.c: In function ‘main’:
/tmp/makepkg/deal-ii/src/build/CMakeFiles/CMakeTmp/CheckSymbolExists.c:8:19: error: ‘KOKKOS_ENABLE_CUDA_LAMBDA’ undeclared (first use in this function); did you mean ‘KOKKOS_ENABLE_TASKDAG’?
8 | return ((int*)(&KOKKOS_ENABLE_CUDA_LAMBDA))[argc];
| ^~~~~~~~~~~~~~~~~~~~~~~~~
| KOKKOS_ENABLE_TASKDAG
/tmp/makepkg/deal-ii/src/build/CMakeFiles/CMakeTmp/CheckSymbolExists.c:8:19: note: each undeclared identifier is reported only once for each function it appears in
make[1]: *** [CMakeFiles/cmTC_65950.dir/build.make:78: CMakeFiles/cmTC_65950.dir/CheckSymbolExists.c.o] Error 1
make[1]: Leaving directory '/tmp/makepkg/deal-ii/src/build/CMakeFiles/CMakeTmp'
make: *** [Makefile:127: cmTC_65950/fast] Error 2
File /tmp/makepkg/deal-ii/src/build/CMakeFiles/CMakeTmp/CheckSymbolExists.c:
/* */
#include <Kokkos_Macros.hpp>
int main(int argc, char** argv)
{
(void)argv;
#ifndef KOKKOS_ENABLE_CUDA_LAMBDA
return ((int*)(&KOKKOS_ENABLE_CUDA_LAMBDA))[argc];
#else
(void)argc;
return 0;
#endif
}
Performing C++ SOURCE FILE Test TRILINOS_TPETRA_IS_FUNCTIONAL failed with the following output:
Change Dir: /tmp/makepkg/deal-ii/src/build/CMakeFiles/CMakeTmp
Run Build Command(s):/usr/bin/make -f Makefile cmTC_ebf8c/fast && /usr/bin/make -f CMakeFiles/cmTC_ebf8c.dir/build.make CMakeFiles/cmTC_ebf8c.dir/build
make[1]: Entering directory '/tmp/makepkg/deal-ii/src/build/CMakeFiles/CMakeTmp'
Building CXX object CMakeFiles/cmTC_ebf8c.dir/src.cxx.o
/usr/bin/c++ -DTRILINOS_TPETRA_IS_FUNCTIONAL -march=x86-64 -mtune=generic -O2 -pipe -fno-plt -Wno-unknown-pragmas -Wno-cpp -O3 -DNDEBUG -o CMakeFiles/cmTC_ebf8c.dir/src.cxx.o -c /tmp/makepkg/deal-ii/src/build/CMakeFiles/CMakeTmp/src.cxx
Linking CXX executable cmTC_ebf8c
/usr/bin/cmake -E cmake_link_script CMakeFiles/cmTC_ebf8c.dir/link.txt --verbose=1
/usr/bin/c++ -march=x86-64 -mtune=generic -O2 -pipe -fno-plt -Wno-unknown-pragmas -Wno-cpp -O3 -DNDEBUG -rdynamic CMakeFiles/cmTC_ebf8c.dir/src.cxx.o -o cmTC_ebf8c -Wl,-rpath,/usr/lib/openmpi -Wl,-O1,--sort-common,-z,relro,-z,now /usr/lib/libpike-blackbox.so.12.18.1 /usr/lib/libtrilinoscouplings.so.12.18.1 /usr/lib/libpanzer-mini-fe.so.12.18.1 /usr/lib/libpanzer-stk.so.12.18.1 /usr/lib/libpanzer-disc-fe.so.12.18.1 /usr/lib/libpanzer-dof-mgr.so.12.18.1 /usr/lib/libpanzer-core.so.12.18.1 /usr/lib/libpiro.so.12.18.1 /usr/lib/librol.so.12.18.1 /usr/lib/libstokhos_muelu.so.12.18.1 /usr/lib/libstokhos_ifpack2.so.12.18.1 /usr/lib/libstokhos_amesos2.so.12.18.1 /usr/lib/libstokhos_xpetra.so.12.18.1 /usr/lib/libstokhos_tpetra.so.12.18.1 /usr/lib/libstokhos_sacado.so.12.18.1 /usr/lib/libstokhos.so.12.18.1 /usr/lib/libtempus.so.12.18.1 /usr/lib/librythmos.so.12.18.1 /usr/lib/libshylu_ddcommon.so.12.18.1 /usr/lib/libshylu_ddfrosch.so.12.18.1 /usr/lib/libshylu_ddbddc.so.12.18.1 /usr/lib/libmuelu-adapters.so.12.18.1 /usr/lib/libmuelu-interface.so.12.18.1 /usr/lib/libmuelu.so.12.18.1 /usr/lib/libmoertel.so.12.18.1 /usr/lib/liblocathyra.so.12.18.1 /usr/lib/liblocaepetra.so.12.18.1 /usr/lib/liblocalapack.so.12.18.1 /usr/lib/libloca.so.12.18.1 /usr/lib/libnoxepetra.so.12.18.1 /usr/lib/libnoxlapack.so.12.18.1 /usr/lib/libnox.so.12.18.1 /usr/lib/libphalanx.so.12.18.1 /usr/lib/libpercept.so.12.18.1 /usr/lib/libstk_expreval.so.12.18.1 /usr/lib/libstk_balance_test_utils.so.12.18.1 /usr/lib/libstk_balance_lib.so.12.18.1 /usr/lib/libstk_tools_lib.so.12.18.1 /usr/lib/libstk_transfer_utils_lib.so.12.18.1 /usr/lib/libstk_transfer_impl.so.12.18.1 /usr/lib/libstk_search_util_base.so.12.18.1 /usr/lib/libstk_search.so.12.18.1 /usr/lib/libstk_unit_test_utils.so.12.18.1 /usr/lib/libstk_mesh_fixtures.so.12.18.1 /usr/lib/libstk_ngp_test.so.12.18.1 /usr/lib/libstk_io_util.so.12.18.1 /usr/lib/libstk_io.so.12.18.1 /usr/lib/libstk_ngp.so.12.18.1 /usr/lib/libstk_mesh_base.so.12.18.1 /usr/lib/libstk_topology.so.12.18.1 /usr/lib/libstk_util_diag.so.12.18.1 /usr/lib/libstk_util_env.so.12.18.1 /usr/lib/libstk_util_command_line.so.12.18.1 /usr/lib/libstk_util_registry.so.12.18.1 /usr/lib/libstk_util_parallel.so.12.18.1 /usr/lib/libstk_util_util.so.12.18.1 /usr/lib/libstk_math.so.12.18.1 /usr/lib/libintrepid2.so.12.18.1 /usr/lib/libintrepid.so.12.18.1 /usr/lib/libteko.so.12.18.1 /usr/lib/libfei_trilinos.so.12.18.1 /usr/lib/libfei_base.so.12.18.1 /usr/lib/libstratimikos.so.12.18.1 /usr/lib/libstratimikosbelos.so.12.18.1 /usr/lib/libstratimikosamesos2.so.12.18.1 /usr/lib/libstratimikosaztecoo.so.12.18.1 /usr/lib/libstratimikosamesos.so.12.18.1 /usr/lib/libstratimikosml.so.12.18.1 /usr/lib/libstratimikosifpack.so.12.18.1 /usr/lib/libifpack2-adapters.so.12.18.1 /usr/lib/libifpack2.so.12.18.1 /usr/lib/libanasazitpetra.so.12.18.1 /usr/lib/libModeLaplace.so.12.18.1 /usr/lib/libanasaziepetra.so.12.18.1 /usr/lib/libanasazi.so.12.18.1 /usr/lib/libkomplex.so.12.18.1 /usr/lib/libmapvarlib.so.12.18.1 /usr/lib/libfastqlib.a /usr/lib/libblotlib.a /usr/lib/libplt.a /usr/lib/libsvdi_cgi.a /usr/lib/libsvdi_cdr.a /usr/lib/libsuplib.so.12.18.1 /usr/lib/libsuplib_c.so.12.18.1 /usr/lib/libsuplib_cpp.so.12.18.1 /usr/lib/libsupes.so.12.18.1 /usr/lib/libaprepro_lib.so.12.18.1 /usr/lib/libchaco.so.12.18.1 /usr/lib/libio_info_lib.so.12.18.1 /usr/lib/libIonit.so.12.18.1 /usr/lib/libIotr.so.12.18.1 /usr/lib/libIohb.so.12.18.1 /usr/lib/libIogs.so.12.18.1 /usr/lib/libIogn.so.12.18.1 /usr/lib/libIovs.so.12.18.1 /usr/lib/libIopg.so.12.18.1 /usr/lib/libIoexo_fac.so.12.18.1 /usr/lib/libIofx.so.12.18.1 /usr/lib/libIoex.so.12.18.1 /usr/lib/libIoss.so.12.18.1 /usr/lib/libnemesis.so.12.18.1 /usr/lib/libexoIIv2for32.so.12.18.1 /usr/lib/libexodus_for.so.12.18.1 /usr/lib/libexodus.so.12.18.1 /usr/lib/libamesos2.so.12.18.1 /usr/lib/libshylu_nodetacho.so.12.18.1 /usr/lib/libshylu_nodehts.so.12.18.1 /usr/lib/libbelosxpetra.so.12.18.1 /usr/lib/libbelostpetra.so.12.18.1 /usr/lib/libbelosepetra.so.12.18.1 /usr/lib/libbelos.so.12.18.1 /usr/lib/libml.so.12.18.1 /usr/lib/libifpack.so.12.18.1 /usr/lib/libzoltan2.so.12.18.1 /usr/lib/libpamgen_extras.so.12.18.1 /usr/lib/libpamgen.so.12.18.1 /usr/lib/libamesos.so.12.18.1 /usr/lib/libgaleri-xpetra.so.12.18.1 /usr/lib/libgaleri-epetra.so.12.18.1 /usr/lib/libaztecoo.so.12.18.1 /usr/lib/libdpliris.so.12.18.1 /usr/lib/libisorropia.so.12.18.1 /usr/lib/liboptipack.so.12.18.1 /usr/lib/libxpetra-sup.so.12.18.1 /usr/lib/libxpetra.so.12.18.1 /usr/lib/libthyratpetra.so.12.18.1 /usr/lib/libthyraepetraext.so.12.18.1 /usr/lib/libthyraepetra.so.12.18.1 /usr/lib/libthyracore.so.12.18.1 /usr/lib/libdomi.so.12.18.1 /usr/lib/libtrilinosss.so.12.18.1 /usr/lib/libtpetraext.so.12.18.1 /usr/lib/libtpetrainout.so.12.18.1 /usr/lib/libtpetra.so.12.18.1 /usr/lib/libkokkostsqr.so.12.18.1 /usr/lib/libtpetraclassiclinalg.so.12.18.1 /usr/lib/libtpetraclassicnodeapi.so.12.18.1 /usr/lib/libtpetraclassic.so.12.18.1 /usr/lib/libepetraext.so.12.18.1 /usr/lib/libtriutils.so.12.18.1 /usr/lib/libglobipack.so.12.18.1 /usr/lib/libshards.so.12.18.1 /usr/lib/libzoltan.so.12.18.1 /usr/lib/libepetra.so.12.18.1 /usr/lib/libminitensor.so.12.18.1 /usr/lib/libsacado.so.12.18.1 /usr/lib/librtop.so.12.18.1 /usr/lib/libkokkoskernels.so.12.18.1 /usr/lib/libteuchoskokkoscomm.so.12.18.1 /usr/lib/libteuchoskokkoscompat.so.12.18.1 /usr/lib/libteuchosremainder.so.12.18.1 /usr/lib/libteuchosnumerics.so.12.18.1 /usr/lib/libteuchoscomm.so.12.18.1 /usr/lib/libteuchosparameterlist.so.12.18.1 /usr/lib/libteuchosparser.so.12.18.1 /usr/lib/libteuchoscore.so.12.18.1 /usr/lib/libkokkosalgorithms.so.12.18.1 /usr/lib/libkokkoscontainers.so.12.18.1 /usr/lib/libkokkoscore.so.12.18.1 /usr/lib/libgtest.so.12.18.1 /usr/lib/openmpi/libmpi_cxx.so /usr/lib/openmpi/libmpi_usempif08.so /usr/lib/openmpi/libmpi_usempi_ignore_tkr.so /usr/lib/openmpi/libmpi_mpifh.so /usr/lib/openmpi/libmpi.so /usr/lib/libgtest.so /usr/lib/libboost_program_options.so /usr/lib/libboost_system.so /usr/lib/libX11.so -lm /usr/lib/libhdf5.so /usr/lib/libsz.so /usr/lib/libz.so -lm /usr/lib/libnetcdf.so /usr/lib/liblapack.so /usr/lib/libblas.so /usr/lib/libdl.so
/usr/bin/ld: warning: libboost_program_options.so.1.72.0, needed by /usr/lib/libstk_balance_lib.so.12.18.1, not found (try using -rpath or -rpath-link)
/usr/bin/ld: /usr/lib/libpanzer-disc-fe.so.12.18.1: undefined reference to `panzer::getIntegrationRuleIndex(int, panzer::Workset const&, panzer::WorksetDetailsAccessor&)'
collect2: error: ld returned 1 exit status
make[1]: *** [CMakeFiles/cmTC_ebf8c.dir/build.make:276: cmTC_ebf8c] Error 1
make[1]: Leaving directory '/tmp/makepkg/deal-ii/src/build/CMakeFiles/CMakeTmp'
make: *** [Makefile:127: cmTC_ebf8c/fast] Error 2
Source file was:
#include <Tpetra_Vector.hpp>
int
main()
{
using LO = int;
using GO = unsigned int;
using Node = Kokkos::Compat::KokkosDeviceWrapperNode<Kokkos::Serial>;
using map_type = Tpetra::Map<LO, GO, Node>;
Teuchos::RCP<const map_type> dummy_map = Teuchos::rcp(new map_type());
Tpetra::Vector<double, LO, GO, Node> dummy_vector(dummy_map);
(void)dummy_vector;
return 0;
}
Performing C++ SOURCE FILE Test TRILINOS_MUELU_IS_FUNCTIONAL failed with the following output:
Change Dir: /tmp/makepkg/deal-ii/src/build/CMakeFiles/CMakeTmp
Run Build Command(s):/usr/bin/make -f Makefile cmTC_54a74/fast && /usr/bin/make -f CMakeFiles/cmTC_54a74.dir/build.make CMakeFiles/cmTC_54a74.dir/build
make[1]: Entering directory '/tmp/makepkg/deal-ii/src/build/CMakeFiles/CMakeTmp'
Building CXX object CMakeFiles/cmTC_54a74.dir/src.cxx.o
/usr/bin/c++ -DTRILINOS_MUELU_IS_FUNCTIONAL -march=x86-64 -mtune=generic -O2 -pipe -fno-plt -Wno-unknown-pragmas -Wno-cpp -O3 -DNDEBUG -o CMakeFiles/cmTC_54a74.dir/src.cxx.o -c /tmp/makepkg/deal-ii/src/build/CMakeFiles/CMakeTmp/src.cxx
Linking CXX executable cmTC_54a74
/usr/bin/cmake -E cmake_link_script CMakeFiles/cmTC_54a74.dir/link.txt --verbose=1
/usr/bin/c++ -march=x86-64 -mtune=generic -O2 -pipe -fno-plt -Wno-unknown-pragmas -Wno-cpp -O3 -DNDEBUG -rdynamic CMakeFiles/cmTC_54a74.dir/src.cxx.o -o cmTC_54a74 -Wl,-rpath,/usr/lib/openmpi -Wl,-O1,--sort-common,-z,relro,-z,now /usr/lib/libpike-blackbox.so.12.18.1 /usr/lib/libtrilinoscouplings.so.12.18.1 /usr/lib/libpanzer-mini-fe.so.12.18.1 /usr/lib/libpanzer-stk.so.12.18.1 /usr/lib/libpanzer-disc-fe.so.12.18.1 /usr/lib/libpanzer-dof-mgr.so.12.18.1 /usr/lib/libpanzer-core.so.12.18.1 /usr/lib/libpiro.so.12.18.1 /usr/lib/librol.so.12.18.1 /usr/lib/libstokhos_muelu.so.12.18.1 /usr/lib/libstokhos_ifpack2.so.12.18.1 /usr/lib/libstokhos_amesos2.so.12.18.1 /usr/lib/libstokhos_xpetra.so.12.18.1 /usr/lib/libstokhos_tpetra.so.12.18.1 /usr/lib/libstokhos_sacado.so.12.18.1 /usr/lib/libstokhos.so.12.18.1 /usr/lib/libtempus.so.12.18.1 /usr/lib/librythmos.so.12.18.1 /usr/lib/libshylu_ddcommon.so.12.18.1 /usr/lib/libshylu_ddfrosch.so.12.18.1 /usr/lib/libshylu_ddbddc.so.12.18.1 /usr/lib/libmuelu-adapters.so.12.18.1 /usr/lib/libmuelu-interface.so.12.18.1 /usr/lib/libmuelu.so.12.18.1 /usr/lib/libmoertel.so.12.18.1 /usr/lib/liblocathyra.so.12.18.1 /usr/lib/liblocaepetra.so.12.18.1 /usr/lib/liblocalapack.so.12.18.1 /usr/lib/libloca.so.12.18.1 /usr/lib/libnoxepetra.so.12.18.1 /usr/lib/libnoxlapack.so.12.18.1 /usr/lib/libnox.so.12.18.1 /usr/lib/libphalanx.so.12.18.1 /usr/lib/libpercept.so.12.18.1 /usr/lib/libstk_expreval.so.12.18.1 /usr/lib/libstk_balance_test_utils.so.12.18.1 /usr/lib/libstk_balance_lib.so.12.18.1 /usr/lib/libstk_tools_lib.so.12.18.1 /usr/lib/libstk_transfer_utils_lib.so.12.18.1 /usr/lib/libstk_transfer_impl.so.12.18.1 /usr/lib/libstk_search_util_base.so.12.18.1 /usr/lib/libstk_search.so.12.18.1 /usr/lib/libstk_unit_test_utils.so.12.18.1 /usr/lib/libstk_mesh_fixtures.so.12.18.1 /usr/lib/libstk_ngp_test.so.12.18.1 /usr/lib/libstk_io_util.so.12.18.1 /usr/lib/libstk_io.so.12.18.1 /usr/lib/libstk_ngp.so.12.18.1 /usr/lib/libstk_mesh_base.so.12.18.1 /usr/lib/libstk_topology.so.12.18.1 /usr/lib/libstk_util_diag.so.12.18.1 /usr/lib/libstk_util_env.so.12.18.1 /usr/lib/libstk_util_command_line.so.12.18.1 /usr/lib/libstk_util_registry.so.12.18.1 /usr/lib/libstk_util_parallel.so.12.18.1 /usr/lib/libstk_util_util.so.12.18.1 /usr/lib/libstk_math.so.12.18.1 /usr/lib/libintrepid2.so.12.18.1 /usr/lib/libintrepid.so.12.18.1 /usr/lib/libteko.so.12.18.1 /usr/lib/libfei_trilinos.so.12.18.1 /usr/lib/libfei_base.so.12.18.1 /usr/lib/libstratimikos.so.12.18.1 /usr/lib/libstratimikosbelos.so.12.18.1 /usr/lib/libstratimikosamesos2.so.12.18.1 /usr/lib/libstratimikosaztecoo.so.12.18.1 /usr/lib/libstratimikosamesos.so.12.18.1 /usr/lib/libstratimikosml.so.12.18.1 /usr/lib/libstratimikosifpack.so.12.18.1 /usr/lib/libifpack2-adapters.so.12.18.1 /usr/lib/libifpack2.so.12.18.1 /usr/lib/libanasazitpetra.so.12.18.1 /usr/lib/libModeLaplace.so.12.18.1 /usr/lib/libanasaziepetra.so.12.18.1 /usr/lib/libanasazi.so.12.18.1 /usr/lib/libkomplex.so.12.18.1 /usr/lib/libmapvarlib.so.12.18.1 /usr/lib/libfastqlib.a /usr/lib/libblotlib.a /usr/lib/libplt.a /usr/lib/libsvdi_cgi.a /usr/lib/libsvdi_cdr.a /usr/lib/libsuplib.so.12.18.1 /usr/lib/libsuplib_c.so.12.18.1 /usr/lib/libsuplib_cpp.so.12.18.1 /usr/lib/libsupes.so.12.18.1 /usr/lib/libaprepro_lib.so.12.18.1 /usr/lib/libchaco.so.12.18.1 /usr/lib/libio_info_lib.so.12.18.1 /usr/lib/libIonit.so.12.18.1 /usr/lib/libIotr.so.12.18.1 /usr/lib/libIohb.so.12.18.1 /usr/lib/libIogs.so.12.18.1 /usr/lib/libIogn.so.12.18.1 /usr/lib/libIovs.so.12.18.1 /usr/lib/libIopg.so.12.18.1 /usr/lib/libIoexo_fac.so.12.18.1 /usr/lib/libIofx.so.12.18.1 /usr/lib/libIoex.so.12.18.1 /usr/lib/libIoss.so.12.18.1 /usr/lib/libnemesis.so.12.18.1 /usr/lib/libexoIIv2for32.so.12.18.1 /usr/lib/libexodus_for.so.12.18.1 /usr/lib/libexodus.so.12.18.1 /usr/lib/libamesos2.so.12.18.1 /usr/lib/libshylu_nodetacho.so.12.18.1 /usr/lib/libshylu_nodehts.so.12.18.1 /usr/lib/libbelosxpetra.so.12.18.1 /usr/lib/libbelostpetra.so.12.18.1 /usr/lib/libbelosepetra.so.12.18.1 /usr/lib/libbelos.so.12.18.1 /usr/lib/libml.so.12.18.1 /usr/lib/libifpack.so.12.18.1 /usr/lib/libzoltan2.so.12.18.1 /usr/lib/libpamgen_extras.so.12.18.1 /usr/lib/libpamgen.so.12.18.1 /usr/lib/libamesos.so.12.18.1 /usr/lib/libgaleri-xpetra.so.12.18.1 /usr/lib/libgaleri-epetra.so.12.18.1 /usr/lib/libaztecoo.so.12.18.1 /usr/lib/libdpliris.so.12.18.1 /usr/lib/libisorropia.so.12.18.1 /usr/lib/liboptipack.so.12.18.1 /usr/lib/libxpetra-sup.so.12.18.1 /usr/lib/libxpetra.so.12.18.1 /usr/lib/libthyratpetra.so.12.18.1 /usr/lib/libthyraepetraext.so.12.18.1 /usr/lib/libthyraepetra.so.12.18.1 /usr/lib/libthyracore.so.12.18.1 /usr/lib/libdomi.so.12.18.1 /usr/lib/libtrilinosss.so.12.18.1 /usr/lib/libtpetraext.so.12.18.1 /usr/lib/libtpetrainout.so.12.18.1 /usr/lib/libtpetra.so.12.18.1 /usr/lib/libkokkostsqr.so.12.18.1 /usr/lib/libtpetraclassiclinalg.so.12.18.1 /usr/lib/libtpetraclassicnodeapi.so.12.18.1 /usr/lib/libtpetraclassic.so.12.18.1 /usr/lib/libepetraext.so.12.18.1 /usr/lib/libtriutils.so.12.18.1 /usr/lib/libglobipack.so.12.18.1 /usr/lib/libshards.so.12.18.1 /usr/lib/libzoltan.so.12.18.1 /usr/lib/libepetra.so.12.18.1 /usr/lib/libminitensor.so.12.18.1 /usr/lib/libsacado.so.12.18.1 /usr/lib/librtop.so.12.18.1 /usr/lib/libkokkoskernels.so.12.18.1 /usr/lib/libteuchoskokkoscomm.so.12.18.1 /usr/lib/libteuchoskokkoscompat.so.12.18.1 /usr/lib/libteuchosremainder.so.12.18.1 /usr/lib/libteuchosnumerics.so.12.18.1 /usr/lib/libteuchoscomm.so.12.18.1 /usr/lib/libteuchosparameterlist.so.12.18.1 /usr/lib/libteuchosparser.so.12.18.1 /usr/lib/libteuchoscore.so.12.18.1 /usr/lib/libkokkosalgorithms.so.12.18.1 /usr/lib/libkokkoscontainers.so.12.18.1 /usr/lib/libkokkoscore.so.12.18.1 /usr/lib/libgtest.so.12.18.1 /usr/lib/openmpi/libmpi_cxx.so /usr/lib/openmpi/libmpi_usempif08.so /usr/lib/openmpi/libmpi_usempi_ignore_tkr.so /usr/lib/openmpi/libmpi_mpifh.so /usr/lib/openmpi/libmpi.so /usr/lib/libgtest.so /usr/lib/libboost_program_options.so /usr/lib/libboost_system.so /usr/lib/libX11.so -lm /usr/lib/libhdf5.so /usr/lib/libsz.so /usr/lib/libz.so -lm /usr/lib/libnetcdf.so /usr/lib/liblapack.so /usr/lib/libblas.so /usr/lib/libdl.so
/usr/bin/ld: warning: libboost_program_options.so.1.72.0, needed by /usr/lib/libstk_balance_lib.so.12.18.1, not found (try using -rpath or -rpath-link)
/usr/bin/ld: /usr/lib/libpanzer-disc-fe.so.12.18.1: undefined reference to `panzer::getIntegrationRuleIndex(int, panzer::Workset const&, panzer::WorksetDetailsAccessor&)'
collect2: error: ld returned 1 exit status
make[1]: *** [CMakeFiles/cmTC_54a74.dir/build.make:276: cmTC_54a74] Error 1
make[1]: Leaving directory '/tmp/makepkg/deal-ii/src/build/CMakeFiles/CMakeTmp'
make: *** [Makefile:127: cmTC_54a74/fast] Error 2
Source file was:
#include <MueLu_CreateEpetraPreconditioner.hpp>
int
main()
{
Epetra_CrsMatrix *matrix;
const auto teuchos_wrapped_matrix = Teuchos::rcp(matrix, false);
Teuchos::ParameterList parameters;
MueLu::CreateEpetraPreconditioner(teuchos_wrapped_matrix, parameters);
return 0;
}
Performing C++ SOURCE FILE Test TRILINOS_SEACAS_IS_FUNCTIONAL failed with the following output:
Change Dir: /tmp/makepkg/deal-ii/src/build/CMakeFiles/CMakeTmp
Run Build Command(s):/usr/bin/make -f Makefile cmTC_48ff9/fast && /usr/bin/make -f CMakeFiles/cmTC_48ff9.dir/build.make CMakeFiles/cmTC_48ff9.dir/build
make[1]: Entering directory '/tmp/makepkg/deal-ii/src/build/CMakeFiles/CMakeTmp'
Building CXX object CMakeFiles/cmTC_48ff9.dir/src.cxx.o
/usr/bin/c++ -DTRILINOS_SEACAS_IS_FUNCTIONAL -march=x86-64 -mtune=generic -O2 -pipe -fno-plt -Wno-unknown-pragmas -Wno-cpp -O3 -DNDEBUG -o CMakeFiles/cmTC_48ff9.dir/src.cxx.o -c /tmp/makepkg/deal-ii/src/build/CMakeFiles/CMakeTmp/src.cxx
Linking CXX executable cmTC_48ff9
/usr/bin/cmake -E cmake_link_script CMakeFiles/cmTC_48ff9.dir/link.txt --verbose=1
/usr/bin/c++ -march=x86-64 -mtune=generic -O2 -pipe -fno-plt -Wno-unknown-pragmas -Wno-cpp -O3 -DNDEBUG -rdynamic CMakeFiles/cmTC_48ff9.dir/src.cxx.o -o cmTC_48ff9 -Wl,-O1,--sort-common,-z,relro,-z,now /usr/lib/libpike-blackbox.so.12.18.1 /usr/lib/libtrilinoscouplings.so.12.18.1 /usr/lib/libpanzer-mini-fe.so.12.18.1 /usr/lib/libpanzer-stk.so.12.18.1 /usr/lib/libpanzer-disc-fe.so.12.18.1 /usr/lib/libpanzer-dof-mgr.so.12.18.1 /usr/lib/libpanzer-core.so.12.18.1 /usr/lib/libpiro.so.12.18.1 /usr/lib/librol.so.12.18.1 /usr/lib/libstokhos_muelu.so.12.18.1 /usr/lib/libstokhos_ifpack2.so.12.18.1 /usr/lib/libstokhos_amesos2.so.12.18.1 /usr/lib/libstokhos_xpetra.so.12.18.1 /usr/lib/libstokhos_tpetra.so.12.18.1 /usr/lib/libstokhos_sacado.so.12.18.1 /usr/lib/libstokhos.so.12.18.1 /usr/lib/libtempus.so.12.18.1 /usr/lib/librythmos.so.12.18.1 /usr/lib/libshylu_ddcommon.so.12.18.1 /usr/lib/libshylu_ddfrosch.so.12.18.1 /usr/lib/libshylu_ddbddc.so.12.18.1 /usr/lib/libmuelu-adapters.so.12.18.1 /usr/lib/libmuelu-interface.so.12.18.1 /usr/lib/libmuelu.so.12.18.1 /usr/lib/libmoertel.so.12.18.1 /usr/lib/liblocathyra.so.12.18.1 /usr/lib/liblocaepetra.so.12.18.1 /usr/lib/liblocalapack.so.12.18.1 /usr/lib/libloca.so.12.18.1 /usr/lib/libnoxepetra.so.12.18.1 /usr/lib/libnoxlapack.so.12.18.1 /usr/lib/libnox.so.12.18.1 /usr/lib/libphalanx.so.12.18.1 /usr/lib/libpercept.so.12.18.1 /usr/lib/libstk_expreval.so.12.18.1 /usr/lib/libstk_balance_test_utils.so.12.18.1 /usr/lib/libstk_balance_lib.so.12.18.1 /usr/lib/libstk_tools_lib.so.12.18.1 /usr/lib/libstk_transfer_utils_lib.so.12.18.1 /usr/lib/libstk_transfer_impl.so.12.18.1 /usr/lib/libstk_search_util_base.so.12.18.1 /usr/lib/libstk_search.so.12.18.1 /usr/lib/libstk_unit_test_utils.so.12.18.1 /usr/lib/libstk_mesh_fixtures.so.12.18.1 /usr/lib/libstk_ngp_test.so.12.18.1 /usr/lib/libstk_io_util.so.12.18.1 /usr/lib/libstk_io.so.12.18.1 /usr/lib/libstk_ngp.so.12.18.1 /usr/lib/libstk_mesh_base.so.12.18.1 /usr/lib/libstk_topology.so.12.18.1 /usr/lib/libstk_util_diag.so.12.18.1 /usr/lib/libstk_util_env.so.12.18.1 /usr/lib/libstk_util_command_line.so.12.18.1 /usr/lib/libstk_util_registry.so.12.18.1 /usr/lib/libstk_util_parallel.so.12.18.1 /usr/lib/libstk_util_util.so.12.18.1 /usr/lib/libstk_math.so.12.18.1 /usr/lib/libintrepid2.so.12.18.1 /usr/lib/libintrepid.so.12.18.1 /usr/lib/libteko.so.12.18.1 /usr/lib/libfei_trilinos.so.12.18.1 /usr/lib/libfei_base.so.12.18.1 /usr/lib/libstratimikos.so.12.18.1 /usr/lib/libstratimikosbelos.so.12.18.1 /usr/lib/libstratimikosamesos2.so.12.18.1 /usr/lib/libstratimikosaztecoo.so.12.18.1 /usr/lib/libstratimikosamesos.so.12.18.1 /usr/lib/libstratimikosml.so.12.18.1 /usr/lib/libstratimikosifpack.so.12.18.1 /usr/lib/libifpack2-adapters.so.12.18.1 /usr/lib/libifpack2.so.12.18.1 /usr/lib/libanasazitpetra.so.12.18.1 /usr/lib/libModeLaplace.so.12.18.1 /usr/lib/libanasaziepetra.so.12.18.1 /usr/lib/libanasazi.so.12.18.1 /usr/lib/libkomplex.so.12.18.1 /usr/lib/libmapvarlib.so.12.18.1 /usr/lib/libfastqlib.a /usr/lib/libblotlib.a /usr/lib/libplt.a /usr/lib/libsvdi_cgi.a /usr/lib/libsvdi_cdr.a /usr/lib/libsuplib.so.12.18.1 /usr/lib/libsuplib_c.so.12.18.1 /usr/lib/libsuplib_cpp.so.12.18.1 /usr/lib/libsupes.so.12.18.1 /usr/lib/libaprepro_lib.so.12.18.1 /usr/lib/libchaco.so.12.18.1 /usr/lib/libio_info_lib.so.12.18.1 /usr/lib/libIonit.so.12.18.1 /usr/lib/libIotr.so.12.18.1 /usr/lib/libIohb.so.12.18.1 /usr/lib/libIogs.so.12.18.1 /usr/lib/libIogn.so.12.18.1 /usr/lib/libIovs.so.12.18.1 /usr/lib/libIopg.so.12.18.1 /usr/lib/libIoexo_fac.so.12.18.1 /usr/lib/libIofx.so.12.18.1 /usr/lib/libIoex.so.12.18.1 /usr/lib/libIoss.so.12.18.1 /usr/lib/libnemesis.so.12.18.1 /usr/lib/libexoIIv2for32.so.12.18.1 /usr/lib/libexodus_for.so.12.18.1 /usr/lib/libexodus.so.12.18.1 /usr/lib/libamesos2.so.12.18.1 /usr/lib/libshylu_nodetacho.so.12.18.1 /usr/lib/libshylu_nodehts.so.12.18.1 /usr/lib/libbelosxpetra.so.12.18.1 /usr/lib/libbelostpetra.so.12.18.1 /usr/lib/libbelosepetra.so.12.18.1 /usr/lib/libbelos.so.12.18.1 /usr/lib/libml.so.12.18.1 /usr/lib/libifpack.so.12.18.1 /usr/lib/libzoltan2.so.12.18.1 /usr/lib/libpamgen_extras.so.12.18.1 /usr/lib/libpamgen.so.12.18.1 /usr/lib/libamesos.so.12.18.1 /usr/lib/libgaleri-xpetra.so.12.18.1 /usr/lib/libgaleri-epetra.so.12.18.1 /usr/lib/libaztecoo.so.12.18.1 /usr/lib/libdpliris.so.12.18.1 /usr/lib/libisorropia.so.12.18.1 /usr/lib/liboptipack.so.12.18.1 /usr/lib/libxpetra-sup.so.12.18.1 /usr/lib/libxpetra.so.12.18.1 /usr/lib/libthyratpetra.so.12.18.1 /usr/lib/libthyraepetraext.so.12.18.1 /usr/lib/libthyraepetra.so.12.18.1 /usr/lib/libthyracore.so.12.18.1 /usr/lib/libdomi.so.12.18.1 /usr/lib/libtrilinosss.so.12.18.1 /usr/lib/libtpetraext.so.12.18.1 /usr/lib/libtpetrainout.so.12.18.1 /usr/lib/libtpetra.so.12.18.1 /usr/lib/libkokkostsqr.so.12.18.1 /usr/lib/libtpetraclassiclinalg.so.12.18.1 /usr/lib/libtpetraclassicnodeapi.so.12.18.1 /usr/lib/libtpetraclassic.so.12.18.1 /usr/lib/libepetraext.so.12.18.1 /usr/lib/libtriutils.so.12.18.1 /usr/lib/libglobipack.so.12.18.1 /usr/lib/libshards.so.12.18.1 /usr/lib/libzoltan.so.12.18.1 /usr/lib/libepetra.so.12.18.1 /usr/lib/libminitensor.so.12.18.1 /usr/lib/libsacado.so.12.18.1 /usr/lib/librtop.so.12.18.1 /usr/lib/libkokkoskernels.so.12.18.1 /usr/lib/libteuchoskokkoscomm.so.12.18.1 /usr/lib/libteuchoskokkoscompat.so.12.18.1 /usr/lib/libteuchosremainder.so.12.18.1 /usr/lib/libteuchosnumerics.so.12.18.1 /usr/lib/libteuchoscomm.so.12.18.1 /usr/lib/libteuchosparameterlist.so.12.18.1 /usr/lib/libteuchosparser.so.12.18.1 /usr/lib/libteuchoscore.so.12.18.1 /usr/lib/libkokkosalgorithms.so.12.18.1 /usr/lib/libkokkoscontainers.so.12.18.1 /usr/lib/libkokkoscore.so.12.18.1 /usr/lib/libgtest.so.12.18.1 /usr/lib/libgtest.so /usr/lib/libboost_program_options.so /usr/lib/libboost_system.so /usr/lib/libX11.so -lm /usr/lib/libhdf5.so /usr/lib/libsz.so /usr/lib/libz.so -lm /usr/lib/libnetcdf.so /usr/lib/liblapack.so /usr/lib/libblas.so /usr/lib/libdl.so
/usr/bin/ld: warning: libboost_program_options.so.1.72.0, needed by /usr/lib/libstk_balance_lib.so.12.18.1, not found (try using -rpath or -rpath-link)
/usr/bin/ld: /usr/lib/libpanzer-disc-fe.so.12.18.1: undefined reference to `panzer::getIntegrationRuleIndex(int, panzer::Workset const&, panzer::WorksetDetailsAccessor&)'
collect2: error: ld returned 1 exit status
make[1]: *** [CMakeFiles/cmTC_48ff9.dir/build.make:271: cmTC_48ff9] Error 1
make[1]: Leaving directory '/tmp/makepkg/deal-ii/src/build/CMakeFiles/CMakeTmp'
make: *** [Makefile:127: cmTC_48ff9/fast] Error 2
Source file was:
#include <exodusII.h>
int
main()
{
int component_word_size = sizeof(double);
int floating_point_word_size = 0;
float ex_version = 0;
const int ex_id = ex_open("test.ex",
EX_READ,
&component_word_size,
&floating_point_word_size,
&ex_version);
ex_close(ex_id);
return 0;
}
The system is: Linux - 5.13.8-arch1-1 - x86_64
Compiling the CXX compiler identification source file "CMakeCXXCompilerId.cpp" succeeded.
Compiler: /usr/bin/c++
Build flags:
Id flags:
The output was:
0
Compilation of the CXX compiler identification source "CMakeCXXCompilerId.cpp" produced "a.out"
The CXX compiler identification is GNU, found in "/tmp/makepkg/deal-ii/src/build/CMakeFiles/3.21.1/CompilerIdCXX/a.out"
Compiling the C compiler identification source file "CMakeCCompilerId.c" succeeded.
Compiler: /usr/bin/cc
Build flags: -march=x86-64;-mtune=generic;-O2;-pipe;-fno-plt
Id flags:
The output was:
0
Compilation of the C compiler identification source "CMakeCCompilerId.c" produced "a.out"
The C compiler identification is GNU, found in "/tmp/makepkg/deal-ii/src/build/CMakeFiles/3.21.1/CompilerIdC/a.out"
Detecting CXX compiler ABI info compiled with the following output:
Change Dir: /tmp/makepkg/deal-ii/src/build/CMakeFiles/CMakeTmp
Run Build Command(s):/usr/bin/make -f Makefile cmTC_db745/fast && /usr/bin/make -f CMakeFiles/cmTC_db745.dir/build.make CMakeFiles/cmTC_db745.dir/build
make[1]: Entering directory '/tmp/makepkg/deal-ii/src/build/CMakeFiles/CMakeTmp'
Building CXX object CMakeFiles/cmTC_db745.dir/CMakeCXXCompilerABI.cpp.o
/usr/bin/c++ -v -o CMakeFiles/cmTC_db745.dir/CMakeCXXCompilerABI.cpp.o -c /usr/share/cmake-3.21/Modules/CMakeCXXCompilerABI.cpp
Using built-in specs.
COLLECT_GCC=/usr/bin/c++
Target: x86_64-pc-linux-gnu
Configured with: /build/gcc/src/gcc/configure --prefix=/usr --libdir=/usr/lib --libexecdir=/usr/lib --mandir=/usr/share/man --infodir=/usr/share/info --with-bugurl=https://bugs.archlinux.org/ --enable-languages=c,c++,ada,fortran,go,lto,objc,obj-c++,d --with-isl --with-linker-hash-style=gnu --with-system-zlib --enable-__cxa_atexit --enable-cet=auto --enable-checking=release --enable-clocale=gnu --enable-default-pie --enable-default-ssp --enable-gnu-indirect-function --enable-gnu-unique-object --enable-install-libiberty --enable-linker-build-id --enable-lto --enable-multilib --enable-plugin --enable-shared --enable-threads=posix --disable-libssp --disable-libstdcxx-pch --disable-libunwind-exceptions --disable-werror gdc_include_dir=/usr/include/dlang/gdc
Thread model: posix
Supported LTO compression algorithms: zlib zstd
gcc version 11.1.0 (GCC)
COLLECT_GCC_OPTIONS='-v' '-o' 'CMakeFiles/cmTC_db745.dir/CMakeCXXCompilerABI.cpp.o' '-c' '-shared-libgcc' '-mtune=generic' '-march=x86-64' '-dumpdir' 'CMakeFiles/cmTC_db745.dir/'
/usr/lib/gcc/x86_64-pc-linux-gnu/11.1.0/cc1plus -quiet -v -D_GNU_SOURCE /usr/share/cmake-3.21/Modules/CMakeCXXCompilerABI.cpp -quiet -dumpdir CMakeFiles/cmTC_db745.dir/ -dumpbase CMakeCXXCompilerABI.cpp.cpp -dumpbase-ext .cpp -mtune=generic -march=x86-64 -version -o /tmp/ccjD6o1Q.s
GNU C++17 (GCC) version 11.1.0 (x86_64-pc-linux-gnu)
compiled by GNU C version 11.1.0, GMP version 6.2.1, MPFR version 4.1.0, MPC version 1.2.1, isl version isl-0.24-GMP
warning: MPFR header version 4.1.0 differs from library version 4.1.0-p13.
GGC heuristics: --param ggc-min-expand=100 --param ggc-min-heapsize=131072
ignoring nonexistent directory "/usr/lib/gcc/x86_64-pc-linux-gnu/11.1.0/../../../../x86_64-pc-linux-gnu/include"
#include "..." search starts here:
#include <...> search starts here:
/usr/lib/gcc/x86_64-pc-linux-gnu/11.1.0/../../../../include/c++/11.1.0
/usr/lib/gcc/x86_64-pc-linux-gnu/11.1.0/../../../../include/c++/11.1.0/x86_64-pc-linux-gnu
/usr/lib/gcc/x86_64-pc-linux-gnu/11.1.0/../../../../include/c++/11.1.0/backward
/usr/lib/gcc/x86_64-pc-linux-gnu/11.1.0/include
/usr/local/include
/usr/lib/gcc/x86_64-pc-linux-gnu/11.1.0/include-fixed
/usr/include
End of search list.
GNU C++17 (GCC) version 11.1.0 (x86_64-pc-linux-gnu)
compiled by GNU C version 11.1.0, GMP version 6.2.1, MPFR version 4.1.0, MPC version 1.2.1, isl version isl-0.24-GMP
warning: MPFR header version 4.1.0 differs from library version 4.1.0-p13.
GGC heuristics: --param ggc-min-expand=100 --param ggc-min-heapsize=131072
Compiler executable checksum: 45eb9a71cc15bfdc579557bea4b77e51
COLLECT_GCC_OPTIONS='-v' '-o' 'CMakeFiles/cmTC_db745.dir/CMakeCXXCompilerABI.cpp.o' '-c' '-shared-libgcc' '-mtune=generic' '-march=x86-64' '-dumpdir' 'CMakeFiles/cmTC_db745.dir/'
as -v --64 -o CMakeFiles/cmTC_db745.dir/CMakeCXXCompilerABI.cpp.o /tmp/ccjD6o1Q.s
GNU assembler version 2.36.1 (x86_64-pc-linux-gnu) using BFD version (GNU Binutils) 2.36.1
COMPILER_PATH=/usr/lib/gcc/x86_64-pc-linux-gnu/11.1.0/:/usr/lib/gcc/x86_64-pc-linux-gnu/11.1.0/:/usr/lib/gcc/x86_64-pc-linux-gnu/:/usr/lib/gcc/x86_64-pc-linux-gnu/11.1.0/:/usr/lib/gcc/x86_64-pc-linux-gnu/
LIBRARY_PATH=/usr/lib/gcc/x86_64-pc-linux-gnu/11.1.0/:/usr/lib/gcc/x86_64-pc-linux-gnu/11.1.0/../../../../lib/:/lib/../lib/:/usr/lib/../lib/:/usr/lib/gcc/x86_64-pc-linux-gnu/11.1.0/../../../:/lib/:/usr/lib/
COLLECT_GCC_OPTIONS='-v' '-o' 'CMakeFiles/cmTC_db745.dir/CMakeCXXCompilerABI.cpp.o' '-c' '-shared-libgcc' '-mtune=generic' '-march=x86-64' '-dumpdir' 'CMakeFiles/cmTC_db745.dir/CMakeCXXCompilerABI.cpp.'
Linking CXX executable cmTC_db745
/usr/bin/cmake -E cmake_link_script CMakeFiles/cmTC_db745.dir/link.txt --verbose=1
/usr/bin/c++ -v -rdynamic CMakeFiles/cmTC_db745.dir/CMakeCXXCompilerABI.cpp.o -o cmTC_db745
Using built-in specs.
COLLECT_GCC=/usr/bin/c++
COLLECT_LTO_WRAPPER=/usr/lib/gcc/x86_64-pc-linux-gnu/11.1.0/lto-wrapper
Target: x86_64-pc-linux-gnu
Configured with: /build/gcc/src/gcc/configure --prefix=/usr --libdir=/usr/lib --libexecdir=/usr/lib --mandir=/usr/share/man --infodir=/usr/share/info --with-bugurl=https://bugs.archlinux.org/ --enable-languages=c,c++,ada,fortran,go,lto,objc,obj-c++,d --with-isl --with-linker-hash-style=gnu --with-system-zlib --enable-__cxa_atexit --enable-cet=auto --enable-checking=release --enable-clocale=gnu --enable-default-pie --enable-default-ssp --enable-gnu-indirect-function --enable-gnu-unique-object --enable-install-libiberty --enable-linker-build-id --enable-lto --enable-multilib --enable-plugin --enable-shared --enable-threads=posix --disable-libssp --disable-libstdcxx-pch --disable-libunwind-exceptions --disable-werror gdc_include_dir=/usr/include/dlang/gdc
Thread model: posix
Supported LTO compression algorithms: zlib zstd
gcc version 11.1.0 (GCC)
COMPILER_PATH=/usr/lib/gcc/x86_64-pc-linux-gnu/11.1.0/:/usr/lib/gcc/x86_64-pc-linux-gnu/11.1.0/:/usr/lib/gcc/x86_64-pc-linux-gnu/:/usr/lib/gcc/x86_64-pc-linux-gnu/11.1.0/:/usr/lib/gcc/x86_64-pc-linux-gnu/
LIBRARY_PATH=/usr/lib/gcc/x86_64-pc-linux-gnu/11.1.0/:/usr/lib/gcc/x86_64-pc-linux-gnu/11.1.0/../../../../lib/:/lib/../lib/:/usr/lib/../lib/:/usr/lib/gcc/x86_64-pc-linux-gnu/11.1.0/../../../:/lib/:/usr/lib/
COLLECT_GCC_OPTIONS='-v' '-rdynamic' '-o' 'cmTC_db745' '-shared-libgcc' '-mtune=generic' '-march=x86-64' '-dumpdir' 'cmTC_db745.'
/usr/lib/gcc/x86_64-pc-linux-gnu/11.1.0/collect2 -plugin /usr/lib/gcc/x86_64-pc-linux-gnu/11.1.0/liblto_plugin.so -plugin-opt=/usr/lib/gcc/x86_64-pc-linux-gnu/11.1.0/lto-wrapper -plugin-opt=-fresolution=/tmp/ccbPvVwg.res -plugin-opt=-pass-through=-lgcc_s -plugin-opt=-pass-through=-lgcc -plugin-opt=-pass-through=-lc -plugin-opt=-pass-through=-lgcc_s -plugin-opt=-pass-through=-lgcc --build-id --eh-frame-hdr --hash-style=gnu -m elf_x86_64 -export-dynamic -dynamic-linker /lib64/ld-linux-x86-64.so.2 -pie -o cmTC_db745 /usr/lib/gcc/x86_64-pc-linux-gnu/11.1.0/../../../../lib/Scrt1.o /usr/lib/gcc/x86_64-pc-linux-gnu/11.1.0/../../../../lib/crti.o /usr/lib/gcc/x86_64-pc-linux-gnu/11.1.0/crtbeginS.o -L/usr/lib/gcc/x86_64-pc-linux-gnu/11.1.0 -L/usr/lib/gcc/x86_64-pc-linux-gnu/11.1.0/../../../../lib -L/lib/../lib -L/usr/lib/../lib -L/usr/lib/gcc/x86_64-pc-linux-gnu/11.1.0/../../.. CMakeFiles/cmTC_db745.dir/CMakeCXXCompilerABI.cpp.o -lstdc++ -lm -lgcc_s -lgcc -lc -lgcc_s -lgcc /usr/lib/gcc/x86_64-pc-linux-gnu/11.1.0/crtendS.o /usr/lib/gcc/x86_64-pc-linux-gnu/11.1.0/../../../../lib/crtn.o
COLLECT_GCC_OPTIONS='-v' '-rdynamic' '-o' 'cmTC_db745' '-shared-libgcc' '-mtune=generic' '-march=x86-64' '-dumpdir' 'cmTC_db745.'
make[1]: Leaving directory '/tmp/makepkg/deal-ii/src/build/CMakeFiles/CMakeTmp'
Parsed CXX implicit include dir info from above output: rv=done
found start of include info
found start of implicit include info
add: [/usr/lib/gcc/x86_64-pc-linux-gnu/11.1.0/../../../../include/c++/11.1.0]
add: [/usr/lib/gcc/x86_64-pc-linux-gnu/11.1.0/../../../../include/c++/11.1.0/x86_64-pc-linux-gnu]
add: [/usr/lib/gcc/x86_64-pc-linux-gnu/11.1.0/../../../../include/c++/11.1.0/backward]
add: [/usr/lib/gcc/x86_64-pc-linux-gnu/11.1.0/include]
add: [/usr/local/include]
add: [/usr/lib/gcc/x86_64-pc-linux-gnu/11.1.0/include-fixed]
add: [/usr/include]
end of search list found
collapse include dir [/usr/lib/gcc/x86_64-pc-linux-gnu/11.1.0/../../../../include/c++/11.1.0] ==> [/usr/include/c++/11.1.0]
collapse include dir [/usr/lib/gcc/x86_64-pc-linux-gnu/11.1.0/../../../../include/c++/11.1.0/x86_64-pc-linux-gnu] ==> [/usr/include/c++/11.1.0/x86_64-pc-linux-gnu]
collapse include dir [/usr/lib/gcc/x86_64-pc-linux-gnu/11.1.0/../../../../include/c++/11.1.0/backward] ==> [/usr/include/c++/11.1.0/backward]
collapse include dir [/usr/lib/gcc/x86_64-pc-linux-gnu/11.1.0/include] ==> [/usr/lib/gcc/x86_64-pc-linux-gnu/11.1.0/include]
collapse include dir [/usr/local/include] ==> [/usr/local/include]
collapse include dir [/usr/lib/gcc/x86_64-pc-linux-gnu/11.1.0/include-fixed] ==> [/usr/lib/gcc/x86_64-pc-linux-gnu/11.1.0/include-fixed]
collapse include dir [/usr/include] ==> [/usr/include]
implicit include dirs: [/usr/include/c++/11.1.0;/usr/include/c++/11.1.0/x86_64-pc-linux-gnu;/usr/include/c++/11.1.0/backward;/usr/lib/gcc/x86_64-pc-linux-gnu/11.1.0/include;/usr/local/include;/usr/lib/gcc/x86_64-pc-linux-gnu/11.1.0/include-fixed;/usr/include]
Parsed CXX implicit link information from above output:
link line regex: [^( *|.*[/\])(ld|CMAKE_LINK_STARTFILE-NOTFOUND|([^/\]+-)?ld|collect2)[^/\]*( |$)]
ignore line: [Change Dir: /tmp/makepkg/deal-ii/src/build/CMakeFiles/CMakeTmp]
ignore line: []
ignore line: [Run Build Command(s):/usr/bin/make -f Makefile cmTC_db745/fast && /usr/bin/make -f CMakeFiles/cmTC_db745.dir/build.make CMakeFiles/cmTC_db745.dir/build]
ignore line: [make[1]: Entering directory '/tmp/makepkg/deal-ii/src/build/CMakeFiles/CMakeTmp']
ignore line: [Building CXX object CMakeFiles/cmTC_db745.dir/CMakeCXXCompilerABI.cpp.o]
ignore line: [/usr/bin/c++ -v -o CMakeFiles/cmTC_db745.dir/CMakeCXXCompilerABI.cpp.o -c /usr/share/cmake-3.21/Modules/CMakeCXXCompilerABI.cpp]
ignore line: [Using built-in specs.]
ignore line: [COLLECT_GCC=/usr/bin/c++]
ignore line: [Target: x86_64-pc-linux-gnu]
ignore line: [Configured with: /build/gcc/src/gcc/configure --prefix=/usr --libdir=/usr/lib --libexecdir=/usr/lib --mandir=/usr/share/man --infodir=/usr/share/info --with-bugurl=https://bugs.archlinux.org/ --enable-languages=c c++ ada fortran go lto objc obj-c++ d --with-isl --with-linker-hash-style=gnu --with-system-zlib --enable-__cxa_atexit --enable-cet=auto --enable-checking=release --enable-clocale=gnu --enable-default-pie --enable-default-ssp --enable-gnu-indirect-function --enable-gnu-unique-object --enable-install-libiberty --enable-linker-build-id --enable-lto --enable-multilib --enable-plugin --enable-shared --enable-threads=posix --disable-libssp --disable-libstdcxx-pch --disable-libunwind-exceptions --disable-werror gdc_include_dir=/usr/include/dlang/gdc]
ignore line: [Thread model: posix]
ignore line: [Supported LTO compression algorithms: zlib zstd]
ignore line: [gcc version 11.1.0 (GCC) ]
ignore line: [COLLECT_GCC_OPTIONS='-v' '-o' 'CMakeFiles/cmTC_db745.dir/CMakeCXXCompilerABI.cpp.o' '-c' '-shared-libgcc' '-mtune=generic' '-march=x86-64' '-dumpdir' 'CMakeFiles/cmTC_db745.dir/']
ignore line: [ /usr/lib/gcc/x86_64-pc-linux-gnu/11.1.0/cc1plus -quiet -v -D_GNU_SOURCE /usr/share/cmake-3.21/Modules/CMakeCXXCompilerABI.cpp -quiet -dumpdir CMakeFiles/cmTC_db745.dir/ -dumpbase CMakeCXXCompilerABI.cpp.cpp -dumpbase-ext .cpp -mtune=generic -march=x86-64 -version -o /tmp/ccjD6o1Q.s]
ignore line: [GNU C++17 (GCC) version 11.1.0 (x86_64-pc-linux-gnu)]
ignore line: [ compiled by GNU C version 11.1.0 GMP version 6.2.1 MPFR version 4.1.0 MPC version 1.2.1 isl version isl-0.24-GMP]
ignore line: []
ignore line: [warning: MPFR header version 4.1.0 differs from library version 4.1.0-p13.]
ignore line: [GGC heuristics: --param ggc-min-expand=100 --param ggc-min-heapsize=131072]
ignore line: [ignoring nonexistent directory "/usr/lib/gcc/x86_64-pc-linux-gnu/11.1.0/../../../../x86_64-pc-linux-gnu/include"]
ignore line: [#include "..." search starts here:]
ignore line: [#include <...> search starts here:]
ignore line: [ /usr/lib/gcc/x86_64-pc-linux-gnu/11.1.0/../../../../include/c++/11.1.0]
ignore line: [ /usr/lib/gcc/x86_64-pc-linux-gnu/11.1.0/../../../../include/c++/11.1.0/x86_64-pc-linux-gnu]
ignore line: [ /usr/lib/gcc/x86_64-pc-linux-gnu/11.1.0/../../../../include/c++/11.1.0/backward]
ignore line: [ /usr/lib/gcc/x86_64-pc-linux-gnu/11.1.0/include]
ignore line: [ /usr/local/include]
ignore line: [ /usr/lib/gcc/x86_64-pc-linux-gnu/11.1.0/include-fixed]
ignore line: [ /usr/include]
ignore line: [End of search list.]
ignore line: [GNU C++17 (GCC) version 11.1.0 (x86_64-pc-linux-gnu)]
ignore line: [ compiled by GNU C version 11.1.0 GMP version 6.2.1 MPFR version 4.1.0 MPC version 1.2.1 isl version isl-0.24-GMP]
ignore line: []
ignore line: [warning: MPFR header version 4.1.0 differs from library version 4.1.0-p13.]
ignore line: [GGC heuristics: --param ggc-min-expand=100 --param ggc-min-heapsize=131072]
ignore line: [Compiler executable checksum: 45eb9a71cc15bfdc579557bea4b77e51]
ignore line: [COLLECT_GCC_OPTIONS='-v' '-o' 'CMakeFiles/cmTC_db745.dir/CMakeCXXCompilerABI.cpp.o' '-c' '-shared-libgcc' '-mtune=generic' '-march=x86-64' '-dumpdir' 'CMakeFiles/cmTC_db745.dir/']
ignore line: [ as -v --64 -o CMakeFiles/cmTC_db745.dir/CMakeCXXCompilerABI.cpp.o /tmp/ccjD6o1Q.s]
ignore line: [GNU assembler version 2.36.1 (x86_64-pc-linux-gnu) using BFD version (GNU Binutils) 2.36.1]
ignore line: [COMPILER_PATH=/usr/lib/gcc/x86_64-pc-linux-gnu/11.1.0/:/usr/lib/gcc/x86_64-pc-linux-gnu/11.1.0/:/usr/lib/gcc/x86_64-pc-linux-gnu/:/usr/lib/gcc/x86_64-pc-linux-gnu/11.1.0/:/usr/lib/gcc/x86_64-pc-linux-gnu/]
ignore line: [LIBRARY_PATH=/usr/lib/gcc/x86_64-pc-linux-gnu/11.1.0/:/usr/lib/gcc/x86_64-pc-linux-gnu/11.1.0/../../../../lib/:/lib/../lib/:/usr/lib/../lib/:/usr/lib/gcc/x86_64-pc-linux-gnu/11.1.0/../../../:/lib/:/usr/lib/]
ignore line: [COLLECT_GCC_OPTIONS='-v' '-o' 'CMakeFiles/cmTC_db745.dir/CMakeCXXCompilerABI.cpp.o' '-c' '-shared-libgcc' '-mtune=generic' '-march=x86-64' '-dumpdir' 'CMakeFiles/cmTC_db745.dir/CMakeCXXCompilerABI.cpp.']
ignore line: [Linking CXX executable cmTC_db745]
ignore line: [/usr/bin/cmake -E cmake_link_script CMakeFiles/cmTC_db745.dir/link.txt --verbose=1]
ignore line: [/usr/bin/c++ -v -rdynamic CMakeFiles/cmTC_db745.dir/CMakeCXXCompilerABI.cpp.o -o cmTC_db745 ]
ignore line: [Using built-in specs.]
ignore line: [COLLECT_GCC=/usr/bin/c++]
ignore line: [COLLECT_LTO_WRAPPER=/usr/lib/gcc/x86_64-pc-linux-gnu/11.1.0/lto-wrapper]
ignore line: [Target: x86_64-pc-linux-gnu]
ignore line: [Configured with: /build/gcc/src/gcc/configure --prefix=/usr --libdir=/usr/lib --libexecdir=/usr/lib --mandir=/usr/share/man --infodir=/usr/share/info --with-bugurl=https://bugs.archlinux.org/ --enable-languages=c c++ ada fortran go lto objc obj-c++ d --with-isl --with-linker-hash-style=gnu --with-system-zlib --enable-__cxa_atexit --enable-cet=auto --enable-checking=release --enable-clocale=gnu --enable-default-pie --enable-default-ssp --enable-gnu-indirect-function --enable-gnu-unique-object --enable-install-libiberty --enable-linker-build-id --enable-lto --enable-multilib --enable-plugin --enable-shared --enable-threads=posix --disable-libssp --disable-libstdcxx-pch --disable-libunwind-exceptions --disable-werror gdc_include_dir=/usr/include/dlang/gdc]
ignore line: [Thread model: posix]
ignore line: [Supported LTO compression algorithms: zlib zstd]
ignore line: [gcc version 11.1.0 (GCC) ]
ignore line: [COMPILER_PATH=/usr/lib/gcc/x86_64-pc-linux-gnu/11.1.0/:/usr/lib/gcc/x86_64-pc-linux-gnu/11.1.0/:/usr/lib/gcc/x86_64-pc-linux-gnu/:/usr/lib/gcc/x86_64-pc-linux-gnu/11.1.0/:/usr/lib/gcc/x86_64-pc-linux-gnu/]
ignore line: [LIBRARY_PATH=/usr/lib/gcc/x86_64-pc-linux-gnu/11.1.0/:/usr/lib/gcc/x86_64-pc-linux-gnu/11.1.0/../../../../lib/:/lib/../lib/:/usr/lib/../lib/:/usr/lib/gcc/x86_64-pc-linux-gnu/11.1.0/../../../:/lib/:/usr/lib/]
ignore line: [COLLECT_GCC_OPTIONS='-v' '-rdynamic' '-o' 'cmTC_db745' '-shared-libgcc' '-mtune=generic' '-march=x86-64' '-dumpdir' 'cmTC_db745.']
link line: [ /usr/lib/gcc/x86_64-pc-linux-gnu/11.1.0/collect2 -plugin /usr/lib/gcc/x86_64-pc-linux-gnu/11.1.0/liblto_plugin.so -plugin-opt=/usr/lib/gcc/x86_64-pc-linux-gnu/11.1.0/lto-wrapper -plugin-opt=-fresolution=/tmp/ccbPvVwg.res -plugin-opt=-pass-through=-lgcc_s -plugin-opt=-pass-through=-lgcc -plugin-opt=-pass-through=-lc -plugin-opt=-pass-through=-lgcc_s -plugin-opt=-pass-through=-lgcc --build-id --eh-frame-hdr --hash-style=gnu -m elf_x86_64 -export-dynamic -dynamic-linker /lib64/ld-linux-x86-64.so.2 -pie -o cmTC_db745 /usr/lib/gcc/x86_64-pc-linux-gnu/11.1.0/../../../../lib/Scrt1.o /usr/lib/gcc/x86_64-pc-linux-gnu/11.1.0/../../../../lib/crti.o /usr/lib/gcc/x86_64-pc-linux-gnu/11.1.0/crtbeginS.o -L/usr/lib/gcc/x86_64-pc-linux-gnu/11.1.0 -L/usr/lib/gcc/x86_64-pc-linux-gnu/11.1.0/../../../../lib -L/lib/../lib -L/usr/lib/../lib -L/usr/lib/gcc/x86_64-pc-linux-gnu/11.1.0/../../.. CMakeFiles/cmTC_db745.dir/CMakeCXXCompilerABI.cpp.o -lstdc++ -lm -lgcc_s -lgcc -lc -lgcc_s -lgcc /usr/lib/gcc/x86_64-pc-linux-gnu/11.1.0/crtendS.o /usr/lib/gcc/x86_64-pc-linux-gnu/11.1.0/../../../../lib/crtn.o]
arg [/usr/lib/gcc/x86_64-pc-linux-gnu/11.1.0/collect2] ==> ignore
arg [-plugin] ==> ignore
arg [/usr/lib/gcc/x86_64-pc-linux-gnu/11.1.0/liblto_plugin.so] ==> ignore
arg [-plugin-opt=/usr/lib/gcc/x86_64-pc-linux-gnu/11.1.0/lto-wrapper] ==> ignore
arg [-plugin-opt=-fresolution=/tmp/ccbPvVwg.res] ==> ignore
arg [-plugin-opt=-pass-through=-lgcc_s] ==> ignore
arg [-plugin-opt=-pass-through=-lgcc] ==> ignore
arg [-plugin-opt=-pass-through=-lc] ==> ignore
arg [-plugin-opt=-pass-through=-lgcc_s] ==> ignore
arg [-plugin-opt=-pass-through=-lgcc] ==> ignore
arg [--build-id] ==> ignore
arg [--eh-frame-hdr] ==> ignore
arg [--hash-style=gnu] ==> ignore
arg [-m] ==> ignore
arg [elf_x86_64] ==> ignore
arg [-export-dynamic] ==> ignore
arg [-dynamic-linker] ==> ignore
arg [/lib64/ld-linux-x86-64.so.2] ==> ignore
arg [-pie] ==> ignore
arg [-o] ==> ignore
arg [cmTC_db745] ==> ignore
arg [/usr/lib/gcc/x86_64-pc-linux-gnu/11.1.0/../../../../lib/Scrt1.o] ==> obj [/usr/lib/gcc/x86_64-pc-linux-gnu/11.1.0/../../../../lib/Scrt1.o]
arg [/usr/lib/gcc/x86_64-pc-linux-gnu/11.1.0/../../../../lib/crti.o] ==> obj [/usr/lib/gcc/x86_64-pc-linux-gnu/11.1.0/../../../../lib/crti.o]
arg [/usr/lib/gcc/x86_64-pc-linux-gnu/11.1.0/crtbeginS.o] ==> obj [/usr/lib/gcc/x86_64-pc-linux-gnu/11.1.0/crtbeginS.o]
arg [-L/usr/lib/gcc/x86_64-pc-linux-gnu/11.1.0] ==> dir [/usr/lib/gcc/x86_64-pc-linux-gnu/11.1.0]
arg [-L/usr/lib/gcc/x86_64-pc-linux-gnu/11.1.0/../../../../lib] ==> dir [/usr/lib/gcc/x86_64-pc-linux-gnu/11.1.0/../../../../lib]
arg [-L/lib/../lib] ==> dir [/lib/../lib]
arg [-L/usr/lib/../lib] ==> dir [/usr/lib/../lib]
arg [-L/usr/lib/gcc/x86_64-pc-linux-gnu/11.1.0/../../..] ==> dir [/usr/lib/gcc/x86_64-pc-linux-gnu/11.1.0/../../..]
arg [CMakeFiles/cmTC_db745.dir/CMakeCXXCompilerABI.cpp.o] ==> ignore
arg [-lstdc++] ==> lib [stdc++]
arg [-lm] ==> lib [m]
arg [-lgcc_s] ==> lib [gcc_s]
arg [-lgcc] ==> lib [gcc]
arg [-lc] ==> lib [c]
arg [-lgcc_s] ==> lib [gcc_s]
arg [-lgcc] ==> lib [gcc]
arg [/usr/lib/gcc/x86_64-pc-linux-gnu/11.1.0/crtendS.o] ==> obj [/usr/lib/gcc/x86_64-pc-linux-gnu/11.1.0/crtendS.o]
arg [/usr/lib/gcc/x86_64-pc-linux-gnu/11.1.0/../../../../lib/crtn.o] ==> obj [/usr/lib/gcc/x86_64-pc-linux-gnu/11.1.0/../../../../lib/crtn.o]
collapse obj [/usr/lib/gcc/x86_64-pc-linux-gnu/11.1.0/../../../../lib/Scrt1.o] ==> [/usr/lib/Scrt1.o]
collapse obj [/usr/lib/gcc/x86_64-pc-linux-gnu/11.1.0/../../../../lib/crti.o] ==> [/usr/lib/crti.o]
collapse obj [/usr/lib/gcc/x86_64-pc-linux-gnu/11.1.0/../../../../lib/crtn.o] ==> [/usr/lib/crtn.o]
collapse library dir [/usr/lib/gcc/x86_64-pc-linux-gnu/11.1.0] ==> [/usr/lib/gcc/x86_64-pc-linux-gnu/11.1.0]
collapse library dir [/usr/lib/gcc/x86_64-pc-linux-gnu/11.1.0/../../../../lib] ==> [/usr/lib]
collapse library dir [/lib/../lib] ==> [/lib]
collapse library dir [/usr/lib/../lib] ==> [/usr/lib]
collapse library dir [/usr/lib/gcc/x86_64-pc-linux-gnu/11.1.0/../../..] ==> [/usr/lib]
implicit libs: [stdc++;m;gcc_s;gcc;c;gcc_s;gcc]
implicit objs: [/usr/lib/Scrt1.o;/usr/lib/crti.o;/usr/lib/gcc/x86_64-pc-linux-gnu/11.1.0/crtbeginS.o;/usr/lib/gcc/x86_64-pc-linux-gnu/11.1.0/crtendS.o;/usr/lib/crtn.o]
implicit dirs: [/usr/lib/gcc/x86_64-pc-linux-gnu/11.1.0;/usr/lib;/lib]
implicit fwks: []
Detecting C compiler ABI info compiled with the following output:
Change Dir: /tmp/makepkg/deal-ii/src/build/CMakeFiles/CMakeTmp
Run Build Command(s):/usr/bin/make -f Makefile cmTC_4a87c/fast && /usr/bin/make -f CMakeFiles/cmTC_4a87c.dir/build.make CMakeFiles/cmTC_4a87c.dir/build
make[1]: Entering directory '/tmp/makepkg/deal-ii/src/build/CMakeFiles/CMakeTmp'
Building C object CMakeFiles/cmTC_4a87c.dir/CMakeCCompilerABI.c.o
/usr/bin/cc -v -o CMakeFiles/cmTC_4a87c.dir/CMakeCCompilerABI.c.o -c /usr/share/cmake-3.21/Modules/CMakeCCompilerABI.c
Using built-in specs.
COLLECT_GCC=/usr/bin/cc
Target: x86_64-pc-linux-gnu
Configured with: /build/gcc/src/gcc/configure --prefix=/usr --libdir=/usr/lib --libexecdir=/usr/lib --mandir=/usr/share/man --infodir=/usr/share/info --with-bugurl=https://bugs.archlinux.org/ --enable-languages=c,c++,ada,fortran,go,lto,objc,obj-c++,d --with-isl --with-linker-hash-style=gnu --with-system-zlib --enable-__cxa_atexit --enable-cet=auto --enable-checking=release --enable-clocale=gnu --enable-default-pie --enable-default-ssp --enable-gnu-indirect-function --enable-gnu-unique-object --enable-install-libiberty --enable-linker-build-id --enable-lto --enable-multilib --enable-plugin --enable-shared --enable-threads=posix --disable-libssp --disable-libstdcxx-pch --disable-libunwind-exceptions --disable-werror gdc_include_dir=/usr/include/dlang/gdc
Thread model: posix
Supported LTO compression algorithms: zlib zstd
gcc version 11.1.0 (GCC)
COLLECT_GCC_OPTIONS='-v' '-o' 'CMakeFiles/cmTC_4a87c.dir/CMakeCCompilerABI.c.o' '-c' '-mtune=generic' '-march=x86-64' '-dumpdir' 'CMakeFiles/cmTC_4a87c.dir/'
/usr/lib/gcc/x86_64-pc-linux-gnu/11.1.0/cc1 -quiet -v /usr/share/cmake-3.21/Modules/CMakeCCompilerABI.c -quiet -dumpdir CMakeFiles/cmTC_4a87c.dir/ -dumpbase CMakeCCompilerABI.c.c -dumpbase-ext .c -mtune=generic -march=x86-64 -version -o /tmp/ccth6Zxf.s
GNU C17 (GCC) version 11.1.0 (x86_64-pc-linux-gnu)
compiled by GNU C version 11.1.0, GMP version 6.2.1, MPFR version 4.1.0, MPC version 1.2.1, isl version isl-0.24-GMP
warning: MPFR header version 4.1.0 differs from library version 4.1.0-p13.
GGC heuristics: --param ggc-min-expand=100 --param ggc-min-heapsize=131072
ignoring nonexistent directory "/usr/lib/gcc/x86_64-pc-linux-gnu/11.1.0/../../../../x86_64-pc-linux-gnu/include"
#include "..." search starts here:
#include <...> search starts here:
/usr/lib/gcc/x86_64-pc-linux-gnu/11.1.0/include
/usr/local/include
/usr/lib/gcc/x86_64-pc-linux-gnu/11.1.0/include-fixed
/usr/include
End of search list.
GNU C17 (GCC) version 11.1.0 (x86_64-pc-linux-gnu)
compiled by GNU C version 11.1.0, GMP version 6.2.1, MPFR version 4.1.0, MPC version 1.2.1, isl version isl-0.24-GMP
warning: MPFR header version 4.1.0 differs from library version 4.1.0-p13.
GGC heuristics: --param ggc-min-expand=100 --param ggc-min-heapsize=131072
Compiler executable checksum: 3d0ac5c030c008e73f10e8b66957dbfa
COLLECT_GCC_OPTIONS='-v' '-o' 'CMakeFiles/cmTC_4a87c.dir/CMakeCCompilerABI.c.o' '-c' '-mtune=generic' '-march=x86-64' '-dumpdir' 'CMakeFiles/cmTC_4a87c.dir/'
as -v --64 -o CMakeFiles/cmTC_4a87c.dir/CMakeCCompilerABI.c.o /tmp/ccth6Zxf.s
GNU assembler version 2.36.1 (x86_64-pc-linux-gnu) using BFD version (GNU Binutils) 2.36.1
COMPILER_PATH=/usr/lib/gcc/x86_64-pc-linux-gnu/11.1.0/:/usr/lib/gcc/x86_64-pc-linux-gnu/11.1.0/:/usr/lib/gcc/x86_64-pc-linux-gnu/:/usr/lib/gcc/x86_64-pc-linux-gnu/11.1.0/:/usr/lib/gcc/x86_64-pc-linux-gnu/
LIBRARY_PATH=/usr/lib/gcc/x86_64-pc-linux-gnu/11.1.0/:/usr/lib/gcc/x86_64-pc-linux-gnu/11.1.0/../../../../lib/:/lib/../lib/:/usr/lib/../lib/:/usr/lib/gcc/x86_64-pc-linux-gnu/11.1.0/../../../:/lib/:/usr/lib/
COLLECT_GCC_OPTIONS='-v' '-o' 'CMakeFiles/cmTC_4a87c.dir/CMakeCCompilerABI.c.o' '-c' '-mtune=generic' '-march=x86-64' '-dumpdir' 'CMakeFiles/cmTC_4a87c.dir/CMakeCCompilerABI.c.'
Linking C executable cmTC_4a87c
/usr/bin/cmake -E cmake_link_script CMakeFiles/cmTC_4a87c.dir/link.txt --verbose=1
/usr/bin/cc -v -rdynamic CMakeFiles/cmTC_4a87c.dir/CMakeCCompilerABI.c.o -o cmTC_4a87c
Using built-in specs.
COLLECT_GCC=/usr/bin/cc
COLLECT_LTO_WRAPPER=/usr/lib/gcc/x86_64-pc-linux-gnu/11.1.0/lto-wrapper
Target: x86_64-pc-linux-gnu
Configured with: /build/gcc/src/gcc/configure --prefix=/usr --libdir=/usr/lib --libexecdir=/usr/lib --mandir=/usr/share/man --infodir=/usr/share/info --with-bugurl=https://bugs.archlinux.org/ --enable-languages=c,c++,ada,fortran,go,lto,objc,obj-c++,d --with-isl --with-linker-hash-style=gnu --with-system-zlib --enable-__cxa_atexit --enable-cet=auto --enable-checking=release --enable-clocale=gnu --enable-default-pie --enable-default-ssp --enable-gnu-indirect-function --enable-gnu-unique-object --enable-install-libiberty --enable-linker-build-id --enable-lto --enable-multilib --enable-plugin --enable-shared --enable-threads=posix --disable-libssp --disable-libstdcxx-pch --disable-libunwind-exceptions --disable-werror gdc_include_dir=/usr/include/dlang/gdc
Thread model: posix
Supported LTO compression algorithms: zlib zstd
gcc version 11.1.0 (GCC)
COMPILER_PATH=/usr/lib/gcc/x86_64-pc-linux-gnu/11.1.0/:/usr/lib/gcc/x86_64-pc-linux-gnu/11.1.0/:/usr/lib/gcc/x86_64-pc-linux-gnu/:/usr/lib/gcc/x86_64-pc-linux-gnu/11.1.0/:/usr/lib/gcc/x86_64-pc-linux-gnu/
LIBRARY_PATH=/usr/lib/gcc/x86_64-pc-linux-gnu/11.1.0/:/usr/lib/gcc/x86_64-pc-linux-gnu/11.1.0/../../../../lib/:/lib/../lib/:/usr/lib/../lib/:/usr/lib/gcc/x86_64-pc-linux-gnu/11.1.0/../../../:/lib/:/usr/lib/
COLLECT_GCC_OPTIONS='-v' '-rdynamic' '-o' 'cmTC_4a87c' '-mtune=generic' '-march=x86-64' '-dumpdir' 'cmTC_4a87c.'
/usr/lib/gcc/x86_64-pc-linux-gnu/11.1.0/collect2 -plugin /usr/lib/gcc/x86_64-pc-linux-gnu/11.1.0/liblto_plugin.so -plugin-opt=/usr/lib/gcc/x86_64-pc-linux-gnu/11.1.0/lto-wrapper -plugin-opt=-fresolution=/tmp/ccXYXzqC.res -plugin-opt=-pass-through=-lgcc -plugin-opt=-pass-through=-lgcc_s -plugin-opt=-pass-through=-lc -plugin-opt=-pass-through=-lgcc -plugin-opt=-pass-through=-lgcc_s --build-id --eh-frame-hdr --hash-style=gnu -m elf_x86_64 -export-dynamic -dynamic-linker /lib64/ld-linux-x86-64.so.2 -pie -o cmTC_4a87c /usr/lib/gcc/x86_64-pc-linux-gnu/11.1.0/../../../../lib/Scrt1.o /usr/lib/gcc/x86_64-pc-linux-gnu/11.1.0/../../../../lib/crti.o /usr/lib/gcc/x86_64-pc-linux-gnu/11.1.0/crtbeginS.o -L/usr/lib/gcc/x86_64-pc-linux-gnu/11.1.0 -L/usr/lib/gcc/x86_64-pc-linux-gnu/11.1.0/../../../../lib -L/lib/../lib -L/usr/lib/../lib -L/usr/lib/gcc/x86_64-pc-linux-gnu/11.1.0/../../.. CMakeFiles/cmTC_4a87c.dir/CMakeCCompilerABI.c.o -lgcc --push-state --as-needed -lgcc_s --pop-state -lc -lgcc --push-state --as-needed -lgcc_s --pop-state /usr/lib/gcc/x86_64-pc-linux-gnu/11.1.0/crtendS.o /usr/lib/gcc/x86_64-pc-linux-gnu/11.1.0/../../../../lib/crtn.o
COLLECT_GCC_OPTIONS='-v' '-rdynamic' '-o' 'cmTC_4a87c' '-mtune=generic' '-march=x86-64' '-dumpdir' 'cmTC_4a87c.'
make[1]: Leaving directory '/tmp/makepkg/deal-ii/src/build/CMakeFiles/CMakeTmp'
Parsed C implicit include dir info from above output: rv=done
found start of include info
found start of implicit include info
add: [/usr/lib/gcc/x86_64-pc-linux-gnu/11.1.0/include]
add: [/usr/local/include]
add: [/usr/lib/gcc/x86_64-pc-linux-gnu/11.1.0/include-fixed]
add: [/usr/include]
end of search list found
collapse include dir [/usr/lib/gcc/x86_64-pc-linux-gnu/11.1.0/include] ==> [/usr/lib/gcc/x86_64-pc-linux-gnu/11.1.0/include]
collapse include dir [/usr/local/include] ==> [/usr/local/include]
collapse include dir [/usr/lib/gcc/x86_64-pc-linux-gnu/11.1.0/include-fixed] ==> [/usr/lib/gcc/x86_64-pc-linux-gnu/11.1.0/include-fixed]
collapse include dir [/usr/include] ==> [/usr/include]
implicit include dirs: [/usr/lib/gcc/x86_64-pc-linux-gnu/11.1.0/include;/usr/local/include;/usr/lib/gcc/x86_64-pc-linux-gnu/11.1.0/include-fixed;/usr/include]
Parsed C implicit link information from above output:
link line regex: [^( *|.*[/\])(ld|CMAKE_LINK_STARTFILE-NOTFOUND|([^/\]+-)?ld|collect2)[^/\]*( |$)]
ignore line: [Change Dir: /tmp/makepkg/deal-ii/src/build/CMakeFiles/CMakeTmp]
ignore line: []
ignore line: [Run Build Command(s):/usr/bin/make -f Makefile cmTC_4a87c/fast && /usr/bin/make -f CMakeFiles/cmTC_4a87c.dir/build.make CMakeFiles/cmTC_4a87c.dir/build]
ignore line: [make[1]: Entering directory '/tmp/makepkg/deal-ii/src/build/CMakeFiles/CMakeTmp']
ignore line: [Building C object CMakeFiles/cmTC_4a87c.dir/CMakeCCompilerABI.c.o]
ignore line: [/usr/bin/cc -v -o CMakeFiles/cmTC_4a87c.dir/CMakeCCompilerABI.c.o -c /usr/share/cmake-3.21/Modules/CMakeCCompilerABI.c]
ignore line: [Using built-in specs.]
ignore line: [COLLECT_GCC=/usr/bin/cc]
ignore line: [Target: x86_64-pc-linux-gnu]
ignore line: [Configured with: /build/gcc/src/gcc/configure --prefix=/usr --libdir=/usr/lib --libexecdir=/usr/lib --mandir=/usr/share/man --infodir=/usr/share/info --with-bugurl=https://bugs.archlinux.org/ --enable-languages=c c++ ada fortran go lto objc obj-c++ d --with-isl --with-linker-hash-style=gnu --with-system-zlib --enable-__cxa_atexit --enable-cet=auto --enable-checking=release --enable-clocale=gnu --enable-default-pie --enable-default-ssp --enable-gnu-indirect-function --enable-gnu-unique-object --enable-install-libiberty --enable-linker-build-id --enable-lto --enable-multilib --enable-plugin --enable-shared --enable-threads=posix --disable-libssp --disable-libstdcxx-pch --disable-libunwind-exceptions --disable-werror gdc_include_dir=/usr/include/dlang/gdc]
ignore line: [Thread model: posix]
ignore line: [Supported LTO compression algorithms: zlib zstd]
ignore line: [gcc version 11.1.0 (GCC) ]
ignore line: [COLLECT_GCC_OPTIONS='-v' '-o' 'CMakeFiles/cmTC_4a87c.dir/CMakeCCompilerABI.c.o' '-c' '-mtune=generic' '-march=x86-64' '-dumpdir' 'CMakeFiles/cmTC_4a87c.dir/']
ignore line: [ /usr/lib/gcc/x86_64-pc-linux-gnu/11.1.0/cc1 -quiet -v /usr/share/cmake-3.21/Modules/CMakeCCompilerABI.c -quiet -dumpdir CMakeFiles/cmTC_4a87c.dir/ -dumpbase CMakeCCompilerABI.c.c -dumpbase-ext .c -mtune=generic -march=x86-64 -version -o /tmp/ccth6Zxf.s]
ignore line: [GNU C17 (GCC) version 11.1.0 (x86_64-pc-linux-gnu)]
ignore line: [ compiled by GNU C version 11.1.0 GMP version 6.2.1 MPFR version 4.1.0 MPC version 1.2.1 isl version isl-0.24-GMP]
ignore line: []
ignore line: [warning: MPFR header version 4.1.0 differs from library version 4.1.0-p13.]
ignore line: [GGC heuristics: --param ggc-min-expand=100 --param ggc-min-heapsize=131072]
ignore line: [ignoring nonexistent directory "/usr/lib/gcc/x86_64-pc-linux-gnu/11.1.0/../../../../x86_64-pc-linux-gnu/include"]
ignore line: [#include "..." search starts here:]
ignore line: [#include <...> search starts here:]
ignore line: [ /usr/lib/gcc/x86_64-pc-linux-gnu/11.1.0/include]
ignore line: [ /usr/local/include]
ignore line: [ /usr/lib/gcc/x86_64-pc-linux-gnu/11.1.0/include-fixed]
ignore line: [ /usr/include]
ignore line: [End of search list.]
ignore line: [GNU C17 (GCC) version 11.1.0 (x86_64-pc-linux-gnu)]
ignore line: [ compiled by GNU C version 11.1.0 GMP version 6.2.1 MPFR version 4.1.0 MPC version 1.2.1 isl version isl-0.24-GMP]
ignore line: []
ignore line: [warning: MPFR header version 4.1.0 differs from library version 4.1.0-p13.]
ignore line: [GGC heuristics: --param ggc-min-expand=100 --param ggc-min-heapsize=131072]
ignore line: [Compiler executable checksum: 3d0ac5c030c008e73f10e8b66957dbfa]
ignore line: [COLLECT_GCC_OPTIONS='-v' '-o' 'CMakeFiles/cmTC_4a87c.dir/CMakeCCompilerABI.c.o' '-c' '-mtune=generic' '-march=x86-64' '-dumpdir' 'CMakeFiles/cmTC_4a87c.dir/']
ignore line: [ as -v --64 -o CMakeFiles/cmTC_4a87c.dir/CMakeCCompilerABI.c.o /tmp/ccth6Zxf.s]
ignore line: [GNU assembler version 2.36.1 (x86_64-pc-linux-gnu) using BFD version (GNU Binutils) 2.36.1]
ignore line: [COMPILER_PATH=/usr/lib/gcc/x86_64-pc-linux-gnu/11.1.0/:/usr/lib/gcc/x86_64-pc-linux-gnu/11.1.0/:/usr/lib/gcc/x86_64-pc-linux-gnu/:/usr/lib/gcc/x86_64-pc-linux-gnu/11.1.0/:/usr/lib/gcc/x86_64-pc-linux-gnu/]
ignore line: [LIBRARY_PATH=/usr/lib/gcc/x86_64-pc-linux-gnu/11.1.0/:/usr/lib/gcc/x86_64-pc-linux-gnu/11.1.0/../../../../lib/:/lib/../lib/:/usr/lib/../lib/:/usr/lib/gcc/x86_64-pc-linux-gnu/11.1.0/../../../:/lib/:/usr/lib/]
ignore line: [COLLECT_GCC_OPTIONS='-v' '-o' 'CMakeFiles/cmTC_4a87c.dir/CMakeCCompilerABI.c.o' '-c' '-mtune=generic' '-march=x86-64' '-dumpdir' 'CMakeFiles/cmTC_4a87c.dir/CMakeCCompilerABI.c.']
ignore line: [Linking C executable cmTC_4a87c]
ignore line: [/usr/bin/cmake -E cmake_link_script CMakeFiles/cmTC_4a87c.dir/link.txt --verbose=1]
ignore line: [/usr/bin/cc -v -rdynamic CMakeFiles/cmTC_4a87c.dir/CMakeCCompilerABI.c.o -o cmTC_4a87c ]
ignore line: [Using built-in specs.]
ignore line: [COLLECT_GCC=/usr/bin/cc]
ignore line: [COLLECT_LTO_WRAPPER=/usr/lib/gcc/x86_64-pc-linux-gnu/11.1.0/lto-wrapper]
ignore line: [Target: x86_64-pc-linux-gnu]
ignore line: [Configured with: /build/gcc/src/gcc/configure --prefix=/usr --libdir=/usr/lib --libexecdir=/usr/lib --mandir=/usr/share/man --infodir=/usr/share/info --with-bugurl=https://bugs.archlinux.org/ --enable-languages=c c++ ada fortran go lto objc obj-c++ d --with-isl --with-linker-hash-style=gnu --with-system-zlib --enable-__cxa_atexit --enable-cet=auto --enable-checking=release --enable-clocale=gnu --enable-default-pie --enable-default-ssp --enable-gnu-indirect-function --enable-gnu-unique-object --enable-install-libiberty --enable-linker-build-id --enable-lto --enable-multilib --enable-plugin --enable-shared --enable-threads=posix --disable-libssp --disable-libstdcxx-pch --disable-libunwind-exceptions --disable-werror gdc_include_dir=/usr/include/dlang/gdc]
ignore line: [Thread model: posix]
ignore line: [Supported LTO compression algorithms: zlib zstd]
ignore line: [gcc version 11.1.0 (GCC) ]
ignore line: [COMPILER_PATH=/usr/lib/gcc/x86_64-pc-linux-gnu/11.1.0/:/usr/lib/gcc/x86_64-pc-linux-gnu/11.1.0/:/usr/lib/gcc/x86_64-pc-linux-gnu/:/usr/lib/gcc/x86_64-pc-linux-gnu/11.1.0/:/usr/lib/gcc/x86_64-pc-linux-gnu/]
ignore line: [LIBRARY_PATH=/usr/lib/gcc/x86_64-pc-linux-gnu/11.1.0/:/usr/lib/gcc/x86_64-pc-linux-gnu/11.1.0/../../../../lib/:/lib/../lib/:/usr/lib/../lib/:/usr/lib/gcc/x86_64-pc-linux-gnu/11.1.0/../../../:/lib/:/usr/lib/]
ignore line: [COLLECT_GCC_OPTIONS='-v' '-rdynamic' '-o' 'cmTC_4a87c' '-mtune=generic' '-march=x86-64' '-dumpdir' 'cmTC_4a87c.']
link line: [ /usr/lib/gcc/x86_64-pc-linux-gnu/11.1.0/collect2 -plugin /usr/lib/gcc/x86_64-pc-linux-gnu/11.1.0/liblto_plugin.so -plugin-opt=/usr/lib/gcc/x86_64-pc-linux-gnu/11.1.0/lto-wrapper -plugin-opt=-fresolution=/tmp/ccXYXzqC.res -plugin-opt=-pass-through=-lgcc -plugin-opt=-pass-through=-lgcc_s -plugin-opt=-pass-through=-lc -plugin-opt=-pass-through=-lgcc -plugin-opt=-pass-through=-lgcc_s --build-id --eh-frame-hdr --hash-style=gnu -m elf_x86_64 -export-dynamic -dynamic-linker /lib64/ld-linux-x86-64.so.2 -pie -o cmTC_4a87c /usr/lib/gcc/x86_64-pc-linux-gnu/11.1.0/../../../../lib/Scrt1.o /usr/lib/gcc/x86_64-pc-linux-gnu/11.1.0/../../../../lib/crti.o /usr/lib/gcc/x86_64-pc-linux-gnu/11.1.0/crtbeginS.o -L/usr/lib/gcc/x86_64-pc-linux-gnu/11.1.0 -L/usr/lib/gcc/x86_64-pc-linux-gnu/11.1.0/../../../../lib -L/lib/../lib -L/usr/lib/../lib -L/usr/lib/gcc/x86_64-pc-linux-gnu/11.1.0/../../.. CMakeFiles/cmTC_4a87c.dir/CMakeCCompilerABI.c.o -lgcc --push-state --as-needed -lgcc_s --pop-state -lc -lgcc --push-state --as-needed -lgcc_s --pop-state /usr/lib/gcc/x86_64-pc-linux-gnu/11.1.0/crtendS.o /usr/lib/gcc/x86_64-pc-linux-gnu/11.1.0/../../../../lib/crtn.o]
arg [/usr/lib/gcc/x86_64-pc-linux-gnu/11.1.0/collect2] ==> ignore
arg [-plugin] ==> ignore
arg [/usr/lib/gcc/x86_64-pc-linux-gnu/11.1.0/liblto_plugin.so] ==> ignore
arg [-plugin-opt=/usr/lib/gcc/x86_64-pc-linux-gnu/11.1.0/lto-wrapper] ==> ignore
arg [-plugin-opt=-fresolution=/tmp/ccXYXzqC.res] ==> ignore
arg [-plugin-opt=-pass-through=-lgcc] ==> ignore
arg [-plugin-opt=-pass-through=-lgcc_s] ==> ignore
arg [-plugin-opt=-pass-through=-lc] ==> ignore
arg [-plugin-opt=-pass-through=-lgcc] ==> ignore
arg [-plugin-opt=-pass-through=-lgcc_s] ==> ignore
arg [--build-id] ==> ignore
arg [--eh-frame-hdr] ==> ignore
arg [--hash-style=gnu] ==> ignore
arg [-m] ==> ignore
arg [elf_x86_64] ==> ignore
arg [-export-dynamic] ==> ignore
arg [-dynamic-linker] ==> ignore
arg [/lib64/ld-linux-x86-64.so.2] ==> ignore
arg [-pie] ==> ignore
arg [-o] ==> ignore
arg [cmTC_4a87c] ==> ignore
arg [/usr/lib/gcc/x86_64-pc-linux-gnu/11.1.0/../../../../lib/Scrt1.o] ==> obj [/usr/lib/gcc/x86_64-pc-linux-gnu/11.1.0/../../../../lib/Scrt1.o]
arg [/usr/lib/gcc/x86_64-pc-linux-gnu/11.1.0/../../../../lib/crti.o] ==> obj [/usr/lib/gcc/x86_64-pc-linux-gnu/11.1.0/../../../../lib/crti.o]
arg [/usr/lib/gcc/x86_64-pc-linux-gnu/11.1.0/crtbeginS.o] ==> obj [/usr/lib/gcc/x86_64-pc-linux-gnu/11.1.0/crtbeginS.o]
arg [-L/usr/lib/gcc/x86_64-pc-linux-gnu/11.1.0] ==> dir [/usr/lib/gcc/x86_64-pc-linux-gnu/11.1.0]
arg [-L/usr/lib/gcc/x86_64-pc-linux-gnu/11.1.0/../../../../lib] ==> dir [/usr/lib/gcc/x86_64-pc-linux-gnu/11.1.0/../../../../lib]
arg [-L/lib/../lib] ==> dir [/lib/../lib]
arg [-L/usr/lib/../lib] ==> dir [/usr/lib/../lib]
arg [-L/usr/lib/gcc/x86_64-pc-linux-gnu/11.1.0/../../..] ==> dir [/usr/lib/gcc/x86_64-pc-linux-gnu/11.1.0/../../..]
arg [CMakeFiles/cmTC_4a87c.dir/CMakeCCompilerABI.c.o] ==> ignore
arg [-lgcc] ==> lib [gcc]
arg [--push-state] ==> ignore
arg [--as-needed] ==> ignore
arg [-lgcc_s] ==> lib [gcc_s]
arg [--pop-state] ==> ignore
arg [-lc] ==> lib [c]
arg [-lgcc] ==> lib [gcc]
arg [--push-state] ==> ignore
arg [--as-needed] ==> ignore
arg [-lgcc_s] ==> lib [gcc_s]
arg [--pop-state] ==> ignore
arg [/usr/lib/gcc/x86_64-pc-linux-gnu/11.1.0/crtendS.o] ==> obj [/usr/lib/gcc/x86_64-pc-linux-gnu/11.1.0/crtendS.o]
arg [/usr/lib/gcc/x86_64-pc-linux-gnu/11.1.0/../../../../lib/crtn.o] ==> obj [/usr/lib/gcc/x86_64-pc-linux-gnu/11.1.0/../../../../lib/crtn.o]
collapse obj [/usr/lib/gcc/x86_64-pc-linux-gnu/11.1.0/../../../../lib/Scrt1.o] ==> [/usr/lib/Scrt1.o]
collapse obj [/usr/lib/gcc/x86_64-pc-linux-gnu/11.1.0/../../../../lib/crti.o] ==> [/usr/lib/crti.o]
collapse obj [/usr/lib/gcc/x86_64-pc-linux-gnu/11.1.0/../../../../lib/crtn.o] ==> [/usr/lib/crtn.o]
collapse library dir [/usr/lib/gcc/x86_64-pc-linux-gnu/11.1.0] ==> [/usr/lib/gcc/x86_64-pc-linux-gnu/11.1.0]
collapse library dir [/usr/lib/gcc/x86_64-pc-linux-gnu/11.1.0/../../../../lib] ==> [/usr/lib]
collapse library dir [/lib/../lib] ==> [/lib]
collapse library dir [/usr/lib/../lib] ==> [/usr/lib]
collapse library dir [/usr/lib/gcc/x86_64-pc-linux-gnu/11.1.0/../../..] ==> [/usr/lib]
implicit libs: [gcc;gcc_s;c;gcc;gcc_s]
implicit objs: [/usr/lib/Scrt1.o;/usr/lib/crti.o;/usr/lib/gcc/x86_64-pc-linux-gnu/11.1.0/crtbeginS.o;/usr/lib/gcc/x86_64-pc-linux-gnu/11.1.0/crtendS.o;/usr/lib/crtn.o]
implicit dirs: [/usr/lib/gcc/x86_64-pc-linux-gnu/11.1.0;/usr/lib;/lib]
implicit fwks: []
Compiling the Fortran compiler identification source file "CMakeFortranCompilerId.F" succeeded.
Compiler: /usr/bin/gfortran
Build flags:
Id flags: -v
The output was:
0
Driving: /usr/bin/gfortran -v CMakeFortranCompilerId.F -l gfortran -l m -shared-libgcc
Using built-in specs.
COLLECT_GCC=/usr/bin/gfortran
COLLECT_LTO_WRAPPER=/usr/lib/gcc/x86_64-pc-linux-gnu/11.1.0/lto-wrapper
Target: x86_64-pc-linux-gnu
Configured with: /build/gcc/src/gcc/configure --prefix=/usr --libdir=/usr/lib --libexecdir=/usr/lib --mandir=/usr/share/man --infodir=/usr/share/info --with-bugurl=https://bugs.archlinux.org/ --enable-languages=c,c++,ada,fortran,go,lto,objc,obj-c++,d --with-isl --with-linker-hash-style=gnu --with-system-zlib --enable-__cxa_atexit --enable-cet=auto --enable-checking=release --enable-clocale=gnu --enable-default-pie --enable-default-ssp --enable-gnu-indirect-function --enable-gnu-unique-object --enable-install-libiberty --enable-linker-build-id --enable-lto --enable-multilib --enable-plugin --enable-shared --enable-threads=posix --disable-libssp --disable-libstdcxx-pch --disable-libunwind-exceptions --disable-werror gdc_include_dir=/usr/include/dlang/gdc
Thread model: posix
Supported LTO compression algorithms: zlib zstd
gcc version 11.1.0 (GCC)
COLLECT_GCC_OPTIONS='-v' '-shared-libgcc' '-mtune=generic' '-march=x86-64' '-dumpdir' 'a-'
/usr/lib/gcc/x86_64-pc-linux-gnu/11.1.0/f951 CMakeFortranCompilerId.F -ffixed-form -cpp=/tmp/ccU30GUo.f90 -quiet -v CMakeFortranCompilerId.F -quiet -dumpdir a- -dumpbase CMakeFortranCompilerId.F -dumpbase-ext .F -mtune=generic -march=x86-64 -version -fintrinsic-modules-path /usr/lib/gcc/x86_64-pc-linux-gnu/11.1.0/finclude -fpre-include=/usr/include/finclude/math-vector-fortran.h -o /tmp/ccdpOuZE.s
GNU Fortran (GCC) version 11.1.0 (x86_64-pc-linux-gnu)
compiled by GNU C version 11.1.0, GMP version 6.2.1, MPFR version 4.1.0, MPC version 1.2.1, isl version isl-0.24-GMP
warning: MPFR header version 4.1.0 differs from library version 4.1.0-p13.
GGC heuristics: --param ggc-min-expand=100 --param ggc-min-heapsize=131072
ignoring nonexistent directory "/usr/lib/gcc/x86_64-pc-linux-gnu/11.1.0/../../../../x86_64-pc-linux-gnu/include"
#include "..." search starts here:
#include <...> search starts here:
/usr/lib/gcc/x86_64-pc-linux-gnu/11.1.0/finclude
/usr/lib/gcc/x86_64-pc-linux-gnu/11.1.0/include
/usr/local/include
/usr/lib/gcc/x86_64-pc-linux-gnu/11.1.0/include-fixed
/usr/include
End of search list.
GNU Fortran2008 (GCC) version 11.1.0 (x86_64-pc-linux-gnu)
compiled by GNU C version 11.1.0, GMP version 6.2.1, MPFR version 4.1.0, MPC version 1.2.1, isl version isl-0.24-GMP
warning: MPFR header version 4.1.0 differs from library version 4.1.0-p13.
GGC heuristics: --param ggc-min-expand=100 --param ggc-min-heapsize=131072
COLLECT_GCC_OPTIONS='-v' '-shared-libgcc' '-mtune=generic' '-march=x86-64' '-dumpdir' 'a-'
as -v --64 -o /tmp/ccxeUtJD.o /tmp/ccdpOuZE.s
GNU assembler version 2.36.1 (x86_64-pc-linux-gnu) using BFD version (GNU Binutils) 2.36.1
Reading specs from /usr/lib/gcc/x86_64-pc-linux-gnu/11.1.0/../../../../lib/libgfortran.spec
rename spec lib to liborig
COLLECT_GCC_OPTIONS='-v' '-shared-libgcc' '-mtune=generic' '-march=x86-64' '-dumpdir' 'a-'
COMPILER_PATH=/usr/lib/gcc/x86_64-pc-linux-gnu/11.1.0/:/usr/lib/gcc/x86_64-pc-linux-gnu/11.1.0/:/usr/lib/gcc/x86_64-pc-linux-gnu/:/usr/lib/gcc/x86_64-pc-linux-gnu/11.1.0/:/usr/lib/gcc/x86_64-pc-linux-gnu/
LIBRARY_PATH=/usr/lib/gcc/x86_64-pc-linux-gnu/11.1.0/:/usr/lib/gcc/x86_64-pc-linux-gnu/11.1.0/../../../../lib/:/lib/../lib/:/usr/lib/../lib/:/usr/lib/gcc/x86_64-pc-linux-gnu/11.1.0/../../../:/lib/:/usr/lib/
COLLECT_GCC_OPTIONS='-v' '-shared-libgcc' '-mtune=generic' '-march=x86-64' '-dumpdir' 'a.'
/usr/lib/gcc/x86_64-pc-linux-gnu/11.1.0/collect2 -plugin /usr/lib/gcc/x86_64-pc-linux-gnu/11.1.0/liblto_plugin.so -plugin-opt=/usr/lib/gcc/x86_64-pc-linux-gnu/11.1.0/lto-wrapper -plugin-opt=-fresolution=/tmp/ccOLoheS.res -plugin-opt=-pass-through=-lgcc_s -plugin-opt=-pass-through=-lgcc -plugin-opt=-pass-through=-lquadmath -plugin-opt=-pass-through=-lm -plugin-opt=-pass-through=-lgcc_s -plugin-opt=-pass-through=-lgcc -plugin-opt=-pass-through=-lc -plugin-opt=-pass-through=-lgcc_s -plugin-opt=-pass-through=-lgcc --build-id --eh-frame-hdr --hash-style=gnu -m elf_x86_64 -dynamic-linker /lib64/ld-linux-x86-64.so.2 -pie /usr/lib/gcc/x86_64-pc-linux-gnu/11.1.0/../../../../lib/Scrt1.o /usr/lib/gcc/x86_64-pc-linux-gnu/11.1.0/../../../../lib/crti.o /usr/lib/gcc/x86_64-pc-linux-gnu/11.1.0/crtbeginS.o -L/usr/lib/gcc/x86_64-pc-linux-gnu/11.1.0 -L/usr/lib/gcc/x86_64-pc-linux-gnu/11.1.0/../../../../lib -L/lib/../lib -L/usr/lib/../lib -L/usr/lib/gcc/x86_64-pc-linux-gnu/11.1.0/../../.. /tmp/ccxeUtJD.o -lgfortran -lm -lgcc_s -lgcc -lquadmath -lm -lgcc_s -lgcc -lc -lgcc_s -lgcc /usr/lib/gcc/x86_64-pc-linux-gnu/11.1.0/crtendS.o /usr/lib/gcc/x86_64-pc-linux-gnu/11.1.0/../../../../lib/crtn.o
COLLECT_GCC_OPTIONS='-v' '-shared-libgcc' '-mtune=generic' '-march=x86-64' '-dumpdir' 'a.'
Compilation of the Fortran compiler identification source "CMakeFortranCompilerId.F" produced "a.out"
The Fortran compiler identification is GNU, found in "/tmp/makepkg/deal-ii/src/build/CMakeFiles/3.21.1/CompilerIdFortran/a.out"
Detecting Fortran compiler ABI info compiled with the following output:
Change Dir: /tmp/makepkg/deal-ii/src/build/CMakeFiles/CMakeTmp
Run Build Command(s):/usr/bin/make -f Makefile cmTC_ccb8c/fast && /usr/bin/make -f CMakeFiles/cmTC_ccb8c.dir/build.make CMakeFiles/cmTC_ccb8c.dir/build
make[1]: Entering directory '/tmp/makepkg/deal-ii/src/build/CMakeFiles/CMakeTmp'
Building Fortran object CMakeFiles/cmTC_ccb8c.dir/CMakeFortranCompilerABI.F.o
/usr/bin/gfortran -v -c /usr/share/cmake-3.21/Modules/CMakeFortranCompilerABI.F -o CMakeFiles/cmTC_ccb8c.dir/CMakeFortranCompilerABI.F.o
Using built-in specs.
COLLECT_GCC=/usr/bin/gfortran
Target: x86_64-pc-linux-gnu
Configured with: /build/gcc/src/gcc/configure --prefix=/usr --libdir=/usr/lib --libexecdir=/usr/lib --mandir=/usr/share/man --infodir=/usr/share/info --with-bugurl=https://bugs.archlinux.org/ --enable-languages=c,c++,ada,fortran,go,lto,objc,obj-c++,d --with-isl --with-linker-hash-style=gnu --with-system-zlib --enable-__cxa_atexit --enable-cet=auto --enable-checking=release --enable-clocale=gnu --enable-default-pie --enable-default-ssp --enable-gnu-indirect-function --enable-gnu-unique-object --enable-install-libiberty --enable-linker-build-id --enable-lto --enable-multilib --enable-plugin --enable-shared --enable-threads=posix --disable-libssp --disable-libstdcxx-pch --disable-libunwind-exceptions --disable-werror gdc_include_dir=/usr/include/dlang/gdc
Thread model: posix
Supported LTO compression algorithms: zlib zstd
gcc version 11.1.0 (GCC)
COLLECT_GCC_OPTIONS='-v' '-c' '-o' 'CMakeFiles/cmTC_ccb8c.dir/CMakeFortranCompilerABI.F.o' '-mtune=generic' '-march=x86-64' '-dumpdir' 'CMakeFiles/cmTC_ccb8c.dir/'
/usr/lib/gcc/x86_64-pc-linux-gnu/11.1.0/f951 /usr/share/cmake-3.21/Modules/CMakeFortranCompilerABI.F -ffixed-form -cpp=/tmp/cc7liTdn.f90 -quiet -v /usr/share/cmake-3.21/Modules/CMakeFortranCompilerABI.F -quiet -dumpdir CMakeFiles/cmTC_ccb8c.dir/ -dumpbase CMakeFortranCompilerABI.F.F -dumpbase-ext .F -mtune=generic -march=x86-64 -version -fintrinsic-modules-path /usr/lib/gcc/x86_64-pc-linux-gnu/11.1.0/finclude -fpre-include=/usr/include/finclude/math-vector-fortran.h -o /tmp/ccpLNB0B.s
GNU Fortran (GCC) version 11.1.0 (x86_64-pc-linux-gnu)
compiled by GNU C version 11.1.0, GMP version 6.2.1, MPFR version 4.1.0, MPC version 1.2.1, isl version isl-0.24-GMP
warning: MPFR header version 4.1.0 differs from library version 4.1.0-p13.
GGC heuristics: --param ggc-min-expand=100 --param ggc-min-heapsize=131072
ignoring nonexistent directory "/usr/lib/gcc/x86_64-pc-linux-gnu/11.1.0/../../../../x86_64-pc-linux-gnu/include"
#include "..." search starts here:
#include <...> search starts here:
/usr/lib/gcc/x86_64-pc-linux-gnu/11.1.0/finclude
/usr/lib/gcc/x86_64-pc-linux-gnu/11.1.0/include
/usr/local/include
/usr/lib/gcc/x86_64-pc-linux-gnu/11.1.0/include-fixed
/usr/include
End of search list.
GNU Fortran2008 (GCC) version 11.1.0 (x86_64-pc-linux-gnu)
compiled by GNU C version 11.1.0, GMP version 6.2.1, MPFR version 4.1.0, MPC version 1.2.1, isl version isl-0.24-GMP
warning: MPFR header version 4.1.0 differs from library version 4.1.0-p13.
GGC heuristics: --param ggc-min-expand=100 --param ggc-min-heapsize=131072
COLLECT_GCC_OPTIONS='-v' '-c' '-o' 'CMakeFiles/cmTC_ccb8c.dir/CMakeFortranCompilerABI.F.o' '-mtune=generic' '-march=x86-64' '-dumpdir' 'CMakeFiles/cmTC_ccb8c.dir/'
as -v --64 -o CMakeFiles/cmTC_ccb8c.dir/CMakeFortranCompilerABI.F.o /tmp/ccpLNB0B.s
GNU assembler version 2.36.1 (x86_64-pc-linux-gnu) using BFD version (GNU Binutils) 2.36.1
COMPILER_PATH=/usr/lib/gcc/x86_64-pc-linux-gnu/11.1.0/:/usr/lib/gcc/x86_64-pc-linux-gnu/11.1.0/:/usr/lib/gcc/x86_64-pc-linux-gnu/:/usr/lib/gcc/x86_64-pc-linux-gnu/11.1.0/:/usr/lib/gcc/x86_64-pc-linux-gnu/
LIBRARY_PATH=/usr/lib/gcc/x86_64-pc-linux-gnu/11.1.0/:/usr/lib/gcc/x86_64-pc-linux-gnu/11.1.0/../../../../lib/:/lib/../lib/:/usr/lib/../lib/:/usr/lib/gcc/x86_64-pc-linux-gnu/11.1.0/../../../:/lib/:/usr/lib/
COLLECT_GCC_OPTIONS='-v' '-c' '-o' 'CMakeFiles/cmTC_ccb8c.dir/CMakeFortranCompilerABI.F.o' '-mtune=generic' '-march=x86-64' '-dumpdir' 'CMakeFiles/cmTC_ccb8c.dir/CMakeFortranCompilerABI.F.'
Linking Fortran executable cmTC_ccb8c
/usr/bin/cmake -E cmake_link_script CMakeFiles/cmTC_ccb8c.dir/link.txt --verbose=1
/usr/bin/gfortran -v CMakeFiles/cmTC_ccb8c.dir/CMakeFortranCompilerABI.F.o -o cmTC_ccb8c
Driving: /usr/bin/gfortran -v CMakeFiles/cmTC_ccb8c.dir/CMakeFortranCompilerABI.F.o -o cmTC_ccb8c -l gfortran -l m -shared-libgcc
Using built-in specs.
COLLECT_GCC=/usr/bin/gfortran
COLLECT_LTO_WRAPPER=/usr/lib/gcc/x86_64-pc-linux-gnu/11.1.0/lto-wrapper
Target: x86_64-pc-linux-gnu
Configured with: /build/gcc/src/gcc/configure --prefix=/usr --libdir=/usr/lib --libexecdir=/usr/lib --mandir=/usr/share/man --infodir=/usr/share/info --with-bugurl=https://bugs.archlinux.org/ --enable-languages=c,c++,ada,fortran,go,lto,objc,obj-c++,d --with-isl --with-linker-hash-style=gnu --with-system-zlib --enable-__cxa_atexit --enable-cet=auto --enable-checking=release --enable-clocale=gnu --enable-default-pie --enable-default-ssp --enable-gnu-indirect-function --enable-gnu-unique-object --enable-install-libiberty --enable-linker-build-id --enable-lto --enable-multilib --enable-plugin --enable-shared --enable-threads=posix --disable-libssp --disable-libstdcxx-pch --disable-libunwind-exceptions --disable-werror gdc_include_dir=/usr/include/dlang/gdc
Thread model: posix
Supported LTO compression algorithms: zlib zstd
gcc version 11.1.0 (GCC)
Reading specs from /usr/lib/gcc/x86_64-pc-linux-gnu/11.1.0/../../../../lib/libgfortran.spec
rename spec lib to liborig
COLLECT_GCC_OPTIONS='-v' '-o' 'cmTC_ccb8c' '-shared-libgcc' '-mtune=generic' '-march=x86-64' '-dumpdir' 'cmTC_ccb8c-'
COMPILER_PATH=/usr/lib/gcc/x86_64-pc-linux-gnu/11.1.0/:/usr/lib/gcc/x86_64-pc-linux-gnu/11.1.0/:/usr/lib/gcc/x86_64-pc-linux-gnu/:/usr/lib/gcc/x86_64-pc-linux-gnu/11.1.0/:/usr/lib/gcc/x86_64-pc-linux-gnu/
LIBRARY_PATH=/usr/lib/gcc/x86_64-pc-linux-gnu/11.1.0/:/usr/lib/gcc/x86_64-pc-linux-gnu/11.1.0/../../../../lib/:/lib/../lib/:/usr/lib/../lib/:/usr/lib/gcc/x86_64-pc-linux-gnu/11.1.0/../../../:/lib/:/usr/lib/
COLLECT_GCC_OPTIONS='-v' '-o' 'cmTC_ccb8c' '-shared-libgcc' '-mtune=generic' '-march=x86-64' '-dumpdir' 'cmTC_ccb8c.'
/usr/lib/gcc/x86_64-pc-linux-gnu/11.1.0/collect2 -plugin /usr/lib/gcc/x86_64-pc-linux-gnu/11.1.0/liblto_plugin.so -plugin-opt=/usr/lib/gcc/x86_64-pc-linux-gnu/11.1.0/lto-wrapper -plugin-opt=-fresolution=/tmp/ccqoJCzi.res -plugin-opt=-pass-through=-lgcc_s -plugin-opt=-pass-through=-lgcc -plugin-opt=-pass-through=-lquadmath -plugin-opt=-pass-through=-lm -plugin-opt=-pass-through=-lgcc_s -plugin-opt=-pass-through=-lgcc -plugin-opt=-pass-through=-lc -plugin-opt=-pass-through=-lgcc_s -plugin-opt=-pass-through=-lgcc --build-id --eh-frame-hdr --hash-style=gnu -m elf_x86_64 -dynamic-linker /lib64/ld-linux-x86-64.so.2 -pie -o cmTC_ccb8c /usr/lib/gcc/x86_64-pc-linux-gnu/11.1.0/../../../../lib/Scrt1.o /usr/lib/gcc/x86_64-pc-linux-gnu/11.1.0/../../../../lib/crti.o /usr/lib/gcc/x86_64-pc-linux-gnu/11.1.0/crtbeginS.o -L/usr/lib/gcc/x86_64-pc-linux-gnu/11.1.0 -L/usr/lib/gcc/x86_64-pc-linux-gnu/11.1.0/../../../../lib -L/lib/../lib -L/usr/lib/../lib -L/usr/lib/gcc/x86_64-pc-linux-gnu/11.1.0/../../.. CMakeFiles/cmTC_ccb8c.dir/CMakeFortranCompilerABI.F.o -lgfortran -lm -lgcc_s -lgcc -lquadmath -lm -lgcc_s -lgcc -lc -lgcc_s -lgcc /usr/lib/gcc/x86_64-pc-linux-gnu/11.1.0/crtendS.o /usr/lib/gcc/x86_64-pc-linux-gnu/11.1.0/../../../../lib/crtn.o
COLLECT_GCC_OPTIONS='-v' '-o' 'cmTC_ccb8c' '-shared-libgcc' '-mtune=generic' '-march=x86-64' '-dumpdir' 'cmTC_ccb8c.'
make[1]: Leaving directory '/tmp/makepkg/deal-ii/src/build/CMakeFiles/CMakeTmp'
Parsed Fortran implicit include dir info from above output: rv=done
found start of include info
found start of implicit include info
add: [/usr/lib/gcc/x86_64-pc-linux-gnu/11.1.0/finclude]
add: [/usr/lib/gcc/x86_64-pc-linux-gnu/11.1.0/include]
add: [/usr/local/include]
add: [/usr/lib/gcc/x86_64-pc-linux-gnu/11.1.0/include-fixed]
add: [/usr/include]
end of search list found
collapse include dir [/usr/lib/gcc/x86_64-pc-linux-gnu/11.1.0/finclude] ==> [/usr/lib/gcc/x86_64-pc-linux-gnu/11.1.0/finclude]
collapse include dir [/usr/lib/gcc/x86_64-pc-linux-gnu/11.1.0/include] ==> [/usr/lib/gcc/x86_64-pc-linux-gnu/11.1.0/include]
collapse include dir [/usr/local/include] ==> [/usr/local/include]
collapse include dir [/usr/lib/gcc/x86_64-pc-linux-gnu/11.1.0/include-fixed] ==> [/usr/lib/gcc/x86_64-pc-linux-gnu/11.1.0/include-fixed]
collapse include dir [/usr/include] ==> [/usr/include]
implicit include dirs: [/usr/lib/gcc/x86_64-pc-linux-gnu/11.1.0/finclude;/usr/lib/gcc/x86_64-pc-linux-gnu/11.1.0/include;/usr/local/include;/usr/lib/gcc/x86_64-pc-linux-gnu/11.1.0/include-fixed;/usr/include]
Parsed Fortran implicit link information from above output:
link line regex: [^( *|.*[/\])(ld|CMAKE_LINK_STARTFILE-NOTFOUND|([^/\]+-)?ld|collect2)[^/\]*( |$)]
ignore line: [Change Dir: /tmp/makepkg/deal-ii/src/build/CMakeFiles/CMakeTmp]
ignore line: []
ignore line: [Run Build Command(s):/usr/bin/make -f Makefile cmTC_ccb8c/fast && /usr/bin/make -f CMakeFiles/cmTC_ccb8c.dir/build.make CMakeFiles/cmTC_ccb8c.dir/build]
ignore line: [make[1]: Entering directory '/tmp/makepkg/deal-ii/src/build/CMakeFiles/CMakeTmp']
ignore line: [Building Fortran object CMakeFiles/cmTC_ccb8c.dir/CMakeFortranCompilerABI.F.o]
ignore line: [/usr/bin/gfortran -v -c /usr/share/cmake-3.21/Modules/CMakeFortranCompilerABI.F -o CMakeFiles/cmTC_ccb8c.dir/CMakeFortranCompilerABI.F.o]
ignore line: [Using built-in specs.]
ignore line: [COLLECT_GCC=/usr/bin/gfortran]
ignore line: [Target: x86_64-pc-linux-gnu]
ignore line: [Configured with: /build/gcc/src/gcc/configure --prefix=/usr --libdir=/usr/lib --libexecdir=/usr/lib --mandir=/usr/share/man --infodir=/usr/share/info --with-bugurl=https://bugs.archlinux.org/ --enable-languages=c c++ ada fortran go lto objc obj-c++ d --with-isl --with-linker-hash-style=gnu --with-system-zlib --enable-__cxa_atexit --enable-cet=auto --enable-checking=release --enable-clocale=gnu --enable-default-pie --enable-default-ssp --enable-gnu-indirect-function --enable-gnu-unique-object --enable-install-libiberty --enable-linker-build-id --enable-lto --enable-multilib --enable-plugin --enable-shared --enable-threads=posix --disable-libssp --disable-libstdcxx-pch --disable-libunwind-exceptions --disable-werror gdc_include_dir=/usr/include/dlang/gdc]
ignore line: [Thread model: posix]
ignore line: [Supported LTO compression algorithms: zlib zstd]
ignore line: [gcc version 11.1.0 (GCC) ]
ignore line: [COLLECT_GCC_OPTIONS='-v' '-c' '-o' 'CMakeFiles/cmTC_ccb8c.dir/CMakeFortranCompilerABI.F.o' '-mtune=generic' '-march=x86-64' '-dumpdir' 'CMakeFiles/cmTC_ccb8c.dir/']
ignore line: [ /usr/lib/gcc/x86_64-pc-linux-gnu/11.1.0/f951 /usr/share/cmake-3.21/Modules/CMakeFortranCompilerABI.F -ffixed-form -cpp=/tmp/cc7liTdn.f90 -quiet -v /usr/share/cmake-3.21/Modules/CMakeFortranCompilerABI.F -quiet -dumpdir CMakeFiles/cmTC_ccb8c.dir/ -dumpbase CMakeFortranCompilerABI.F.F -dumpbase-ext .F -mtune=generic -march=x86-64 -version -fintrinsic-modules-path /usr/lib/gcc/x86_64-pc-linux-gnu/11.1.0/finclude -fpre-include=/usr/include/finclude/math-vector-fortran.h -o /tmp/ccpLNB0B.s]
ignore line: [GNU Fortran (GCC) version 11.1.0 (x86_64-pc-linux-gnu)]
ignore line: [ compiled by GNU C version 11.1.0 GMP version 6.2.1 MPFR version 4.1.0 MPC version 1.2.1 isl version isl-0.24-GMP]
ignore line: []
ignore line: [warning: MPFR header version 4.1.0 differs from library version 4.1.0-p13.]
ignore line: [GGC heuristics: --param ggc-min-expand=100 --param ggc-min-heapsize=131072]
ignore line: [ignoring nonexistent directory "/usr/lib/gcc/x86_64-pc-linux-gnu/11.1.0/../../../../x86_64-pc-linux-gnu/include"]
ignore line: [#include "..." search starts here:]
ignore line: [#include <...> search starts here:]
ignore line: [ /usr/lib/gcc/x86_64-pc-linux-gnu/11.1.0/finclude]
ignore line: [ /usr/lib/gcc/x86_64-pc-linux-gnu/11.1.0/include]
ignore line: [ /usr/local/include]
ignore line: [ /usr/lib/gcc/x86_64-pc-linux-gnu/11.1.0/include-fixed]
ignore line: [ /usr/include]
ignore line: [End of search list.]
ignore line: [GNU Fortran2008 (GCC) version 11.1.0 (x86_64-pc-linux-gnu)]
ignore line: [ compiled by GNU C version 11.1.0 GMP version 6.2.1 MPFR version 4.1.0 MPC version 1.2.1 isl version isl-0.24-GMP]
ignore line: []
ignore line: [warning: MPFR header version 4.1.0 differs from library version 4.1.0-p13.]
ignore line: [GGC heuristics: --param ggc-min-expand=100 --param ggc-min-heapsize=131072]
ignore line: [COLLECT_GCC_OPTIONS='-v' '-c' '-o' 'CMakeFiles/cmTC_ccb8c.dir/CMakeFortranCompilerABI.F.o' '-mtune=generic' '-march=x86-64' '-dumpdir' 'CMakeFiles/cmTC_ccb8c.dir/']
ignore line: [ as -v --64 -o CMakeFiles/cmTC_ccb8c.dir/CMakeFortranCompilerABI.F.o /tmp/ccpLNB0B.s]
ignore line: [GNU assembler version 2.36.1 (x86_64-pc-linux-gnu) using BFD version (GNU Binutils) 2.36.1]
ignore line: [COMPILER_PATH=/usr/lib/gcc/x86_64-pc-linux-gnu/11.1.0/:/usr/lib/gcc/x86_64-pc-linux-gnu/11.1.0/:/usr/lib/gcc/x86_64-pc-linux-gnu/:/usr/lib/gcc/x86_64-pc-linux-gnu/11.1.0/:/usr/lib/gcc/x86_64-pc-linux-gnu/]
ignore line: [LIBRARY_PATH=/usr/lib/gcc/x86_64-pc-linux-gnu/11.1.0/:/usr/lib/gcc/x86_64-pc-linux-gnu/11.1.0/../../../../lib/:/lib/../lib/:/usr/lib/../lib/:/usr/lib/gcc/x86_64-pc-linux-gnu/11.1.0/../../../:/lib/:/usr/lib/]
ignore line: [COLLECT_GCC_OPTIONS='-v' '-c' '-o' 'CMakeFiles/cmTC_ccb8c.dir/CMakeFortranCompilerABI.F.o' '-mtune=generic' '-march=x86-64' '-dumpdir' 'CMakeFiles/cmTC_ccb8c.dir/CMakeFortranCompilerABI.F.']
ignore line: [Linking Fortran executable cmTC_ccb8c]
ignore line: [/usr/bin/cmake -E cmake_link_script CMakeFiles/cmTC_ccb8c.dir/link.txt --verbose=1]
ignore line: [/usr/bin/gfortran -v CMakeFiles/cmTC_ccb8c.dir/CMakeFortranCompilerABI.F.o -o cmTC_ccb8c ]
ignore line: [Driving: /usr/bin/gfortran -v CMakeFiles/cmTC_ccb8c.dir/CMakeFortranCompilerABI.F.o -o cmTC_ccb8c -l gfortran -l m -shared-libgcc]
ignore line: [Using built-in specs.]
ignore line: [COLLECT_GCC=/usr/bin/gfortran]
ignore line: [COLLECT_LTO_WRAPPER=/usr/lib/gcc/x86_64-pc-linux-gnu/11.1.0/lto-wrapper]
ignore line: [Target: x86_64-pc-linux-gnu]
ignore line: [Configured with: /build/gcc/src/gcc/configure --prefix=/usr --libdir=/usr/lib --libexecdir=/usr/lib --mandir=/usr/share/man --infodir=/usr/share/info --with-bugurl=https://bugs.archlinux.org/ --enable-languages=c c++ ada fortran go lto objc obj-c++ d --with-isl --with-linker-hash-style=gnu --with-system-zlib --enable-__cxa_atexit --enable-cet=auto --enable-checking=release --enable-clocale=gnu --enable-default-pie --enable-default-ssp --enable-gnu-indirect-function --enable-gnu-unique-object --enable-install-libiberty --enable-linker-build-id --enable-lto --enable-multilib --enable-plugin --enable-shared --enable-threads=posix --disable-libssp --disable-libstdcxx-pch --disable-libunwind-exceptions --disable-werror gdc_include_dir=/usr/include/dlang/gdc]
ignore line: [Thread model: posix]
ignore line: [Supported LTO compression algorithms: zlib zstd]
ignore line: [gcc version 11.1.0 (GCC) ]
ignore line: [Reading specs from /usr/lib/gcc/x86_64-pc-linux-gnu/11.1.0/../../../../lib/libgfortran.spec]
ignore line: [rename spec lib to liborig]
ignore line: [COLLECT_GCC_OPTIONS='-v' '-o' 'cmTC_ccb8c' '-shared-libgcc' '-mtune=generic' '-march=x86-64' '-dumpdir' 'cmTC_ccb8c-']
ignore line: [COMPILER_PATH=/usr/lib/gcc/x86_64-pc-linux-gnu/11.1.0/:/usr/lib/gcc/x86_64-pc-linux-gnu/11.1.0/:/usr/lib/gcc/x86_64-pc-linux-gnu/:/usr/lib/gcc/x86_64-pc-linux-gnu/11.1.0/:/usr/lib/gcc/x86_64-pc-linux-gnu/]
ignore line: [LIBRARY_PATH=/usr/lib/gcc/x86_64-pc-linux-gnu/11.1.0/:/usr/lib/gcc/x86_64-pc-linux-gnu/11.1.0/../../../../lib/:/lib/../lib/:/usr/lib/../lib/:/usr/lib/gcc/x86_64-pc-linux-gnu/11.1.0/../../../:/lib/:/usr/lib/]
ignore line: [COLLECT_GCC_OPTIONS='-v' '-o' 'cmTC_ccb8c' '-shared-libgcc' '-mtune=generic' '-march=x86-64' '-dumpdir' 'cmTC_ccb8c.']
link line: [ /usr/lib/gcc/x86_64-pc-linux-gnu/11.1.0/collect2 -plugin /usr/lib/gcc/x86_64-pc-linux-gnu/11.1.0/liblto_plugin.so -plugin-opt=/usr/lib/gcc/x86_64-pc-linux-gnu/11.1.0/lto-wrapper -plugin-opt=-fresolution=/tmp/ccqoJCzi.res -plugin-opt=-pass-through=-lgcc_s -plugin-opt=-pass-through=-lgcc -plugin-opt=-pass-through=-lquadmath -plugin-opt=-pass-through=-lm -plugin-opt=-pass-through=-lgcc_s -plugin-opt=-pass-through=-lgcc -plugin-opt=-pass-through=-lc -plugin-opt=-pass-through=-lgcc_s -plugin-opt=-pass-through=-lgcc --build-id --eh-frame-hdr --hash-style=gnu -m elf_x86_64 -dynamic-linker /lib64/ld-linux-x86-64.so.2 -pie -o cmTC_ccb8c /usr/lib/gcc/x86_64-pc-linux-gnu/11.1.0/../../../../lib/Scrt1.o /usr/lib/gcc/x86_64-pc-linux-gnu/11.1.0/../../../../lib/crti.o /usr/lib/gcc/x86_64-pc-linux-gnu/11.1.0/crtbeginS.o -L/usr/lib/gcc/x86_64-pc-linux-gnu/11.1.0 -L/usr/lib/gcc/x86_64-pc-linux-gnu/11.1.0/../../../../lib -L/lib/../lib -L/usr/lib/../lib -L/usr/lib/gcc/x86_64-pc-linux-gnu/11.1.0/../../.. CMakeFiles/cmTC_ccb8c.dir/CMakeFortranCompilerABI.F.o -lgfortran -lm -lgcc_s -lgcc -lquadmath -lm -lgcc_s -lgcc -lc -lgcc_s -lgcc /usr/lib/gcc/x86_64-pc-linux-gnu/11.1.0/crtendS.o /usr/lib/gcc/x86_64-pc-linux-gnu/11.1.0/../../../../lib/crtn.o]
arg [/usr/lib/gcc/x86_64-pc-linux-gnu/11.1.0/collect2] ==> ignore
arg [-plugin] ==> ignore
arg [/usr/lib/gcc/x86_64-pc-linux-gnu/11.1.0/liblto_plugin.so] ==> ignore
arg [-plugin-opt=/usr/lib/gcc/x86_64-pc-linux-gnu/11.1.0/lto-wrapper] ==> ignore
arg [-plugin-opt=-fresolution=/tmp/ccqoJCzi.res] ==> ignore
arg [-plugin-opt=-pass-through=-lgcc_s] ==> ignore
arg [-plugin-opt=-pass-through=-lgcc] ==> ignore
arg [-plugin-opt=-pass-through=-lquadmath] ==> ignore
arg [-plugin-opt=-pass-through=-lm] ==> ignore
arg [-plugin-opt=-pass-through=-lgcc_s] ==> ignore
arg [-plugin-opt=-pass-through=-lgcc] ==> ignore
arg [-plugin-opt=-pass-through=-lc] ==> ignore
arg [-plugin-opt=-pass-through=-lgcc_s] ==> ignore
arg [-plugin-opt=-pass-through=-lgcc] ==> ignore
arg [--build-id] ==> ignore
arg [--eh-frame-hdr] ==> ignore
arg [--hash-style=gnu] ==> ignore
arg [-m] ==> ignore
arg [elf_x86_64] ==> ignore
arg [-dynamic-linker] ==> ignore
arg [/lib64/ld-linux-x86-64.so.2] ==> ignore
arg [-pie] ==> ignore
arg [-o] ==> ignore
arg [cmTC_ccb8c] ==> ignore
arg [/usr/lib/gcc/x86_64-pc-linux-gnu/11.1.0/../../../../lib/Scrt1.o] ==> obj [/usr/lib/gcc/x86_64-pc-linux-gnu/11.1.0/../../../../lib/Scrt1.o]
arg [/usr/lib/gcc/x86_64-pc-linux-gnu/11.1.0/../../../../lib/crti.o] ==> obj [/usr/lib/gcc/x86_64-pc-linux-gnu/11.1.0/../../../../lib/crti.o]
arg [/usr/lib/gcc/x86_64-pc-linux-gnu/11.1.0/crtbeginS.o] ==> obj [/usr/lib/gcc/x86_64-pc-linux-gnu/11.1.0/crtbeginS.o]
arg [-L/usr/lib/gcc/x86_64-pc-linux-gnu/11.1.0] ==> dir [/usr/lib/gcc/x86_64-pc-linux-gnu/11.1.0]
arg [-L/usr/lib/gcc/x86_64-pc-linux-gnu/11.1.0/../../../../lib] ==> dir [/usr/lib/gcc/x86_64-pc-linux-gnu/11.1.0/../../../../lib]
arg [-L/lib/../lib] ==> dir [/lib/../lib]
arg [-L/usr/lib/../lib] ==> dir [/usr/lib/../lib]
arg [-L/usr/lib/gcc/x86_64-pc-linux-gnu/11.1.0/../../..] ==> dir [/usr/lib/gcc/x86_64-pc-linux-gnu/11.1.0/../../..]
arg [CMakeFiles/cmTC_ccb8c.dir/CMakeFortranCompilerABI.F.o] ==> ignore
arg [-lgfortran] ==> lib [gfortran]
arg [-lm] ==> lib [m]
arg [-lgcc_s] ==> lib [gcc_s]
arg [-lgcc] ==> lib [gcc]
arg [-lquadmath] ==> lib [quadmath]
arg [-lm] ==> lib [m]
arg [-lgcc_s] ==> lib [gcc_s]
arg [-lgcc] ==> lib [gcc]
arg [-lc] ==> lib [c]
arg [-lgcc_s] ==> lib [gcc_s]
arg [-lgcc] ==> lib [gcc]
arg [/usr/lib/gcc/x86_64-pc-linux-gnu/11.1.0/crtendS.o] ==> obj [/usr/lib/gcc/x86_64-pc-linux-gnu/11.1.0/crtendS.o]
arg [/usr/lib/gcc/x86_64-pc-linux-gnu/11.1.0/../../../../lib/crtn.o] ==> obj [/usr/lib/gcc/x86_64-pc-linux-gnu/11.1.0/../../../../lib/crtn.o]
collapse obj [/usr/lib/gcc/x86_64-pc-linux-gnu/11.1.0/../../../../lib/Scrt1.o] ==> [/usr/lib/Scrt1.o]
collapse obj [/usr/lib/gcc/x86_64-pc-linux-gnu/11.1.0/../../../../lib/crti.o] ==> [/usr/lib/crti.o]
collapse obj [/usr/lib/gcc/x86_64-pc-linux-gnu/11.1.0/../../../../lib/crtn.o] ==> [/usr/lib/crtn.o]
collapse library dir [/usr/lib/gcc/x86_64-pc-linux-gnu/11.1.0] ==> [/usr/lib/gcc/x86_64-pc-linux-gnu/11.1.0]
collapse library dir [/usr/lib/gcc/x86_64-pc-linux-gnu/11.1.0/../../../../lib] ==> [/usr/lib]
collapse library dir [/lib/../lib] ==> [/lib]
collapse library dir [/usr/lib/../lib] ==> [/usr/lib]
collapse library dir [/usr/lib/gcc/x86_64-pc-linux-gnu/11.1.0/../../..] ==> [/usr/lib]
implicit libs: [gfortran;m;gcc_s;gcc;quadmath;m;gcc_s;gcc;c;gcc_s;gcc]
implicit objs: [/usr/lib/Scrt1.o;/usr/lib/crti.o;/usr/lib/gcc/x86_64-pc-linux-gnu/11.1.0/crtbeginS.o;/usr/lib/gcc/x86_64-pc-linux-gnu/11.1.0/crtendS.o;/usr/lib/crtn.o]
implicit dirs: [/usr/lib/gcc/x86_64-pc-linux-gnu/11.1.0;/usr/lib;/lib]
implicit fwks: []
Determining if the Fortran compiler supports Fortran 90 passed with the following output:
Change Dir: /tmp/makepkg/deal-ii/src/build/CMakeFiles/CMakeTmp
Run Build Command(s):/usr/bin/make -f Makefile cmTC_e030a/fast && /usr/bin/make -f CMakeFiles/cmTC_e030a.dir/build.make CMakeFiles/cmTC_e030a.dir/build
make[1]: Entering directory '/tmp/makepkg/deal-ii/src/build/CMakeFiles/CMakeTmp'
Building Fortran object CMakeFiles/cmTC_e030a.dir/testFortranCompilerF90.f90.o
/usr/bin/gfortran -c /tmp/makepkg/deal-ii/src/build/CMakeFiles/CMakeTmp/testFortranCompilerF90.f90 -o CMakeFiles/cmTC_e030a.dir/testFortranCompilerF90.f90.o
Linking Fortran executable cmTC_e030a
/usr/bin/cmake -E cmake_link_script CMakeFiles/cmTC_e030a.dir/link.txt --verbose=1
/usr/bin/gfortran CMakeFiles/cmTC_e030a.dir/testFortranCompilerF90.f90.o -o cmTC_e030a
make[1]: Leaving directory '/tmp/makepkg/deal-ii/src/build/CMakeFiles/CMakeTmp'
Performing C++ SOURCE FILE Test DEAL_II_HAVE_USABLE_USER_FLAGS_DEBUG succeeded with the following output:
Change Dir: /tmp/makepkg/deal-ii/src/build/CMakeFiles/CMakeTmp
Run Build Command(s):/usr/bin/make -f Makefile cmTC_09100/fast && /usr/bin/make -f CMakeFiles/cmTC_09100.dir/build.make CMakeFiles/cmTC_09100.dir/build
make[1]: Entering directory '/tmp/makepkg/deal-ii/src/build/CMakeFiles/CMakeTmp'
Building CXX object CMakeFiles/cmTC_09100.dir/src.cxx.o
/usr/bin/c++ -DDEAL_II_HAVE_USABLE_USER_FLAGS_DEBUG -march=x86-64 -mtune=generic -O2 -pipe -fno-plt -Wno-unknown-pragmas -Wno-cpp -o CMakeFiles/cmTC_09100.dir/src.cxx.o -c /tmp/makepkg/deal-ii/src/build/CMakeFiles/CMakeTmp/src.cxx
Linking CXX executable cmTC_09100
/usr/bin/cmake -E cmake_link_script CMakeFiles/cmTC_09100.dir/link.txt --verbose=1
/usr/bin/c++ -march=x86-64 -mtune=generic -O2 -pipe -fno-plt -Wno-unknown-pragmas -Wno-cpp -rdynamic CMakeFiles/cmTC_09100.dir/src.cxx.o -o cmTC_09100 -Wl,-O1,--sort-common,-z,relro,-z,now
make[1]: Leaving directory '/tmp/makepkg/deal-ii/src/build/CMakeFiles/CMakeTmp'
Source file was:
int main(){ return 0; }
Performing C++ SOURCE FILE Test DEAL_II_HAVE_USABLE_USER_FLAGS_RELEASE succeeded with the following output:
Change Dir: /tmp/makepkg/deal-ii/src/build/CMakeFiles/CMakeTmp
Run Build Command(s):/usr/bin/make -f Makefile cmTC_55bcf/fast && /usr/bin/make -f CMakeFiles/cmTC_55bcf.dir/build.make CMakeFiles/cmTC_55bcf.dir/build
make[1]: Entering directory '/tmp/makepkg/deal-ii/src/build/CMakeFiles/CMakeTmp'
Building CXX object CMakeFiles/cmTC_55bcf.dir/src.cxx.o
/usr/bin/c++ -DDEAL_II_HAVE_USABLE_USER_FLAGS_RELEASE -march=x86-64 -mtune=generic -O2 -pipe -fno-plt -Wno-unknown-pragmas -Wno-cpp -o CMakeFiles/cmTC_55bcf.dir/src.cxx.o -c /tmp/makepkg/deal-ii/src/build/CMakeFiles/CMakeTmp/src.cxx
Linking CXX executable cmTC_55bcf
/usr/bin/cmake -E cmake_link_script CMakeFiles/cmTC_55bcf.dir/link.txt --verbose=1
/usr/bin/c++ -march=x86-64 -mtune=generic -O2 -pipe -fno-plt -Wno-unknown-pragmas -Wno-cpp -rdynamic CMakeFiles/cmTC_55bcf.dir/src.cxx.o -o cmTC_55bcf -Wl,-O1,--sort-common,-z,relro,-z,now
make[1]: Leaving directory '/tmp/makepkg/deal-ii/src/build/CMakeFiles/CMakeTmp'
Source file was:
int main(){ return 0; }
Performing C++ SOURCE FILE Test DEAL_II_HAVE_FLAG_pedantic succeeded with the following output:
Change Dir: /tmp/makepkg/deal-ii/src/build/CMakeFiles/CMakeTmp
Run Build Command(s):/usr/bin/make -f Makefile cmTC_6084d/fast && /usr/bin/make -f CMakeFiles/cmTC_6084d.dir/build.make CMakeFiles/cmTC_6084d.dir/build
make[1]: Entering directory '/tmp/makepkg/deal-ii/src/build/CMakeFiles/CMakeTmp'
Building CXX object CMakeFiles/cmTC_6084d.dir/src.cxx.o
/usr/bin/c++ -DDEAL_II_HAVE_FLAG_pedantic -march=x86-64 -mtune=generic -O2 -pipe -fno-plt -Wno-unknown-pragmas -Wno-cpp -pedantic -o CMakeFiles/cmTC_6084d.dir/src.cxx.o -c /tmp/makepkg/deal-ii/src/build/CMakeFiles/CMakeTmp/src.cxx
Linking CXX executable cmTC_6084d
/usr/bin/cmake -E cmake_link_script CMakeFiles/cmTC_6084d.dir/link.txt --verbose=1
/usr/bin/c++ -march=x86-64 -mtune=generic -O2 -pipe -fno-plt -Wno-unknown-pragmas -Wno-cpp -rdynamic CMakeFiles/cmTC_6084d.dir/src.cxx.o -o cmTC_6084d -Wl,-O1,--sort-common,-z,relro,-z,now
make[1]: Leaving directory '/tmp/makepkg/deal-ii/src/build/CMakeFiles/CMakeTmp'
Source file was:
int main() { return 0; }
Performing C++ SOURCE FILE Test DEAL_II_HAVE_FLAG_fPIC succeeded with the following output:
Change Dir: /tmp/makepkg/deal-ii/src/build/CMakeFiles/CMakeTmp
Run Build Command(s):/usr/bin/make -f Makefile cmTC_b22ca/fast && /usr/bin/make -f CMakeFiles/cmTC_b22ca.dir/build.make CMakeFiles/cmTC_b22ca.dir/build
make[1]: Entering directory '/tmp/makepkg/deal-ii/src/build/CMakeFiles/CMakeTmp'
Building CXX object CMakeFiles/cmTC_b22ca.dir/src.cxx.o
/usr/bin/c++ -DDEAL_II_HAVE_FLAG_fPIC -march=x86-64 -mtune=generic -O2 -pipe -fno-plt -Wno-unknown-pragmas -Wno-cpp -fPIC -o CMakeFiles/cmTC_b22ca.dir/src.cxx.o -c /tmp/makepkg/deal-ii/src/build/CMakeFiles/CMakeTmp/src.cxx
Linking CXX executable cmTC_b22ca
/usr/bin/cmake -E cmake_link_script CMakeFiles/cmTC_b22ca.dir/link.txt --verbose=1
/usr/bin/c++ -march=x86-64 -mtune=generic -O2 -pipe -fno-plt -Wno-unknown-pragmas -Wno-cpp -rdynamic CMakeFiles/cmTC_b22ca.dir/src.cxx.o -o cmTC_b22ca -Wl,-O1,--sort-common,-z,relro,-z,now
make[1]: Leaving directory '/tmp/makepkg/deal-ii/src/build/CMakeFiles/CMakeTmp'
Source file was:
int main() { return 0; }
Performing C++ SOURCE FILE Test DEAL_II_HAVE_FLAG_Wall succeeded with the following output:
Change Dir: /tmp/makepkg/deal-ii/src/build/CMakeFiles/CMakeTmp
Run Build Command(s):/usr/bin/make -f Makefile cmTC_72e5d/fast && /usr/bin/make -f CMakeFiles/cmTC_72e5d.dir/build.make CMakeFiles/cmTC_72e5d.dir/build
make[1]: Entering directory '/tmp/makepkg/deal-ii/src/build/CMakeFiles/CMakeTmp'
Building CXX object CMakeFiles/cmTC_72e5d.dir/src.cxx.o
/usr/bin/c++ -DDEAL_II_HAVE_FLAG_Wall -march=x86-64 -mtune=generic -O2 -pipe -fno-plt -Wno-unknown-pragmas -Wno-cpp -Wall -o CMakeFiles/cmTC_72e5d.dir/src.cxx.o -c /tmp/makepkg/deal-ii/src/build/CMakeFiles/CMakeTmp/src.cxx
Linking CXX executable cmTC_72e5d
/usr/bin/cmake -E cmake_link_script CMakeFiles/cmTC_72e5d.dir/link.txt --verbose=1
/usr/bin/c++ -march=x86-64 -mtune=generic -O2 -pipe -fno-plt -Wno-unknown-pragmas -Wno-cpp -rdynamic CMakeFiles/cmTC_72e5d.dir/src.cxx.o -o cmTC_72e5d -Wl,-O1,--sort-common,-z,relro,-z,now
make[1]: Leaving directory '/tmp/makepkg/deal-ii/src/build/CMakeFiles/CMakeTmp'
Source file was:
int main() { return 0; }
Performing C++ SOURCE FILE Test DEAL_II_HAVE_FLAG_Wextra succeeded with the following output:
Change Dir: /tmp/makepkg/deal-ii/src/build/CMakeFiles/CMakeTmp
Run Build Command(s):/usr/bin/make -f Makefile cmTC_85e8e/fast && /usr/bin/make -f CMakeFiles/cmTC_85e8e.dir/build.make CMakeFiles/cmTC_85e8e.dir/build
make[1]: Entering directory '/tmp/makepkg/deal-ii/src/build/CMakeFiles/CMakeTmp'
Building CXX object CMakeFiles/cmTC_85e8e.dir/src.cxx.o
/usr/bin/c++ -DDEAL_II_HAVE_FLAG_Wextra -march=x86-64 -mtune=generic -O2 -pipe -fno-plt -Wno-unknown-pragmas -Wno-cpp -Wextra -o CMakeFiles/cmTC_85e8e.dir/src.cxx.o -c /tmp/makepkg/deal-ii/src/build/CMakeFiles/CMakeTmp/src.cxx
Linking CXX executable cmTC_85e8e
/usr/bin/cmake -E cmake_link_script CMakeFiles/cmTC_85e8e.dir/link.txt --verbose=1
/usr/bin/c++ -march=x86-64 -mtune=generic -O2 -pipe -fno-plt -Wno-unknown-pragmas -Wno-cpp -rdynamic CMakeFiles/cmTC_85e8e.dir/src.cxx.o -o cmTC_85e8e -Wl,-O1,--sort-common,-z,relro,-z,now
make[1]: Leaving directory '/tmp/makepkg/deal-ii/src/build/CMakeFiles/CMakeTmp'
Source file was:
int main() { return 0; }
Performing C++ SOURCE FILE Test DEAL_II_HAVE_FLAG_Wmissing_braces succeeded with the following output:
Change Dir: /tmp/makepkg/deal-ii/src/build/CMakeFiles/CMakeTmp
Run Build Command(s):/usr/bin/make -f Makefile cmTC_73dbd/fast && /usr/bin/make -f CMakeFiles/cmTC_73dbd.dir/build.make CMakeFiles/cmTC_73dbd.dir/build
make[1]: Entering directory '/tmp/makepkg/deal-ii/src/build/CMakeFiles/CMakeTmp'
Building CXX object CMakeFiles/cmTC_73dbd.dir/src.cxx.o
/usr/bin/c++ -DDEAL_II_HAVE_FLAG_Wmissing_braces -march=x86-64 -mtune=generic -O2 -pipe -fno-plt -Wno-unknown-pragmas -Wno-cpp -Wmissing-braces -o CMakeFiles/cmTC_73dbd.dir/src.cxx.o -c /tmp/makepkg/deal-ii/src/build/CMakeFiles/CMakeTmp/src.cxx
Linking CXX executable cmTC_73dbd
/usr/bin/cmake -E cmake_link_script CMakeFiles/cmTC_73dbd.dir/link.txt --verbose=1
/usr/bin/c++ -march=x86-64 -mtune=generic -O2 -pipe -fno-plt -Wno-unknown-pragmas -Wno-cpp -rdynamic CMakeFiles/cmTC_73dbd.dir/src.cxx.o -o cmTC_73dbd -Wl,-O1,--sort-common,-z,relro,-z,now
make[1]: Leaving directory '/tmp/makepkg/deal-ii/src/build/CMakeFiles/CMakeTmp'
Source file was:
int main() { return 0; }
Performing C++ SOURCE FILE Test DEAL_II_HAVE_FLAG_Woverloaded_virtual succeeded with the following output:
Change Dir: /tmp/makepkg/deal-ii/src/build/CMakeFiles/CMakeTmp
Run Build Command(s):/usr/bin/make -f Makefile cmTC_9b03d/fast && /usr/bin/make -f CMakeFiles/cmTC_9b03d.dir/build.make CMakeFiles/cmTC_9b03d.dir/build
make[1]: Entering directory '/tmp/makepkg/deal-ii/src/build/CMakeFiles/CMakeTmp'
Building CXX object CMakeFiles/cmTC_9b03d.dir/src.cxx.o
/usr/bin/c++ -DDEAL_II_HAVE_FLAG_Woverloaded_virtual -march=x86-64 -mtune=generic -O2 -pipe -fno-plt -Wno-unknown-pragmas -Wno-cpp -Woverloaded-virtual -o CMakeFiles/cmTC_9b03d.dir/src.cxx.o -c /tmp/makepkg/deal-ii/src/build/CMakeFiles/CMakeTmp/src.cxx
Linking CXX executable cmTC_9b03d
/usr/bin/cmake -E cmake_link_script CMakeFiles/cmTC_9b03d.dir/link.txt --verbose=1
/usr/bin/c++ -march=x86-64 -mtune=generic -O2 -pipe -fno-plt -Wno-unknown-pragmas -Wno-cpp -rdynamic CMakeFiles/cmTC_9b03d.dir/src.cxx.o -o cmTC_9b03d -Wl,-O1,--sort-common,-z,relro,-z,now
make[1]: Leaving directory '/tmp/makepkg/deal-ii/src/build/CMakeFiles/CMakeTmp'
Source file was:
int main() { return 0; }
Performing C++ SOURCE FILE Test DEAL_II_HAVE_FLAG_Wpointer_arith succeeded with the following output:
Change Dir: /tmp/makepkg/deal-ii/src/build/CMakeFiles/CMakeTmp
Run Build Command(s):/usr/bin/make -f Makefile cmTC_64012/fast && /usr/bin/make -f CMakeFiles/cmTC_64012.dir/build.make CMakeFiles/cmTC_64012.dir/build
make[1]: Entering directory '/tmp/makepkg/deal-ii/src/build/CMakeFiles/CMakeTmp'
Building CXX object CMakeFiles/cmTC_64012.dir/src.cxx.o
/usr/bin/c++ -DDEAL_II_HAVE_FLAG_Wpointer_arith -march=x86-64 -mtune=generic -O2 -pipe -fno-plt -Wno-unknown-pragmas -Wno-cpp -Wpointer-arith -o CMakeFiles/cmTC_64012.dir/src.cxx.o -c /tmp/makepkg/deal-ii/src/build/CMakeFiles/CMakeTmp/src.cxx
Linking CXX executable cmTC_64012
/usr/bin/cmake -E cmake_link_script CMakeFiles/cmTC_64012.dir/link.txt --verbose=1
/usr/bin/c++ -march=x86-64 -mtune=generic -O2 -pipe -fno-plt -Wno-unknown-pragmas -Wno-cpp -rdynamic CMakeFiles/cmTC_64012.dir/src.cxx.o -o cmTC_64012 -Wl,-O1,--sort-common,-z,relro,-z,now
make[1]: Leaving directory '/tmp/makepkg/deal-ii/src/build/CMakeFiles/CMakeTmp'
Source file was:
int main() { return 0; }
Performing C++ SOURCE FILE Test DEAL_II_HAVE_FLAG_Wsign_compare succeeded with the following output:
Change Dir: /tmp/makepkg/deal-ii/src/build/CMakeFiles/CMakeTmp
Run Build Command(s):/usr/bin/make -f Makefile cmTC_36dde/fast && /usr/bin/make -f CMakeFiles/cmTC_36dde.dir/build.make CMakeFiles/cmTC_36dde.dir/build
make[1]: Entering directory '/tmp/makepkg/deal-ii/src/build/CMakeFiles/CMakeTmp'
Building CXX object CMakeFiles/cmTC_36dde.dir/src.cxx.o
/usr/bin/c++ -DDEAL_II_HAVE_FLAG_Wsign_compare -march=x86-64 -mtune=generic -O2 -pipe -fno-plt -Wno-unknown-pragmas -Wno-cpp -Wsign-compare -o CMakeFiles/cmTC_36dde.dir/src.cxx.o -c /tmp/makepkg/deal-ii/src/build/CMakeFiles/CMakeTmp/src.cxx
Linking CXX executable cmTC_36dde
/usr/bin/cmake -E cmake_link_script CMakeFiles/cmTC_36dde.dir/link.txt --verbose=1
/usr/bin/c++ -march=x86-64 -mtune=generic -O2 -pipe -fno-plt -Wno-unknown-pragmas -Wno-cpp -rdynamic CMakeFiles/cmTC_36dde.dir/src.cxx.o -o cmTC_36dde -Wl,-O1,--sort-common,-z,relro,-z,now
make[1]: Leaving directory '/tmp/makepkg/deal-ii/src/build/CMakeFiles/CMakeTmp'
Source file was:
int main() { return 0; }
Performing C++ SOURCE FILE Test DEAL_II_HAVE_FLAG_Wsuggest_override succeeded with the following output:
Change Dir: /tmp/makepkg/deal-ii/src/build/CMakeFiles/CMakeTmp
Run Build Command(s):/usr/bin/make -f Makefile cmTC_c7e23/fast && /usr/bin/make -f CMakeFiles/cmTC_c7e23.dir/build.make CMakeFiles/cmTC_c7e23.dir/build
make[1]: Entering directory '/tmp/makepkg/deal-ii/src/build/CMakeFiles/CMakeTmp'
Building CXX object CMakeFiles/cmTC_c7e23.dir/src.cxx.o
/usr/bin/c++ -DDEAL_II_HAVE_FLAG_Wsuggest_override -march=x86-64 -mtune=generic -O2 -pipe -fno-plt -Wno-unknown-pragmas -Wno-cpp -Wsuggest-override -o CMakeFiles/cmTC_c7e23.dir/src.cxx.o -c /tmp/makepkg/deal-ii/src/build/CMakeFiles/CMakeTmp/src.cxx
Linking CXX executable cmTC_c7e23
/usr/bin/cmake -E cmake_link_script CMakeFiles/cmTC_c7e23.dir/link.txt --verbose=1
/usr/bin/c++ -march=x86-64 -mtune=generic -O2 -pipe -fno-plt -Wno-unknown-pragmas -Wno-cpp -rdynamic CMakeFiles/cmTC_c7e23.dir/src.cxx.o -o cmTC_c7e23 -Wl,-O1,--sort-common,-z,relro,-z,now
make[1]: Leaving directory '/tmp/makepkg/deal-ii/src/build/CMakeFiles/CMakeTmp'
Source file was:
int main() { return 0; }
Performing C++ SOURCE FILE Test DEAL_II_HAVE_FLAG_Wswitch succeeded with the following output:
Change Dir: /tmp/makepkg/deal-ii/src/build/CMakeFiles/CMakeTmp
Run Build Command(s):/usr/bin/make -f Makefile cmTC_0d458/fast && /usr/bin/make -f CMakeFiles/cmTC_0d458.dir/build.make CMakeFiles/cmTC_0d458.dir/build
make[1]: Entering directory '/tmp/makepkg/deal-ii/src/build/CMakeFiles/CMakeTmp'
Building CXX object CMakeFiles/cmTC_0d458.dir/src.cxx.o
/usr/bin/c++ -DDEAL_II_HAVE_FLAG_Wswitch -march=x86-64 -mtune=generic -O2 -pipe -fno-plt -Wno-unknown-pragmas -Wno-cpp -Wswitch -o CMakeFiles/cmTC_0d458.dir/src.cxx.o -c /tmp/makepkg/deal-ii/src/build/CMakeFiles/CMakeTmp/src.cxx
Linking CXX executable cmTC_0d458
/usr/bin/cmake -E cmake_link_script CMakeFiles/cmTC_0d458.dir/link.txt --verbose=1
/usr/bin/c++ -march=x86-64 -mtune=generic -O2 -pipe -fno-plt -Wno-unknown-pragmas -Wno-cpp -rdynamic CMakeFiles/cmTC_0d458.dir/src.cxx.o -o cmTC_0d458 -Wl,-O1,--sort-common,-z,relro,-z,now
make[1]: Leaving directory '/tmp/makepkg/deal-ii/src/build/CMakeFiles/CMakeTmp'
Source file was:
int main() { return 0; }
Performing C++ SOURCE FILE Test DEAL_II_HAVE_FLAG_Wsynth succeeded with the following output:
Change Dir: /tmp/makepkg/deal-ii/src/build/CMakeFiles/CMakeTmp
Run Build Command(s):/usr/bin/make -f Makefile cmTC_5e28c/fast && /usr/bin/make -f CMakeFiles/cmTC_5e28c.dir/build.make CMakeFiles/cmTC_5e28c.dir/build
make[1]: Entering directory '/tmp/makepkg/deal-ii/src/build/CMakeFiles/CMakeTmp'
Building CXX object CMakeFiles/cmTC_5e28c.dir/src.cxx.o
/usr/bin/c++ -DDEAL_II_HAVE_FLAG_Wsynth -march=x86-64 -mtune=generic -O2 -pipe -fno-plt -Wno-unknown-pragmas -Wno-cpp -Wsynth -o CMakeFiles/cmTC_5e28c.dir/src.cxx.o -c /tmp/makepkg/deal-ii/src/build/CMakeFiles/CMakeTmp/src.cxx
Linking CXX executable cmTC_5e28c
/usr/bin/cmake -E cmake_link_script CMakeFiles/cmTC_5e28c.dir/link.txt --verbose=1
/usr/bin/c++ -march=x86-64 -mtune=generic -O2 -pipe -fno-plt -Wno-unknown-pragmas -Wno-cpp -rdynamic CMakeFiles/cmTC_5e28c.dir/src.cxx.o -o cmTC_5e28c -Wl,-O1,--sort-common,-z,relro,-z,now
make[1]: Leaving directory '/tmp/makepkg/deal-ii/src/build/CMakeFiles/CMakeTmp'
Source file was:
int main() { return 0; }
Performing C++ SOURCE FILE Test DEAL_II_HAVE_FLAG_Wwrite_strings succeeded with the following output:
Change Dir: /tmp/makepkg/deal-ii/src/build/CMakeFiles/CMakeTmp
Run Build Command(s):/usr/bin/make -f Makefile cmTC_4e478/fast && /usr/bin/make -f CMakeFiles/cmTC_4e478.dir/build.make CMakeFiles/cmTC_4e478.dir/build
make[1]: Entering directory '/tmp/makepkg/deal-ii/src/build/CMakeFiles/CMakeTmp'
Building CXX object CMakeFiles/cmTC_4e478.dir/src.cxx.o
/usr/bin/c++ -DDEAL_II_HAVE_FLAG_Wwrite_strings -march=x86-64 -mtune=generic -O2 -pipe -fno-plt -Wno-unknown-pragmas -Wno-cpp -Wwrite-strings -o CMakeFiles/cmTC_4e478.dir/src.cxx.o -c /tmp/makepkg/deal-ii/src/build/CMakeFiles/CMakeTmp/src.cxx
Linking CXX executable cmTC_4e478
/usr/bin/cmake -E cmake_link_script CMakeFiles/cmTC_4e478.dir/link.txt --verbose=1
/usr/bin/c++ -march=x86-64 -mtune=generic -O2 -pipe -fno-plt -Wno-unknown-pragmas -Wno-cpp -rdynamic CMakeFiles/cmTC_4e478.dir/src.cxx.o -o cmTC_4e478 -Wl,-O1,--sort-common,-z,relro,-z,now
make[1]: Leaving directory '/tmp/makepkg/deal-ii/src/build/CMakeFiles/CMakeTmp'
Source file was:
int main() { return 0; }
Performing C++ SOURCE FILE Test DEAL_II_HAVE_FLAG_Wno_placement_new succeeded with the following output:
Change Dir: /tmp/makepkg/deal-ii/src/build/CMakeFiles/CMakeTmp
Run Build Command(s):/usr/bin/make -f Makefile cmTC_2161b/fast && /usr/bin/make -f CMakeFiles/cmTC_2161b.dir/build.make CMakeFiles/cmTC_2161b.dir/build
make[1]: Entering directory '/tmp/makepkg/deal-ii/src/build/CMakeFiles/CMakeTmp'
Building CXX object CMakeFiles/cmTC_2161b.dir/src.cxx.o
/usr/bin/c++ -DDEAL_II_HAVE_FLAG_Wno_placement_new -march=x86-64 -mtune=generic -O2 -pipe -fno-plt -Wno-unknown-pragmas -Wno-cpp -Wplacement-new -o CMakeFiles/cmTC_2161b.dir/src.cxx.o -c /tmp/makepkg/deal-ii/src/build/CMakeFiles/CMakeTmp/src.cxx
Linking CXX executable cmTC_2161b
/usr/bin/cmake -E cmake_link_script CMakeFiles/cmTC_2161b.dir/link.txt --verbose=1
/usr/bin/c++ -march=x86-64 -mtune=generic -O2 -pipe -fno-plt -Wno-unknown-pragmas -Wno-cpp -rdynamic CMakeFiles/cmTC_2161b.dir/src.cxx.o -o cmTC_2161b -Wl,-O1,--sort-common,-z,relro,-z,now
make[1]: Leaving directory '/tmp/makepkg/deal-ii/src/build/CMakeFiles/CMakeTmp'
Source file was:
int main() { return 0; }
Performing C++ SOURCE FILE Test DEAL_II_HAVE_FLAG_Wno_deprecated_declarations succeeded with the following output:
Change Dir: /tmp/makepkg/deal-ii/src/build/CMakeFiles/CMakeTmp
Run Build Command(s):/usr/bin/make -f Makefile cmTC_7b893/fast && /usr/bin/make -f CMakeFiles/cmTC_7b893.dir/build.make CMakeFiles/cmTC_7b893.dir/build
make[1]: Entering directory '/tmp/makepkg/deal-ii/src/build/CMakeFiles/CMakeTmp'
Building CXX object CMakeFiles/cmTC_7b893.dir/src.cxx.o
/usr/bin/c++ -DDEAL_II_HAVE_FLAG_Wno_deprecated_declarations -march=x86-64 -mtune=generic -O2 -pipe -fno-plt -Wno-unknown-pragmas -Wno-cpp -Wdeprecated-declarations -o CMakeFiles/cmTC_7b893.dir/src.cxx.o -c /tmp/makepkg/deal-ii/src/build/CMakeFiles/CMakeTmp/src.cxx
Linking CXX executable cmTC_7b893
/usr/bin/cmake -E cmake_link_script CMakeFiles/cmTC_7b893.dir/link.txt --verbose=1
/usr/bin/c++ -march=x86-64 -mtune=generic -O2 -pipe -fno-plt -Wno-unknown-pragmas -Wno-cpp -rdynamic CMakeFiles/cmTC_7b893.dir/src.cxx.o -o cmTC_7b893 -Wl,-O1,--sort-common,-z,relro,-z,now
make[1]: Leaving directory '/tmp/makepkg/deal-ii/src/build/CMakeFiles/CMakeTmp'
Source file was:
int main() { return 0; }
Performing C++ SOURCE FILE Test DEAL_II_HAVE_FLAG_Wno_literal_suffix succeeded with the following output:
Change Dir: /tmp/makepkg/deal-ii/src/build/CMakeFiles/CMakeTmp
Run Build Command(s):/usr/bin/make -f Makefile cmTC_7cdb1/fast && /usr/bin/make -f CMakeFiles/cmTC_7cdb1.dir/build.make CMakeFiles/cmTC_7cdb1.dir/build
make[1]: Entering directory '/tmp/makepkg/deal-ii/src/build/CMakeFiles/CMakeTmp'
Building CXX object CMakeFiles/cmTC_7cdb1.dir/src.cxx.o
/usr/bin/c++ -DDEAL_II_HAVE_FLAG_Wno_literal_suffix -march=x86-64 -mtune=generic -O2 -pipe -fno-plt -Wno-unknown-pragmas -Wno-cpp -Wliteral-suffix -o CMakeFiles/cmTC_7cdb1.dir/src.cxx.o -c /tmp/makepkg/deal-ii/src/build/CMakeFiles/CMakeTmp/src.cxx
Linking CXX executable cmTC_7cdb1
/usr/bin/cmake -E cmake_link_script CMakeFiles/cmTC_7cdb1.dir/link.txt --verbose=1
/usr/bin/c++ -march=x86-64 -mtune=generic -O2 -pipe -fno-plt -Wno-unknown-pragmas -Wno-cpp -rdynamic CMakeFiles/cmTC_7cdb1.dir/src.cxx.o -o cmTC_7cdb1 -Wl,-O1,--sort-common,-z,relro,-z,now
make[1]: Leaving directory '/tmp/makepkg/deal-ii/src/build/CMakeFiles/CMakeTmp'
Source file was:
int main() { return 0; }
Performing C++ SOURCE FILE Test DEAL_II_HAVE_FLAG_Wno_psabi succeeded with the following output:
Change Dir: /tmp/makepkg/deal-ii/src/build/CMakeFiles/CMakeTmp
Run Build Command(s):/usr/bin/make -f Makefile cmTC_1ca33/fast && /usr/bin/make -f CMakeFiles/cmTC_1ca33.dir/build.make CMakeFiles/cmTC_1ca33.dir/build
make[1]: Entering directory '/tmp/makepkg/deal-ii/src/build/CMakeFiles/CMakeTmp'
Building CXX object CMakeFiles/cmTC_1ca33.dir/src.cxx.o
/usr/bin/c++ -DDEAL_II_HAVE_FLAG_Wno_psabi -march=x86-64 -mtune=generic -O2 -pipe -fno-plt -Wno-unknown-pragmas -Wno-cpp -Wpsabi -o CMakeFiles/cmTC_1ca33.dir/src.cxx.o -c /tmp/makepkg/deal-ii/src/build/CMakeFiles/CMakeTmp/src.cxx
Linking CXX executable cmTC_1ca33
/usr/bin/cmake -E cmake_link_script CMakeFiles/cmTC_1ca33.dir/link.txt --verbose=1
/usr/bin/c++ -march=x86-64 -mtune=generic -O2 -pipe -fno-plt -Wno-unknown-pragmas -Wno-cpp -rdynamic CMakeFiles/cmTC_1ca33.dir/src.cxx.o -o cmTC_1ca33 -Wl,-O1,--sort-common,-z,relro,-z,now
make[1]: Leaving directory '/tmp/makepkg/deal-ii/src/build/CMakeFiles/CMakeTmp'
Source file was:
int main() { return 0; }
Performing C++ SOURCE FILE Test DEAL_II_HAVE_FLAG_Wno_class_memaccess succeeded with the following output:
Change Dir: /tmp/makepkg/deal-ii/src/build/CMakeFiles/CMakeTmp
Run Build Command(s):/usr/bin/make -f Makefile cmTC_541c9/fast && /usr/bin/make -f CMakeFiles/cmTC_541c9.dir/build.make CMakeFiles/cmTC_541c9.dir/build
make[1]: Entering directory '/tmp/makepkg/deal-ii/src/build/CMakeFiles/CMakeTmp'
Building CXX object CMakeFiles/cmTC_541c9.dir/src.cxx.o
/usr/bin/c++ -DDEAL_II_HAVE_FLAG_Wno_class_memaccess -march=x86-64 -mtune=generic -O2 -pipe -fno-plt -Wno-unknown-pragmas -Wno-cpp -Wclass-memaccess -o CMakeFiles/cmTC_541c9.dir/src.cxx.o -c /tmp/makepkg/deal-ii/src/build/CMakeFiles/CMakeTmp/src.cxx
Linking CXX executable cmTC_541c9
/usr/bin/cmake -E cmake_link_script CMakeFiles/cmTC_541c9.dir/link.txt --verbose=1
/usr/bin/c++ -march=x86-64 -mtune=generic -O2 -pipe -fno-plt -Wno-unknown-pragmas -Wno-cpp -rdynamic CMakeFiles/cmTC_541c9.dir/src.cxx.o -o cmTC_541c9 -Wl,-O1,--sort-common,-z,relro,-z,now
make[1]: Leaving directory '/tmp/makepkg/deal-ii/src/build/CMakeFiles/CMakeTmp'
Source file was:
int main() { return 0; }
Performing C++ SOURCE FILE Test DEAL_II_HAVE_FLAG_funroll_loops succeeded with the following output:
Change Dir: /tmp/makepkg/deal-ii/src/build/CMakeFiles/CMakeTmp
Run Build Command(s):/usr/bin/make -f Makefile cmTC_3cf01/fast && /usr/bin/make -f CMakeFiles/cmTC_3cf01.dir/build.make CMakeFiles/cmTC_3cf01.dir/build
make[1]: Entering directory '/tmp/makepkg/deal-ii/src/build/CMakeFiles/CMakeTmp'
Building CXX object CMakeFiles/cmTC_3cf01.dir/src.cxx.o
/usr/bin/c++ -DDEAL_II_HAVE_FLAG_funroll_loops -march=x86-64 -mtune=generic -O2 -pipe -fno-plt -Wno-unknown-pragmas -Wno-cpp -funroll-loops -o CMakeFiles/cmTC_3cf01.dir/src.cxx.o -c /tmp/makepkg/deal-ii/src/build/CMakeFiles/CMakeTmp/src.cxx
Linking CXX executable cmTC_3cf01
/usr/bin/cmake -E cmake_link_script CMakeFiles/cmTC_3cf01.dir/link.txt --verbose=1
/usr/bin/c++ -march=x86-64 -mtune=generic -O2 -pipe -fno-plt -Wno-unknown-pragmas -Wno-cpp -rdynamic CMakeFiles/cmTC_3cf01.dir/src.cxx.o -o cmTC_3cf01 -Wl,-O1,--sort-common,-z,relro,-z,now
make[1]: Leaving directory '/tmp/makepkg/deal-ii/src/build/CMakeFiles/CMakeTmp'
Source file was:
int main() { return 0; }
Performing C++ SOURCE FILE Test DEAL_II_HAVE_FLAG_funroll_all_loops succeeded with the following output:
Change Dir: /tmp/makepkg/deal-ii/src/build/CMakeFiles/CMakeTmp
Run Build Command(s):/usr/bin/make -f Makefile cmTC_11e41/fast && /usr/bin/make -f CMakeFiles/cmTC_11e41.dir/build.make CMakeFiles/cmTC_11e41.dir/build
make[1]: Entering directory '/tmp/makepkg/deal-ii/src/build/CMakeFiles/CMakeTmp'
Building CXX object CMakeFiles/cmTC_11e41.dir/src.cxx.o
/usr/bin/c++ -DDEAL_II_HAVE_FLAG_funroll_all_loops -march=x86-64 -mtune=generic -O2 -pipe -fno-plt -Wno-unknown-pragmas -Wno-cpp -funroll-all-loops -o CMakeFiles/cmTC_11e41.dir/src.cxx.o -c /tmp/makepkg/deal-ii/src/build/CMakeFiles/CMakeTmp/src.cxx
Linking CXX executable cmTC_11e41
/usr/bin/cmake -E cmake_link_script CMakeFiles/cmTC_11e41.dir/link.txt --verbose=1
/usr/bin/c++ -march=x86-64 -mtune=generic -O2 -pipe -fno-plt -Wno-unknown-pragmas -Wno-cpp -rdynamic CMakeFiles/cmTC_11e41.dir/src.cxx.o -o cmTC_11e41 -Wl,-O1,--sort-common,-z,relro,-z,now
make[1]: Leaving directory '/tmp/makepkg/deal-ii/src/build/CMakeFiles/CMakeTmp'
Source file was:
int main() { return 0; }
Performing C++ SOURCE FILE Test DEAL_II_HAVE_FLAG_fstrict_aliasing succeeded with the following output:
Change Dir: /tmp/makepkg/deal-ii/src/build/CMakeFiles/CMakeTmp
Run Build Command(s):/usr/bin/make -f Makefile cmTC_bd444/fast && /usr/bin/make -f CMakeFiles/cmTC_bd444.dir/build.make CMakeFiles/cmTC_bd444.dir/build
make[1]: Entering directory '/tmp/makepkg/deal-ii/src/build/CMakeFiles/CMakeTmp'
Building CXX object CMakeFiles/cmTC_bd444.dir/src.cxx.o
/usr/bin/c++ -DDEAL_II_HAVE_FLAG_fstrict_aliasing -march=x86-64 -mtune=generic -O2 -pipe -fno-plt -Wno-unknown-pragmas -Wno-cpp -fstrict-aliasing -o CMakeFiles/cmTC_bd444.dir/src.cxx.o -c /tmp/makepkg/deal-ii/src/build/CMakeFiles/CMakeTmp/src.cxx
Linking CXX executable cmTC_bd444
/usr/bin/cmake -E cmake_link_script CMakeFiles/cmTC_bd444.dir/link.txt --verbose=1
/usr/bin/c++ -march=x86-64 -mtune=generic -O2 -pipe -fno-plt -Wno-unknown-pragmas -Wno-cpp -rdynamic CMakeFiles/cmTC_bd444.dir/src.cxx.o -o cmTC_bd444 -Wl,-O1,--sort-common,-z,relro,-z,now
make[1]: Leaving directory '/tmp/makepkg/deal-ii/src/build/CMakeFiles/CMakeTmp'
Source file was:
int main() { return 0; }
Performing C++ SOURCE FILE Test DEAL_II_HAVE_FLAG_Wno_unused_local_typedefs succeeded with the following output:
Change Dir: /tmp/makepkg/deal-ii/src/build/CMakeFiles/CMakeTmp
Run Build Command(s):/usr/bin/make -f Makefile cmTC_ed828/fast && /usr/bin/make -f CMakeFiles/cmTC_ed828.dir/build.make CMakeFiles/cmTC_ed828.dir/build
make[1]: Entering directory '/tmp/makepkg/deal-ii/src/build/CMakeFiles/CMakeTmp'
Building CXX object CMakeFiles/cmTC_ed828.dir/src.cxx.o
/usr/bin/c++ -DDEAL_II_HAVE_FLAG_Wno_unused_local_typedefs -march=x86-64 -mtune=generic -O2 -pipe -fno-plt -Wno-unknown-pragmas -Wno-cpp -Wunused-local-typedefs -o CMakeFiles/cmTC_ed828.dir/src.cxx.o -c /tmp/makepkg/deal-ii/src/build/CMakeFiles/CMakeTmp/src.cxx
Linking CXX executable cmTC_ed828
/usr/bin/cmake -E cmake_link_script CMakeFiles/cmTC_ed828.dir/link.txt --verbose=1
/usr/bin/c++ -march=x86-64 -mtune=generic -O2 -pipe -fno-plt -Wno-unknown-pragmas -Wno-cpp -rdynamic CMakeFiles/cmTC_ed828.dir/src.cxx.o -o cmTC_ed828 -Wl,-O1,--sort-common,-z,relro,-z,now
make[1]: Leaving directory '/tmp/makepkg/deal-ii/src/build/CMakeFiles/CMakeTmp'
Source file was:
int main() { return 0; }
Performing C++ SOURCE FILE Test DEAL_II_HAVE_FLAG_ggdb succeeded with the following output:
Change Dir: /tmp/makepkg/deal-ii/src/build/CMakeFiles/CMakeTmp
Run Build Command(s):/usr/bin/make -f Makefile cmTC_3f46a/fast && /usr/bin/make -f CMakeFiles/cmTC_3f46a.dir/build.make CMakeFiles/cmTC_3f46a.dir/build
make[1]: Entering directory '/tmp/makepkg/deal-ii/src/build/CMakeFiles/CMakeTmp'
Building CXX object CMakeFiles/cmTC_3f46a.dir/src.cxx.o
/usr/bin/c++ -DDEAL_II_HAVE_FLAG_ggdb -march=x86-64 -mtune=generic -O2 -pipe -fno-plt -Wno-unknown-pragmas -Wno-cpp -ggdb -o CMakeFiles/cmTC_3f46a.dir/src.cxx.o -c /tmp/makepkg/deal-ii/src/build/CMakeFiles/CMakeTmp/src.cxx
Linking CXX executable cmTC_3f46a
/usr/bin/cmake -E cmake_link_script CMakeFiles/cmTC_3f46a.dir/link.txt --verbose=1
/usr/bin/c++ -march=x86-64 -mtune=generic -O2 -pipe -fno-plt -Wno-unknown-pragmas -Wno-cpp -rdynamic CMakeFiles/cmTC_3f46a.dir/src.cxx.o -o cmTC_3f46a -Wl,-O1,--sort-common,-z,relro,-z,now
make[1]: Leaving directory '/tmp/makepkg/deal-ii/src/build/CMakeFiles/CMakeTmp'
Source file was:
int main() { return 0; }
Performing C++ SOURCE FILE Test DEAL_II_HAVE_SSE2 succeeded with the following compile output:
Change Dir: /tmp/makepkg/deal-ii/src/build/CMakeFiles/CMakeTmp
Run Build Command(s):/usr/bin/make -f Makefile cmTC_57559/fast && /usr/bin/make -f CMakeFiles/cmTC_57559.dir/build.make CMakeFiles/cmTC_57559.dir/build
make[1]: Entering directory '/tmp/makepkg/deal-ii/src/build/CMakeFiles/CMakeTmp'
Building CXX object CMakeFiles/cmTC_57559.dir/src.cxx.o
/usr/bin/c++ -DDEAL_II_HAVE_SSE2 -march=x86-64 -mtune=generic -O2 -pipe -fno-plt -Wno-unknown-pragmas -Wno-cpp -o CMakeFiles/cmTC_57559.dir/src.cxx.o -c /tmp/makepkg/deal-ii/src/build/CMakeFiles/CMakeTmp/src.cxx
Linking CXX executable cmTC_57559
/usr/bin/cmake -E cmake_link_script CMakeFiles/cmTC_57559.dir/link.txt --verbose=1
/usr/bin/c++ -march=x86-64 -mtune=generic -O2 -pipe -fno-plt -Wno-unknown-pragmas -Wno-cpp -rdynamic CMakeFiles/cmTC_57559.dir/src.cxx.o -o cmTC_57559 -Wl,-O1,--sort-common,-z,relro,-z,now
make[1]: Leaving directory '/tmp/makepkg/deal-ii/src/build/CMakeFiles/CMakeTmp'
...and run output:
Return value: 1
Source file was:
#include <x86intrin.h>
int main()
{
__m128d a, b;
const unsigned int vector_bytes = sizeof(__m128d);
const int n_vectors = vector_bytes/sizeof(double);
__m128d * data =
reinterpret_cast<__m128d*>(_mm_malloc (2*vector_bytes, vector_bytes));
double * ptr = reinterpret_cast<double*>(&a);
ptr[0] = static_cast<volatile double>(1.0);
for (int i=1; i<n_vectors; ++i)
ptr[i] = 0.0;
b = _mm_set1_pd (static_cast<volatile double>(2.25));
data[0] = _mm_add_pd (a, b);
data[1] = _mm_mul_pd (b, data[0]);
ptr = reinterpret_cast<double*>(&data[1]);
int return_value = 0;
if (ptr[0] != 7.3125)
return_value = 1;
for (int i=1; i<n_vectors; ++i)
if (ptr[i] != 5.0625)
return_value = 1;
_mm_free (data);
return return_value;
}
Performing C++ SOURCE FILE Test DEAL_II_HAVE_OPENMP_SIMD succeeded with the following output:
Change Dir: /tmp/makepkg/deal-ii/src/build/CMakeFiles/CMakeTmp
Run Build Command(s):/usr/bin/make -f Makefile cmTC_93995/fast && /usr/bin/make -f CMakeFiles/cmTC_93995.dir/build.make CMakeFiles/cmTC_93995.dir/build
make[1]: Entering directory '/tmp/makepkg/deal-ii/src/build/CMakeFiles/CMakeTmp'
Building CXX object CMakeFiles/cmTC_93995.dir/src.cxx.o
/usr/bin/c++ -DDEAL_II_HAVE_OPENMP_SIMD -march=x86-64 -mtune=generic -O2 -pipe -fno-plt -Wno-unknown-pragmas -Wno-cpp -fopenmp-simd -o CMakeFiles/cmTC_93995.dir/src.cxx.o -c /tmp/makepkg/deal-ii/src/build/CMakeFiles/CMakeTmp/src.cxx
Linking CXX executable cmTC_93995
/usr/bin/cmake -E cmake_link_script CMakeFiles/cmTC_93995.dir/link.txt --verbose=1
/usr/bin/c++ -march=x86-64 -mtune=generic -O2 -pipe -fno-plt -Wno-unknown-pragmas -Wno-cpp -rdynamic CMakeFiles/cmTC_93995.dir/src.cxx.o -o cmTC_93995 -Wl,-O1,--sort-common,-z,relro,-z,now
make[1]: Leaving directory '/tmp/makepkg/deal-ii/src/build/CMakeFiles/CMakeTmp'
Source file was:
int main() { return 0; }
Performing C++ SOURCE FILE Test DEAL_II_HAVE_CXX14_FEATURES succeeded with the following output:
Change Dir: /tmp/makepkg/deal-ii/src/build/CMakeFiles/CMakeTmp
Run Build Command(s):/usr/bin/make -f Makefile cmTC_f7e37/fast && /usr/bin/make -f CMakeFiles/cmTC_f7e37.dir/build.make CMakeFiles/cmTC_f7e37.dir/build
make[1]: Entering directory '/tmp/makepkg/deal-ii/src/build/CMakeFiles/CMakeTmp'
Building CXX object CMakeFiles/cmTC_f7e37.dir/src.cxx.o
/usr/bin/c++ -DDEAL_II_HAVE_CXX14_FEATURES -march=x86-64 -mtune=generic -O2 -pipe -fno-plt -Wno-unknown-pragmas -Wno-cpp -pedantic -fPIC -Wall -Wextra -Wmissing-braces -Woverloaded-virtual -Wpointer-arith -Wsign-compare -Wsuggest-override -Wswitch -Wsynth -Wwrite-strings -Wno-placement-new -Wno-deprecated-declarations -Wno-literal-suffix -Wno-psabi -Wno-class-memaccess -fopenmp-simd -o CMakeFiles/cmTC_f7e37.dir/src.cxx.o -c /tmp/makepkg/deal-ii/src/build/CMakeFiles/CMakeTmp/src.cxx
Linking CXX executable cmTC_f7e37
/usr/bin/cmake -E cmake_link_script CMakeFiles/cmTC_f7e37.dir/link.txt --verbose=1
/usr/bin/c++ -march=x86-64 -mtune=generic -O2 -pipe -fno-plt -Wno-unknown-pragmas -Wno-cpp -pedantic -fPIC -Wall -Wextra -Wmissing-braces -Woverloaded-virtual -Wpointer-arith -Wsign-compare -Wsuggest-override -Wswitch -Wsynth -Wwrite-strings -Wno-placement-new -Wno-deprecated-declarations -Wno-literal-suffix -Wno-psabi -Wno-class-memaccess -fopenmp-simd -rdynamic CMakeFiles/cmTC_f7e37.dir/src.cxx.o -o cmTC_f7e37 -Wl,-O1,--sort-common,-z,relro,-z,now
make[1]: Leaving directory '/tmp/makepkg/deal-ii/src/build/CMakeFiles/CMakeTmp'
Source file was:
#include <memory>
#include <algorithm>
// Check the version language macro, but skip MSVC because
// MSVC reports 199711 even in MSVC 2017.
#if __cplusplus < 201402L && !defined(_MSC_VER) && !defined(__INTEL_COMPILER)
# error "insufficient support for C++14"
#endif
int main()
{
auto ptr = std::make_unique<int>(42);
constexpr int max = std::max(0, 1);
(void) ptr;
(void) max;
return 0;
}
Performing C++ SOURCE FILE Test DEAL_II_HAVE_CXX14_CLANGAUTODEBUG_BUG_OK succeeded with the following output:
Change Dir: /tmp/makepkg/deal-ii/src/build/CMakeFiles/CMakeTmp
Run Build Command(s):/usr/bin/make -f Makefile cmTC_ae7fb/fast && /usr/bin/make -f CMakeFiles/cmTC_ae7fb.dir/build.make CMakeFiles/cmTC_ae7fb.dir/build
make[1]: Entering directory '/tmp/makepkg/deal-ii/src/build/CMakeFiles/CMakeTmp'
Building CXX object CMakeFiles/cmTC_ae7fb.dir/src.cxx.o
/usr/bin/c++ -DDEAL_II_HAVE_CXX14_CLANGAUTODEBUG_BUG_OK -march=x86-64 -mtune=generic -O2 -pipe -fno-plt -Wno-unknown-pragmas -Wno-cpp -pedantic -fPIC -Wall -Wextra -Wmissing-braces -Woverloaded-virtual -Wpointer-arith -Wsign-compare -Wsuggest-override -Wswitch -Wsynth -Wwrite-strings -Wno-placement-new -Wno-deprecated-declarations -Wno-literal-suffix -Wno-psabi -Wno-class-memaccess -fopenmp-simd -O0 -ggdb -o CMakeFiles/cmTC_ae7fb.dir/src.cxx.o -c /tmp/makepkg/deal-ii/src/build/CMakeFiles/CMakeTmp/src.cxx
Linking CXX executable cmTC_ae7fb
/usr/bin/cmake -E cmake_link_script CMakeFiles/cmTC_ae7fb.dir/link.txt --verbose=1
/usr/bin/c++ -march=x86-64 -mtune=generic -O2 -pipe -fno-plt -Wno-unknown-pragmas -Wno-cpp -pedantic -fPIC -Wall -Wextra -Wmissing-braces -Woverloaded-virtual -Wpointer-arith -Wsign-compare -Wsuggest-override -Wswitch -Wsynth -Wwrite-strings -Wno-placement-new -Wno-deprecated-declarations -Wno-literal-suffix -Wno-psabi -Wno-class-memaccess -fopenmp-simd -O0 -ggdb -rdynamic CMakeFiles/cmTC_ae7fb.dir/src.cxx.o -o cmTC_ae7fb -Wl,-O1,--sort-common,-z,relro,-z,now
make[1]: Leaving directory '/tmp/makepkg/deal-ii/src/build/CMakeFiles/CMakeTmp'
Source file was:
struct foo
{
auto func();
};
int main()
{
foo bar;
(void) bar;
}
Performing C++ SOURCE FILE Test DEAL_II_HAVE_CXX11_FEATURES succeeded with the following output:
Change Dir: /tmp/makepkg/deal-ii/src/build/CMakeFiles/CMakeTmp
Run Build Command(s):/usr/bin/make -f Makefile cmTC_6a1a6/fast && /usr/bin/make -f CMakeFiles/cmTC_6a1a6.dir/build.make CMakeFiles/cmTC_6a1a6.dir/build
make[1]: Entering directory '/tmp/makepkg/deal-ii/src/build/CMakeFiles/CMakeTmp'
Building CXX object CMakeFiles/cmTC_6a1a6.dir/src.cxx.o
/usr/bin/c++ -DDEAL_II_HAVE_CXX11_FEATURES -march=x86-64 -mtune=generic -O2 -pipe -fno-plt -Wno-unknown-pragmas -Wno-cpp -pedantic -fPIC -Wall -Wextra -Wmissing-braces -Woverloaded-virtual -Wpointer-arith -Wsign-compare -Wsuggest-override -Wswitch -Wsynth -Wwrite-strings -Wno-placement-new -Wno-deprecated-declarations -Wno-literal-suffix -Wno-psabi -Wno-class-memaccess -fopenmp-simd -O0 -ggdb -o CMakeFiles/cmTC_6a1a6.dir/src.cxx.o -c /tmp/makepkg/deal-ii/src/build/CMakeFiles/CMakeTmp/src.cxx
Linking CXX executable cmTC_6a1a6
/usr/bin/cmake -E cmake_link_script CMakeFiles/cmTC_6a1a6.dir/link.txt --verbose=1
/usr/bin/c++ -march=x86-64 -mtune=generic -O2 -pipe -fno-plt -Wno-unknown-pragmas -Wno-cpp -pedantic -fPIC -Wall -Wextra -Wmissing-braces -Woverloaded-virtual -Wpointer-arith -Wsign-compare -Wsuggest-override -Wswitch -Wsynth -Wwrite-strings -Wno-placement-new -Wno-deprecated-declarations -Wno-literal-suffix -Wno-psabi -Wno-class-memaccess -fopenmp-simd -O0 -ggdb -rdynamic CMakeFiles/cmTC_6a1a6.dir/src.cxx.o -o cmTC_6a1a6 -Wl,-O1,--sort-common,-z,relro,-z,now
make[1]: Leaving directory '/tmp/makepkg/deal-ii/src/build/CMakeFiles/CMakeTmp'
Source file was:
// common C++11 include files
#include <array>
#include <condition_variable>
#include <type_traits>
// thread_local storage specification
static thread_local std::array<int,3> p;
// Check the version language macro, but skip MSVC because
// MSVC reports 199711 even in MSVC 2017.
#if __cplusplus < 201103L && !defined(_MSC_VER) && !defined(__INTEL_COMPILER)
# error "insufficient support for C++11"
#endif
int main()
{
std::condition_variable c;
p[0] = 1;
c.notify_all();
// type traits functionality
constexpr auto m0 = std::is_trivial<double>::value;
(void) m0;
constexpr auto m1 = std::is_standard_layout<double>::value;
(void) m1;
constexpr auto m2 = std::is_pod<double>::value;
(void) m2;
}
Performing C++ SOURCE FILE Test DEAL_II_HAVE_CXX11_FUNCTIONAL_LLVMBUG20084_OK succeeded with the following output:
Change Dir: /tmp/makepkg/deal-ii/src/build/CMakeFiles/CMakeTmp
Run Build Command(s):/usr/bin/make -f Makefile cmTC_4ccd8/fast && /usr/bin/make -f CMakeFiles/cmTC_4ccd8.dir/build.make CMakeFiles/cmTC_4ccd8.dir/build
make[1]: Entering directory '/tmp/makepkg/deal-ii/src/build/CMakeFiles/CMakeTmp'
Building CXX object CMakeFiles/cmTC_4ccd8.dir/src.cxx.o
/usr/bin/c++ -DDEAL_II_HAVE_CXX11_FUNCTIONAL_LLVMBUG20084_OK -march=x86-64 -mtune=generic -O2 -pipe -fno-plt -Wno-unknown-pragmas -Wno-cpp -pedantic -fPIC -Wall -Wextra -Wmissing-braces -Woverloaded-virtual -Wpointer-arith -Wsign-compare -Wsuggest-override -Wswitch -Wsynth -Wwrite-strings -Wno-placement-new -Wno-deprecated-declarations -Wno-literal-suffix -Wno-psabi -Wno-class-memaccess -fopenmp-simd -O0 -ggdb -o CMakeFiles/cmTC_4ccd8.dir/src.cxx.o -c /tmp/makepkg/deal-ii/src/build/CMakeFiles/CMakeTmp/src.cxx
Linking CXX executable cmTC_4ccd8
/usr/bin/cmake -E cmake_link_script CMakeFiles/cmTC_4ccd8.dir/link.txt --verbose=1
/usr/bin/c++ -march=x86-64 -mtune=generic -O2 -pipe -fno-plt -Wno-unknown-pragmas -Wno-cpp -pedantic -fPIC -Wall -Wextra -Wmissing-braces -Woverloaded-virtual -Wpointer-arith -Wsign-compare -Wsuggest-override -Wswitch -Wsynth -Wwrite-strings -Wno-placement-new -Wno-deprecated-declarations -Wno-literal-suffix -Wno-psabi -Wno-class-memaccess -fopenmp-simd -O0 -ggdb -rdynamic CMakeFiles/cmTC_4ccd8.dir/src.cxx.o -o cmTC_4ccd8 -Wl,-O1,--sort-common,-z,relro,-z,now
make[1]: Leaving directory '/tmp/makepkg/deal-ii/src/build/CMakeFiles/CMakeTmp'
Source file was:
#include <functional>
struct A { void foo() const {} };
int main() { A a; std::bind(&A::foo,a)(); return 0; }
Performing C++ SOURCE FILE Test DEAL_II_HAVE_CXX17_FEATURES succeeded with the following output:
Change Dir: /tmp/makepkg/deal-ii/src/build/CMakeFiles/CMakeTmp
Run Build Command(s):/usr/bin/make -f Makefile cmTC_3a226/fast && /usr/bin/make -f CMakeFiles/cmTC_3a226.dir/build.make CMakeFiles/cmTC_3a226.dir/build
make[1]: Entering directory '/tmp/makepkg/deal-ii/src/build/CMakeFiles/CMakeTmp'
Building CXX object CMakeFiles/cmTC_3a226.dir/src.cxx.o
/usr/bin/c++ -DDEAL_II_HAVE_CXX17_FEATURES -march=x86-64 -mtune=generic -O2 -pipe -fno-plt -Wno-unknown-pragmas -Wno-cpp -pedantic -fPIC -Wall -Wextra -Wmissing-braces -Woverloaded-virtual -Wpointer-arith -Wsign-compare -Wsuggest-override -Wswitch -Wsynth -Wwrite-strings -Wno-placement-new -Wno-deprecated-declarations -Wno-literal-suffix -Wno-psabi -Wno-class-memaccess -fopenmp-simd -O0 -ggdb -o CMakeFiles/cmTC_3a226.dir/src.cxx.o -c /tmp/makepkg/deal-ii/src/build/CMakeFiles/CMakeTmp/src.cxx
Linking CXX executable cmTC_3a226
/usr/bin/cmake -E cmake_link_script CMakeFiles/cmTC_3a226.dir/link.txt --verbose=1
/usr/bin/c++ -march=x86-64 -mtune=generic -O2 -pipe -fno-plt -Wno-unknown-pragmas -Wno-cpp -pedantic -fPIC -Wall -Wextra -Wmissing-braces -Woverloaded-virtual -Wpointer-arith -Wsign-compare -Wsuggest-override -Wswitch -Wsynth -Wwrite-strings -Wno-placement-new -Wno-deprecated-declarations -Wno-literal-suffix -Wno-psabi -Wno-class-memaccess -fopenmp-simd -O0 -ggdb -rdynamic CMakeFiles/cmTC_3a226.dir/src.cxx.o -o cmTC_3a226 -Wl,-O1,--sort-common,-z,relro,-z,now
make[1]: Leaving directory '/tmp/makepkg/deal-ii/src/build/CMakeFiles/CMakeTmp'
Source file was:
#include <iostream>
#include <optional>
#include <tuple>
#if __cplusplus < 201703L && !defined(_MSC_VER) && !defined(__INTEL_COMPILER)
# error "insufficient support for C++17"
#endif
//check for some C++17 features that we use in our headers:
using std::apply;
using std::optional;
[[nodiscard]] int test_nodiscard()
{
return 1;
}
int main()
{
const unsigned int n=1;
switch (n)
{
case 1:
std::cout << n;
[[fallthrough]];
case 2:
std::cout << n;
}
[[maybe_unused]] int i = test_nodiscard();
constexpr bool flag = false;
if constexpr(flag)
return 1;
return 0;
}
Performing C++ SOURCE FILE Test DEAL_II_HAVE_CXX17_CONSTEXPR_LAMBDA_BUG_OK succeeded with the following output:
Change Dir: /tmp/makepkg/deal-ii/src/build/CMakeFiles/CMakeTmp
Run Build Command(s):/usr/bin/make -f Makefile cmTC_c4998/fast && /usr/bin/make -f CMakeFiles/cmTC_c4998.dir/build.make CMakeFiles/cmTC_c4998.dir/build
make[1]: Entering directory '/tmp/makepkg/deal-ii/src/build/CMakeFiles/CMakeTmp'
Building CXX object CMakeFiles/cmTC_c4998.dir/src.cxx.o
/usr/bin/c++ -DDEAL_II_HAVE_CXX17_CONSTEXPR_LAMBDA_BUG_OK -march=x86-64 -mtune=generic -O2 -pipe -fno-plt -Wno-unknown-pragmas -Wno-cpp -pedantic -fPIC -Wall -Wextra -Wmissing-braces -Woverloaded-virtual -Wpointer-arith -Wsign-compare -Wsuggest-override -Wswitch -Wsynth -Wwrite-strings -Wno-placement-new -Wno-deprecated-declarations -Wno-literal-suffix -Wno-psabi -Wno-class-memaccess -fopenmp-simd -O0 -ggdb -o CMakeFiles/cmTC_c4998.dir/src.cxx.o -c /tmp/makepkg/deal-ii/src/build/CMakeFiles/CMakeTmp/src.cxx
Linking CXX executable cmTC_c4998
/usr/bin/cmake -E cmake_link_script CMakeFiles/cmTC_c4998.dir/link.txt --verbose=1
/usr/bin/c++ -march=x86-64 -mtune=generic -O2 -pipe -fno-plt -Wno-unknown-pragmas -Wno-cpp -pedantic -fPIC -Wall -Wextra -Wmissing-braces -Woverloaded-virtual -Wpointer-arith -Wsign-compare -Wsuggest-override -Wswitch -Wsynth -Wwrite-strings -Wno-placement-new -Wno-deprecated-declarations -Wno-literal-suffix -Wno-psabi -Wno-class-memaccess -fopenmp-simd -O0 -ggdb -rdynamic CMakeFiles/cmTC_c4998.dir/src.cxx.o -o cmTC_c4998 -Wl,-O1,--sort-common,-z,relro,-z,now
make[1]: Leaving directory '/tmp/makepkg/deal-ii/src/build/CMakeFiles/CMakeTmp'
Source file was:
#include <string>
int main()
{
auto c = []()
{
return std::string{};
}();
(void) c;
return []()
{
try
{}
catch(...)
{}
return 0;
}();
}
Performing C++ SOURCE FILE Test DEAL_II_HAVE_FLAG_Werror succeeded with the following output:
Change Dir: /tmp/makepkg/deal-ii/src/build/CMakeFiles/CMakeTmp
Run Build Command(s):/usr/bin/make -f Makefile cmTC_c3b0b/fast && /usr/bin/make -f CMakeFiles/cmTC_c3b0b.dir/build.make CMakeFiles/cmTC_c3b0b.dir/build
make[1]: Entering directory '/tmp/makepkg/deal-ii/src/build/CMakeFiles/CMakeTmp'
Building CXX object CMakeFiles/cmTC_c3b0b.dir/src.cxx.o
/usr/bin/c++ -DDEAL_II_HAVE_FLAG_Werror -march=x86-64 -mtune=generic -O2 -pipe -fno-plt -Wno-unknown-pragmas -Wno-cpp -pedantic -fPIC -Wall -Wextra -Wmissing-braces -Woverloaded-virtual -Wpointer-arith -Wsign-compare -Wsuggest-override -Wswitch -Wsynth -Wwrite-strings -Wno-placement-new -Wno-deprecated-declarations -Wno-literal-suffix -Wno-psabi -Wno-class-memaccess -fopenmp-simd -O0 -ggdb -Werror -o CMakeFiles/cmTC_c3b0b.dir/src.cxx.o -c /tmp/makepkg/deal-ii/src/build/CMakeFiles/CMakeTmp/src.cxx
Linking CXX executable cmTC_c3b0b
/usr/bin/cmake -E cmake_link_script CMakeFiles/cmTC_c3b0b.dir/link.txt --verbose=1
/usr/bin/c++ -march=x86-64 -mtune=generic -O2 -pipe -fno-plt -Wno-unknown-pragmas -Wno-cpp -pedantic -fPIC -Wall -Wextra -Wmissing-braces -Woverloaded-virtual -Wpointer-arith -Wsign-compare -Wsuggest-override -Wswitch -Wsynth -Wwrite-strings -Wno-placement-new -Wno-deprecated-declarations -Wno-literal-suffix -Wno-psabi -Wno-class-memaccess -fopenmp-simd -O0 -ggdb -rdynamic CMakeFiles/cmTC_c3b0b.dir/src.cxx.o -o cmTC_c3b0b -Wl,-O1,--sort-common,-z,relro,-z,now
make[1]: Leaving directory '/tmp/makepkg/deal-ii/src/build/CMakeFiles/CMakeTmp'
Source file was:
int main() { return 0; }
Performing C++ SOURCE FILE Test DEAL_II_HAVE_FP_EXCEPTIONS succeeded with the following compile output:
Change Dir: /tmp/makepkg/deal-ii/src/build/CMakeFiles/CMakeTmp
Run Build Command(s):/usr/bin/make -f Makefile cmTC_aa9f7/fast && /usr/bin/make -f CMakeFiles/cmTC_aa9f7.dir/build.make CMakeFiles/cmTC_aa9f7.dir/build
make[1]: Entering directory '/tmp/makepkg/deal-ii/src/build/CMakeFiles/CMakeTmp'
Building CXX object CMakeFiles/cmTC_aa9f7.dir/src.cxx.o
/usr/bin/c++ -DDEAL_II_HAVE_FP_EXCEPTIONS -march=x86-64 -mtune=generic -O2 -pipe -fno-plt -Wno-unknown-pragmas -Wno-cpp -pedantic -fPIC -Wall -Wextra -Wmissing-braces -Woverloaded-virtual -Wpointer-arith -Wsign-compare -Wsuggest-override -Wswitch -Wsynth -Wwrite-strings -Wno-placement-new -Wno-deprecated-declarations -Wno-literal-suffix -Wno-psabi -Wno-class-memaccess -fopenmp-simd -O0 -ggdb -Werror -o CMakeFiles/cmTC_aa9f7.dir/src.cxx.o -c /tmp/makepkg/deal-ii/src/build/CMakeFiles/CMakeTmp/src.cxx
Linking CXX executable cmTC_aa9f7
/usr/bin/cmake -E cmake_link_script CMakeFiles/cmTC_aa9f7.dir/link.txt --verbose=1
/usr/bin/c++ -march=x86-64 -mtune=generic -O2 -pipe -fno-plt -Wno-unknown-pragmas -Wno-cpp -pedantic -fPIC -Wall -Wextra -Wmissing-braces -Woverloaded-virtual -Wpointer-arith -Wsign-compare -Wsuggest-override -Wswitch -Wsynth -Wwrite-strings -Wno-placement-new -Wno-deprecated-declarations -Wno-literal-suffix -Wno-psabi -Wno-class-memaccess -fopenmp-simd -O0 -ggdb -Werror -rdynamic CMakeFiles/cmTC_aa9f7.dir/src.cxx.o -o cmTC_aa9f7 -Wl,-O1,--sort-common,-z,relro,-z,now
make[1]: Leaving directory '/tmp/makepkg/deal-ii/src/build/CMakeFiles/CMakeTmp'
...and run output:
Return value: 1
Source file was:
#include <cfenv>
#include <limits>
#include <sstream>
int main()
{
feenableexcept(FE_DIVBYZERO|FE_INVALID);
std::ostringstream description;
const double lower_bound = -std::numeric_limits<double>::max();
description << lower_bound;
return 0;
}
Performing C++ SOURCE FILE Test DEAL_II_HAVE_CXX17_ATTRIBUTE_DEPRECATED succeeded with the following output:
Change Dir: /tmp/makepkg/deal-ii/src/build/CMakeFiles/CMakeTmp
Run Build Command(s):/usr/bin/make -f Makefile cmTC_96e89/fast && /usr/bin/make -f CMakeFiles/cmTC_96e89.dir/build.make CMakeFiles/cmTC_96e89.dir/build
make[1]: Entering directory '/tmp/makepkg/deal-ii/src/build/CMakeFiles/CMakeTmp'
Building CXX object CMakeFiles/cmTC_96e89.dir/src.cxx.o
/usr/bin/c++ -DDEAL_II_HAVE_CXX17_ATTRIBUTE_DEPRECATED -march=x86-64 -mtune=generic -O2 -pipe -fno-plt -Wno-unknown-pragmas -Wno-cpp -pedantic -fPIC -Wall -Wextra -Wmissing-braces -Woverloaded-virtual -Wpointer-arith -Wsign-compare -Wsuggest-override -Wswitch -Wsynth -Wwrite-strings -Wno-placement-new -Wno-deprecated-declarations -Wno-literal-suffix -Wno-psabi -Wno-class-memaccess -fopenmp-simd -O0 -ggdb -Werror -o CMakeFiles/cmTC_96e89.dir/src.cxx.o -c /tmp/makepkg/deal-ii/src/build/CMakeFiles/CMakeTmp/src.cxx
Linking CXX executable cmTC_96e89
/usr/bin/cmake -E cmake_link_script CMakeFiles/cmTC_96e89.dir/link.txt --verbose=1
/usr/bin/c++ -march=x86-64 -mtune=generic -O2 -pipe -fno-plt -Wno-unknown-pragmas -Wno-cpp -pedantic -fPIC -Wall -Wextra -Wmissing-braces -Woverloaded-virtual -Wpointer-arith -Wsign-compare -Wsuggest-override -Wswitch -Wsynth -Wwrite-strings -Wno-placement-new -Wno-deprecated-declarations -Wno-literal-suffix -Wno-psabi -Wno-class-memaccess -fopenmp-simd -O0 -ggdb -Werror -rdynamic CMakeFiles/cmTC_96e89.dir/src.cxx.o -o cmTC_96e89 -Wl,-O1,--sort-common,-z,relro,-z,now
make[1]: Leaving directory '/tmp/makepkg/deal-ii/src/build/CMakeFiles/CMakeTmp'
Source file was:
[[deprecated]] int old_fn ();
int old_fn () { return 0; }
struct [[deprecated]] bob
{
[[deprecated]] bob(int i);
[[deprecated]] void test();
};
enum color
{
red [[deprecated]]
};
template <int dim>
struct foo {};
using bar [[deprecated]] = foo<2>;
int main () {}
Performing C++ SOURCE FILE Test DEAL_II_HAVE_ATTRIBUTE_DEPRECATED succeeded with the following output:
Change Dir: /tmp/makepkg/deal-ii/src/build/CMakeFiles/CMakeTmp
Run Build Command(s):/usr/bin/make -f Makefile cmTC_43693/fast && /usr/bin/make -f CMakeFiles/cmTC_43693.dir/build.make CMakeFiles/cmTC_43693.dir/build
make[1]: Entering directory '/tmp/makepkg/deal-ii/src/build/CMakeFiles/CMakeTmp'
Building CXX object CMakeFiles/cmTC_43693.dir/src.cxx.o
/usr/bin/c++ -DDEAL_II_HAVE_ATTRIBUTE_DEPRECATED -march=x86-64 -mtune=generic -O2 -pipe -fno-plt -Wno-unknown-pragmas -Wno-cpp -pedantic -fPIC -Wall -Wextra -Wmissing-braces -Woverloaded-virtual -Wpointer-arith -Wsign-compare -Wsuggest-override -Wswitch -Wsynth -Wwrite-strings -Wno-placement-new -Wno-deprecated-declarations -Wno-literal-suffix -Wno-psabi -Wno-class-memaccess -fopenmp-simd -O0 -ggdb -Werror -o CMakeFiles/cmTC_43693.dir/src.cxx.o -c /tmp/makepkg/deal-ii/src/build/CMakeFiles/CMakeTmp/src.cxx
Linking CXX executable cmTC_43693
/usr/bin/cmake -E cmake_link_script CMakeFiles/cmTC_43693.dir/link.txt --verbose=1
/usr/bin/c++ -march=x86-64 -mtune=generic -O2 -pipe -fno-plt -Wno-unknown-pragmas -Wno-cpp -pedantic -fPIC -Wall -Wextra -Wmissing-braces -Woverloaded-virtual -Wpointer-arith -Wsign-compare -Wsuggest-override -Wswitch -Wsynth -Wwrite-strings -Wno-placement-new -Wno-deprecated-declarations -Wno-literal-suffix -Wno-psabi -Wno-class-memaccess -fopenmp-simd -O0 -ggdb -Werror -rdynamic CMakeFiles/cmTC_43693.dir/src.cxx.o -o cmTC_43693 -Wl,-O1,--sort-common,-z,relro,-z,now
make[1]: Leaving directory '/tmp/makepkg/deal-ii/src/build/CMakeFiles/CMakeTmp'
Source file was:
__attribute__((deprecated)) int old_fn ();
int old_fn () { return 0; }
struct __attribute__((deprecated)) bob
{
__attribute__((deprecated)) bob(int i);
__attribute__((deprecated)) void test();
};
enum color
{
red __attribute__((deprecated))
};
template <int dim>
struct foo {};
using bar __attribute__((deprecated)) = foo<2>;
int main () {}
Performing C++ SOURCE FILE Test DEAL_II_HAVE_CXX17_ATTRIBUTE_FALLTHROUGH succeeded with the following output:
Change Dir: /tmp/makepkg/deal-ii/src/build/CMakeFiles/CMakeTmp
Run Build Command(s):/usr/bin/make -f Makefile cmTC_07aa1/fast && /usr/bin/make -f CMakeFiles/cmTC_07aa1.dir/build.make CMakeFiles/cmTC_07aa1.dir/build
make[1]: Entering directory '/tmp/makepkg/deal-ii/src/build/CMakeFiles/CMakeTmp'
Building CXX object CMakeFiles/cmTC_07aa1.dir/src.cxx.o
/usr/bin/c++ -DDEAL_II_HAVE_CXX17_ATTRIBUTE_FALLTHROUGH -march=x86-64 -mtune=generic -O2 -pipe -fno-plt -Wno-unknown-pragmas -Wno-cpp -pedantic -fPIC -Wall -Wextra -Wmissing-braces -Woverloaded-virtual -Wpointer-arith -Wsign-compare -Wsuggest-override -Wswitch -Wsynth -Wwrite-strings -Wno-placement-new -Wno-deprecated-declarations -Wno-literal-suffix -Wno-psabi -Wno-class-memaccess -fopenmp-simd -O0 -ggdb -Werror -o CMakeFiles/cmTC_07aa1.dir/src.cxx.o -c /tmp/makepkg/deal-ii/src/build/CMakeFiles/CMakeTmp/src.cxx
Linking CXX executable cmTC_07aa1
/usr/bin/cmake -E cmake_link_script CMakeFiles/cmTC_07aa1.dir/link.txt --verbose=1
/usr/bin/c++ -march=x86-64 -mtune=generic -O2 -pipe -fno-plt -Wno-unknown-pragmas -Wno-cpp -pedantic -fPIC -Wall -Wextra -Wmissing-braces -Woverloaded-virtual -Wpointer-arith -Wsign-compare -Wsuggest-override -Wswitch -Wsynth -Wwrite-strings -Wno-placement-new -Wno-deprecated-declarations -Wno-literal-suffix -Wno-psabi -Wno-class-memaccess -fopenmp-simd -O0 -ggdb -Werror -rdynamic CMakeFiles/cmTC_07aa1.dir/src.cxx.o -o cmTC_07aa1 -Wl,-O1,--sort-common,-z,relro,-z,now
make[1]: Leaving directory '/tmp/makepkg/deal-ii/src/build/CMakeFiles/CMakeTmp'
Source file was:
int main()
{
int i = 42;
int j = 10;
switch(i)
{
case 1:
++j;
[[fallthrough]];
case 2:
++j;
[[fallthrough]];
default:
break;
}
}
Performing C++ SOURCE FILE Test DEAL_II_HAVE_ATTRIBUTE_FALLTHROUGH succeeded with the following output:
Change Dir: /tmp/makepkg/deal-ii/src/build/CMakeFiles/CMakeTmp
Run Build Command(s):/usr/bin/make -f Makefile cmTC_27268/fast && /usr/bin/make -f CMakeFiles/cmTC_27268.dir/build.make CMakeFiles/cmTC_27268.dir/build
make[1]: Entering directory '/tmp/makepkg/deal-ii/src/build/CMakeFiles/CMakeTmp'
Building CXX object CMakeFiles/cmTC_27268.dir/src.cxx.o
/usr/bin/c++ -DDEAL_II_HAVE_ATTRIBUTE_FALLTHROUGH -march=x86-64 -mtune=generic -O2 -pipe -fno-plt -Wno-unknown-pragmas -Wno-cpp -pedantic -fPIC -Wall -Wextra -Wmissing-braces -Woverloaded-virtual -Wpointer-arith -Wsign-compare -Wsuggest-override -Wswitch -Wsynth -Wwrite-strings -Wno-placement-new -Wno-deprecated-declarations -Wno-literal-suffix -Wno-psabi -Wno-class-memaccess -fopenmp-simd -O0 -ggdb -Werror -o CMakeFiles/cmTC_27268.dir/src.cxx.o -c /tmp/makepkg/deal-ii/src/build/CMakeFiles/CMakeTmp/src.cxx
Linking CXX executable cmTC_27268
/usr/bin/cmake -E cmake_link_script CMakeFiles/cmTC_27268.dir/link.txt --verbose=1
/usr/bin/c++ -march=x86-64 -mtune=generic -O2 -pipe -fno-plt -Wno-unknown-pragmas -Wno-cpp -pedantic -fPIC -Wall -Wextra -Wmissing-braces -Woverloaded-virtual -Wpointer-arith -Wsign-compare -Wsuggest-override -Wswitch -Wsynth -Wwrite-strings -Wno-placement-new -Wno-deprecated-declarations -Wno-literal-suffix -Wno-psabi -Wno-class-memaccess -fopenmp-simd -O0 -ggdb -Werror -rdynamic CMakeFiles/cmTC_27268.dir/src.cxx.o -o cmTC_27268 -Wl,-O1,--sort-common,-z,relro,-z,now
make[1]: Leaving directory '/tmp/makepkg/deal-ii/src/build/CMakeFiles/CMakeTmp'
Source file was:
int main()
{
int i = 42;
int j = 10;
switch(i)
{
case 1:
++j;
__attribute__((fallthrough));
case 2:
++j;
__attribute__((fallthrough));
default:
break;
}
}
Performing C++ SOURCE FILE Test DEAL_II_HAVE_CXX17_BESSEL_FUNCTIONS succeeded with the following output:
Change Dir: /tmp/makepkg/deal-ii/src/build/CMakeFiles/CMakeTmp
Run Build Command(s):/usr/bin/make -f Makefile cmTC_91224/fast && /usr/bin/make -f CMakeFiles/cmTC_91224.dir/build.make CMakeFiles/cmTC_91224.dir/build
make[1]: Entering directory '/tmp/makepkg/deal-ii/src/build/CMakeFiles/CMakeTmp'
Building CXX object CMakeFiles/cmTC_91224.dir/src.cxx.o
/usr/bin/c++ -DDEAL_II_HAVE_CXX17_BESSEL_FUNCTIONS -march=x86-64 -mtune=generic -O2 -pipe -fno-plt -Wno-unknown-pragmas -Wno-cpp -pedantic -fPIC -Wall -Wextra -Wmissing-braces -Woverloaded-virtual -Wpointer-arith -Wsign-compare -Wsuggest-override -Wswitch -Wsynth -Wwrite-strings -Wno-placement-new -Wno-deprecated-declarations -Wno-literal-suffix -Wno-psabi -Wno-class-memaccess -fopenmp-simd -O0 -ggdb -Werror -o CMakeFiles/cmTC_91224.dir/src.cxx.o -c /tmp/makepkg/deal-ii/src/build/CMakeFiles/CMakeTmp/src.cxx
Linking CXX executable cmTC_91224
/usr/bin/cmake -E cmake_link_script CMakeFiles/cmTC_91224.dir/link.txt --verbose=1
/usr/bin/c++ -march=x86-64 -mtune=generic -O2 -pipe -fno-plt -Wno-unknown-pragmas -Wno-cpp -pedantic -fPIC -Wall -Wextra -Wmissing-braces -Woverloaded-virtual -Wpointer-arith -Wsign-compare -Wsuggest-override -Wswitch -Wsynth -Wwrite-strings -Wno-placement-new -Wno-deprecated-declarations -Wno-literal-suffix -Wno-psabi -Wno-class-memaccess -fopenmp-simd -O0 -ggdb -Werror -rdynamic CMakeFiles/cmTC_91224.dir/src.cxx.o -o cmTC_91224 -Wl,-O1,--sort-common,-z,relro,-z,now
make[1]: Leaving directory '/tmp/makepkg/deal-ii/src/build/CMakeFiles/CMakeTmp'
Source file was:
#include <cmath>
using std::cyl_bessel_j;
using std::cyl_bessel_jf;
using std::cyl_bessel_jl;
int main()
{
}
Performing C++ SOURCE FILE Test DEAL_II_HAVE_CXX17_LEGENDRE_FUNCTIONS succeeded with the following output:
Change Dir: /tmp/makepkg/deal-ii/src/build/CMakeFiles/CMakeTmp
Run Build Command(s):/usr/bin/make -f Makefile cmTC_9775a/fast && /usr/bin/make -f CMakeFiles/cmTC_9775a.dir/build.make CMakeFiles/cmTC_9775a.dir/build
make[1]: Entering directory '/tmp/makepkg/deal-ii/src/build/CMakeFiles/CMakeTmp'
Building CXX object CMakeFiles/cmTC_9775a.dir/src.cxx.o
/usr/bin/c++ -DDEAL_II_HAVE_CXX17_LEGENDRE_FUNCTIONS -march=x86-64 -mtune=generic -O2 -pipe -fno-plt -Wno-unknown-pragmas -Wno-cpp -pedantic -fPIC -Wall -Wextra -Wmissing-braces -Woverloaded-virtual -Wpointer-arith -Wsign-compare -Wsuggest-override -Wswitch -Wsynth -Wwrite-strings -Wno-placement-new -Wno-deprecated-declarations -Wno-literal-suffix -Wno-psabi -Wno-class-memaccess -fopenmp-simd -O0 -ggdb -Werror -o CMakeFiles/cmTC_9775a.dir/src.cxx.o -c /tmp/makepkg/deal-ii/src/build/CMakeFiles/CMakeTmp/src.cxx
Linking CXX executable cmTC_9775a
/usr/bin/cmake -E cmake_link_script CMakeFiles/cmTC_9775a.dir/link.txt --verbose=1
/usr/bin/c++ -march=x86-64 -mtune=generic -O2 -pipe -fno-plt -Wno-unknown-pragmas -Wno-cpp -pedantic -fPIC -Wall -Wextra -Wmissing-braces -Woverloaded-virtual -Wpointer-arith -Wsign-compare -Wsuggest-override -Wswitch -Wsynth -Wwrite-strings -Wno-placement-new -Wno-deprecated-declarations -Wno-literal-suffix -Wno-psabi -Wno-class-memaccess -fopenmp-simd -O0 -ggdb -Werror -rdynamic CMakeFiles/cmTC_9775a.dir/src.cxx.o -o cmTC_9775a -Wl,-O1,--sort-common,-z,relro,-z,now
make[1]: Leaving directory '/tmp/makepkg/deal-ii/src/build/CMakeFiles/CMakeTmp'
Source file was:
#include <cmath>
using std::legendre;
using std::legendref;
using std::legendrel;
int main()
{
}
Performing C++ SOURCE FILE Test DEAL_II_CXX14_CONSTEXPR_BUG_OK succeeded with the following output:
Change Dir: /tmp/makepkg/deal-ii/src/build/CMakeFiles/CMakeTmp
Run Build Command(s):/usr/bin/make -f Makefile cmTC_8aeea/fast && /usr/bin/make -f CMakeFiles/cmTC_8aeea.dir/build.make CMakeFiles/cmTC_8aeea.dir/build
make[1]: Entering directory '/tmp/makepkg/deal-ii/src/build/CMakeFiles/CMakeTmp'
Building CXX object CMakeFiles/cmTC_8aeea.dir/src.cxx.o
/usr/bin/c++ -DDEAL_II_CXX14_CONSTEXPR_BUG_OK -march=x86-64 -mtune=generic -O2 -pipe -fno-plt -Wno-unknown-pragmas -Wno-cpp -pedantic -fPIC -Wall -Wextra -Wmissing-braces -Woverloaded-virtual -Wpointer-arith -Wsign-compare -Wsuggest-override -Wswitch -Wsynth -Wwrite-strings -Wno-placement-new -Wno-deprecated-declarations -Wno-literal-suffix -Wno-psabi -Wno-class-memaccess -fopenmp-simd -O0 -ggdb -Werror -o CMakeFiles/cmTC_8aeea.dir/src.cxx.o -c /tmp/makepkg/deal-ii/src/build/CMakeFiles/CMakeTmp/src.cxx
Linking CXX executable cmTC_8aeea
/usr/bin/cmake -E cmake_link_script CMakeFiles/cmTC_8aeea.dir/link.txt --verbose=1
/usr/bin/c++ -march=x86-64 -mtune=generic -O2 -pipe -fno-plt -Wno-unknown-pragmas -Wno-cpp -pedantic -fPIC -Wall -Wextra -Wmissing-braces -Woverloaded-virtual -Wpointer-arith -Wsign-compare -Wsuggest-override -Wswitch -Wsynth -Wwrite-strings -Wno-placement-new -Wno-deprecated-declarations -Wno-literal-suffix -Wno-psabi -Wno-class-memaccess -fopenmp-simd -O0 -ggdb -Werror -rdynamic CMakeFiles/cmTC_8aeea.dir/src.cxx.o -o cmTC_8aeea -Wl,-O1,--sort-common,-z,relro,-z,now
make[1]: Leaving directory '/tmp/makepkg/deal-ii/src/build/CMakeFiles/CMakeTmp'
Source file was:
#define Assert(x,y) if (!(x)) throw y;
void bar()
{}
constexpr int
foo(const int n)
{
Assert(n>0, "hello");
if(!(n >= 0))
bar();
return n;
}
int main()
{
constexpr unsigned int n=foo(1);
return n;
}
Performing C++ SOURCE FILE Test DEAL_II_COMPILER_USE_VECTOR_ARITHMETICS succeeded with the following output:
Change Dir: /tmp/makepkg/deal-ii/src/build/CMakeFiles/CMakeTmp
Run Build Command(s):/usr/bin/make -f Makefile cmTC_c6ead/fast && /usr/bin/make -f CMakeFiles/cmTC_c6ead.dir/build.make CMakeFiles/cmTC_c6ead.dir/build
make[1]: Entering directory '/tmp/makepkg/deal-ii/src/build/CMakeFiles/CMakeTmp'
Building CXX object CMakeFiles/cmTC_c6ead.dir/src.cxx.o
/usr/bin/c++ -DDEAL_II_COMPILER_USE_VECTOR_ARITHMETICS -march=x86-64 -mtune=generic -O2 -pipe -fno-plt -Wno-unknown-pragmas -Wno-cpp -o CMakeFiles/cmTC_c6ead.dir/src.cxx.o -c /tmp/makepkg/deal-ii/src/build/CMakeFiles/CMakeTmp/src.cxx
Linking CXX executable cmTC_c6ead
/usr/bin/cmake -E cmake_link_script CMakeFiles/cmTC_c6ead.dir/link.txt --verbose=1
/usr/bin/c++ -march=x86-64 -mtune=generic -O2 -pipe -fno-plt -Wno-unknown-pragmas -Wno-cpp -rdynamic CMakeFiles/cmTC_c6ead.dir/src.cxx.o -o cmTC_c6ead -Wl,-O1,--sort-common,-z,relro,-z,now
make[1]: Leaving directory '/tmp/makepkg/deal-ii/src/build/CMakeFiles/CMakeTmp'
Source file was:
#include <x86intrin.h>
int main()
{
__m128d a, b;
a = _mm_set_sd (1.0);
b = _mm_set1_pd (2.1);
__m128d c = a + b;
__m128d d = b - c;
__m128d e = c * a + d;
__m128d f = e/a;
#ifdef __AVX512F__
__m512d g, h;
g = _mm512_set1_pd (1.0);
h = _mm512_set1_pd (2.1);
__m512d i = g + h;
g = i - g;
h *= i;
i = h/i;
(void)i;
#endif
(void)f;
}
Performing C++ SOURCE FILE Test DEAL_II_VECTOR_ITERATOR_IS_POINTER_OK succeeded with the following output:
Change Dir: /tmp/makepkg/deal-ii/src/build/CMakeFiles/CMakeTmp
Run Build Command(s):/usr/bin/make -f Makefile cmTC_db0e0/fast && /usr/bin/make -f CMakeFiles/cmTC_db0e0.dir/build.make CMakeFiles/cmTC_db0e0.dir/build
make[1]: Entering directory '/tmp/makepkg/deal-ii/src/build/CMakeFiles/CMakeTmp'
Building CXX object CMakeFiles/cmTC_db0e0.dir/src.cxx.o
/usr/bin/c++ -DDEAL_II_VECTOR_ITERATOR_IS_POINTER_OK -march=x86-64 -mtune=generic -O2 -pipe -fno-plt -Wno-unknown-pragmas -Wno-cpp -o CMakeFiles/cmTC_db0e0.dir/src.cxx.o -c /tmp/makepkg/deal-ii/src/build/CMakeFiles/CMakeTmp/src.cxx
Linking CXX executable cmTC_db0e0
/usr/bin/cmake -E cmake_link_script CMakeFiles/cmTC_db0e0.dir/link.txt --verbose=1
/usr/bin/c++ -march=x86-64 -mtune=generic -O2 -pipe -fno-plt -Wno-unknown-pragmas -Wno-cpp -rdynamic CMakeFiles/cmTC_db0e0.dir/src.cxx.o -o cmTC_db0e0 -Wl,-O1,--sort-common,-z,relro,-z,now
make[1]: Leaving directory '/tmp/makepkg/deal-ii/src/build/CMakeFiles/CMakeTmp'
Source file was:
#include <vector>
template <typename T> void f(T) {}
template void f(int *);
template void f(std::vector<int>::iterator);
int main(){return 0;}
Performing C++ SOURCE FILE Test DEAL_II_HAVE_BUILTIN_EXPECT succeeded with the following output:
Change Dir: /tmp/makepkg/deal-ii/src/build/CMakeFiles/CMakeTmp
Run Build Command(s):/usr/bin/make -f Makefile cmTC_6414b/fast && /usr/bin/make -f CMakeFiles/cmTC_6414b.dir/build.make CMakeFiles/cmTC_6414b.dir/build
make[1]: Entering directory '/tmp/makepkg/deal-ii/src/build/CMakeFiles/CMakeTmp'
Building CXX object CMakeFiles/cmTC_6414b.dir/src.cxx.o
/usr/bin/c++ -DDEAL_II_HAVE_BUILTIN_EXPECT -march=x86-64 -mtune=generic -O2 -pipe -fno-plt -Wno-unknown-pragmas -Wno-cpp -o CMakeFiles/cmTC_6414b.dir/src.cxx.o -c /tmp/makepkg/deal-ii/src/build/CMakeFiles/CMakeTmp/src.cxx
Linking CXX executable cmTC_6414b
/usr/bin/cmake -E cmake_link_script CMakeFiles/cmTC_6414b.dir/link.txt --verbose=1
/usr/bin/c++ -march=x86-64 -mtune=generic -O2 -pipe -fno-plt -Wno-unknown-pragmas -Wno-cpp -rdynamic CMakeFiles/cmTC_6414b.dir/src.cxx.o -o cmTC_6414b -Wl,-O1,--sort-common,-z,relro,-z,now
make[1]: Leaving directory '/tmp/makepkg/deal-ii/src/build/CMakeFiles/CMakeTmp'
Source file was:
bool f() { return true; }
int main(){ if (__builtin_expect(f(),false)) {} }
Performing C++ SOURCE FILE Test DEAL_II_HAVE_GLIBC_STACKTRACE succeeded with the following output:
Change Dir: /tmp/makepkg/deal-ii/src/build/CMakeFiles/CMakeTmp
Run Build Command(s):/usr/bin/make -f Makefile cmTC_aa314/fast && /usr/bin/make -f CMakeFiles/cmTC_aa314.dir/build.make CMakeFiles/cmTC_aa314.dir/build
make[1]: Entering directory '/tmp/makepkg/deal-ii/src/build/CMakeFiles/CMakeTmp'
Building CXX object CMakeFiles/cmTC_aa314.dir/src.cxx.o
/usr/bin/c++ -DDEAL_II_HAVE_GLIBC_STACKTRACE -march=x86-64 -mtune=generic -O2 -pipe -fno-plt -Wno-unknown-pragmas -Wno-cpp -o CMakeFiles/cmTC_aa314.dir/src.cxx.o -c /tmp/makepkg/deal-ii/src/build/CMakeFiles/CMakeTmp/src.cxx
Linking CXX executable cmTC_aa314
/usr/bin/cmake -E cmake_link_script CMakeFiles/cmTC_aa314.dir/link.txt --verbose=1
/usr/bin/c++ -march=x86-64 -mtune=generic -O2 -pipe -fno-plt -Wno-unknown-pragmas -Wno-cpp -rdynamic CMakeFiles/cmTC_aa314.dir/src.cxx.o -o cmTC_aa314 -Wl,-O1,--sort-common,-z,relro,-z,now
make[1]: Leaving directory '/tmp/makepkg/deal-ii/src/build/CMakeFiles/CMakeTmp'
Source file was:
#include <execinfo.h>
#include <stdlib.h>
void * array[25];
int nSize = backtrace(array, 25);
char ** symbols = backtrace_symbols(array, nSize);
int main(){ free(symbols); return 0; }
Performing C++ SOURCE FILE Test DEAL_II_HAVE_LINKER_FLAG_rdynamic succeeded with the following output:
Change Dir: /tmp/makepkg/deal-ii/src/build/CMakeFiles/CMakeTmp
Run Build Command(s):/usr/bin/make -f Makefile cmTC_84bbd/fast && /usr/bin/make -f CMakeFiles/cmTC_84bbd.dir/build.make CMakeFiles/cmTC_84bbd.dir/build
make[1]: Entering directory '/tmp/makepkg/deal-ii/src/build/CMakeFiles/CMakeTmp'
Building CXX object CMakeFiles/cmTC_84bbd.dir/src.cxx.o
/usr/bin/c++ -DDEAL_II_HAVE_LINKER_FLAG_rdynamic -march=x86-64 -mtune=generic -O2 -pipe -fno-plt -Wno-unknown-pragmas -Wno-cpp -Werror -o CMakeFiles/cmTC_84bbd.dir/src.cxx.o -c /tmp/makepkg/deal-ii/src/build/CMakeFiles/CMakeTmp/src.cxx
Linking CXX executable cmTC_84bbd
/usr/bin/cmake -E cmake_link_script CMakeFiles/cmTC_84bbd.dir/link.txt --verbose=1
/usr/bin/c++ -march=x86-64 -mtune=generic -O2 -pipe -fno-plt -Wno-unknown-pragmas -Wno-cpp -Werror -rdynamic CMakeFiles/cmTC_84bbd.dir/src.cxx.o -o cmTC_84bbd -Wl,-O1,--sort-common,-z,relro,-z,now -rdynamic
make[1]: Leaving directory '/tmp/makepkg/deal-ii/src/build/CMakeFiles/CMakeTmp'
Source file was:
int main(){}
Performing C++ SOURCE FILE Test DEAL_II_HAVE_LIBSTDCXX_DEMANGLER succeeded with the following output:
Change Dir: /tmp/makepkg/deal-ii/src/build/CMakeFiles/CMakeTmp
Run Build Command(s):/usr/bin/make -f Makefile cmTC_9a2c4/fast && /usr/bin/make -f CMakeFiles/cmTC_9a2c4.dir/build.make CMakeFiles/cmTC_9a2c4.dir/build
make[1]: Entering directory '/tmp/makepkg/deal-ii/src/build/CMakeFiles/CMakeTmp'
Building CXX object CMakeFiles/cmTC_9a2c4.dir/src.cxx.o
/usr/bin/c++ -DDEAL_II_HAVE_LIBSTDCXX_DEMANGLER -march=x86-64 -mtune=generic -O2 -pipe -fno-plt -Wno-unknown-pragmas -Wno-cpp -o CMakeFiles/cmTC_9a2c4.dir/src.cxx.o -c /tmp/makepkg/deal-ii/src/build/CMakeFiles/CMakeTmp/src.cxx
Linking CXX executable cmTC_9a2c4
/usr/bin/cmake -E cmake_link_script CMakeFiles/cmTC_9a2c4.dir/link.txt --verbose=1
/usr/bin/c++ -march=x86-64 -mtune=generic -O2 -pipe -fno-plt -Wno-unknown-pragmas -Wno-cpp -rdynamic CMakeFiles/cmTC_9a2c4.dir/src.cxx.o -o cmTC_9a2c4 -Wl,-O1,--sort-common,-z,relro,-z,now
make[1]: Leaving directory '/tmp/makepkg/deal-ii/src/build/CMakeFiles/CMakeTmp'
Source file was:
#include <exception>
#include <iostream>
#include <cxxabi.h>
#include <cstdlib>
struct empty { };
template <typename T, int N>
struct bar { };
int status;
char *realname;
int main()
{
// exception classes not in <stdexcept>, thrown by the implementation
// instead of the user
std::bad_exception e;
realname = abi::__cxa_demangle(e.what(), 0, 0, &status);
free(realname);
// typeid
bar<empty,17> u;
const std::type_info &ti = typeid(u);
realname = abi::__cxa_demangle(ti.name(), 0, 0, &status);
free(realname);
return 0;
}
Performing C++ SOURCE FILE Test DEAL_II_COMPILER_HAS_ATTRIBUTE_PRETTY_FUNCTION succeeded with the following output:
Change Dir: /tmp/makepkg/deal-ii/src/build/CMakeFiles/CMakeTmp
Run Build Command(s):/usr/bin/make -f Makefile cmTC_95db5/fast && /usr/bin/make -f CMakeFiles/cmTC_95db5.dir/build.make CMakeFiles/cmTC_95db5.dir/build
make[1]: Entering directory '/tmp/makepkg/deal-ii/src/build/CMakeFiles/CMakeTmp'
Building CXX object CMakeFiles/cmTC_95db5.dir/src.cxx.o
/usr/bin/c++ -DDEAL_II_COMPILER_HAS_ATTRIBUTE_PRETTY_FUNCTION -march=x86-64 -mtune=generic -O2 -pipe -fno-plt -Wno-unknown-pragmas -Wno-cpp -o CMakeFiles/cmTC_95db5.dir/src.cxx.o -c /tmp/makepkg/deal-ii/src/build/CMakeFiles/CMakeTmp/src.cxx
Linking CXX executable cmTC_95db5
/usr/bin/cmake -E cmake_link_script CMakeFiles/cmTC_95db5.dir/link.txt --verbose=1
/usr/bin/c++ -march=x86-64 -mtune=generic -O2 -pipe -fno-plt -Wno-unknown-pragmas -Wno-cpp -rdynamic CMakeFiles/cmTC_95db5.dir/src.cxx.o -o cmTC_95db5 -Wl,-O1,--sort-common,-z,relro,-z,now
make[1]: Leaving directory '/tmp/makepkg/deal-ii/src/build/CMakeFiles/CMakeTmp'
Source file was:
#include <iostream>
int main()
{
std::cout << __PRETTY_FUNCTION__ << std::endl;
return 0;
}
Performing C++ SOURCE FILE Test DEAL_II_HAVE_FLAG_Wa___compress_debug_sections succeeded with the following output:
Change Dir: /tmp/makepkg/deal-ii/src/build/CMakeFiles/CMakeTmp
Run Build Command(s):/usr/bin/make -f Makefile cmTC_90d7f/fast && /usr/bin/make -f CMakeFiles/cmTC_90d7f.dir/build.make CMakeFiles/cmTC_90d7f.dir/build
make[1]: Entering directory '/tmp/makepkg/deal-ii/src/build/CMakeFiles/CMakeTmp'
Building CXX object CMakeFiles/cmTC_90d7f.dir/src.cxx.o
/usr/bin/c++ -DDEAL_II_HAVE_FLAG_Wa___compress_debug_sections -march=x86-64 -mtune=generic -O2 -pipe -fno-plt -Wno-unknown-pragmas -Wno-cpp -O0 -ggdb -Wa,--compress-debug-sections -o CMakeFiles/cmTC_90d7f.dir/src.cxx.o -c /tmp/makepkg/deal-ii/src/build/CMakeFiles/CMakeTmp/src.cxx
Linking CXX executable cmTC_90d7f
/usr/bin/cmake -E cmake_link_script CMakeFiles/cmTC_90d7f.dir/link.txt --verbose=1
/usr/bin/c++ -march=x86-64 -mtune=generic -O2 -pipe -fno-plt -Wno-unknown-pragmas -Wno-cpp -O0 -ggdb -rdynamic CMakeFiles/cmTC_90d7f.dir/src.cxx.o -o cmTC_90d7f -Wl,-O1,--sort-common,-z,relro,-z,now
make[1]: Leaving directory '/tmp/makepkg/deal-ii/src/build/CMakeFiles/CMakeTmp'
Source file was:
int main() { return 0; }
Performing C++ SOURCE FILE Test DEAL_II_COMPILER_HAS_ATTRIBUTE_ALWAYS_INLINE succeeded with the following output:
Change Dir: /tmp/makepkg/deal-ii/src/build/CMakeFiles/CMakeTmp
Run Build Command(s):/usr/bin/make -f Makefile cmTC_f6a23/fast && /usr/bin/make -f CMakeFiles/cmTC_f6a23.dir/build.make CMakeFiles/cmTC_f6a23.dir/build
make[1]: Entering directory '/tmp/makepkg/deal-ii/src/build/CMakeFiles/CMakeTmp'
Building CXX object CMakeFiles/cmTC_f6a23.dir/src.cxx.o
/usr/bin/c++ -DDEAL_II_COMPILER_HAS_ATTRIBUTE_ALWAYS_INLINE -march=x86-64 -mtune=generic -O2 -pipe -fno-plt -Wno-unknown-pragmas -Wno-cpp -o CMakeFiles/cmTC_f6a23.dir/src.cxx.o -c /tmp/makepkg/deal-ii/src/build/CMakeFiles/CMakeTmp/src.cxx
/tmp/makepkg/deal-ii/src/build/CMakeFiles/CMakeTmp/src.cxx:2:46: warning: ‘always_inline’ function might not be inlinable [-Wattributes]
2 | __attribute__((always_inline)) int fn () { return 0; }
| ^~
Linking CXX executable cmTC_f6a23
/usr/bin/cmake -E cmake_link_script CMakeFiles/cmTC_f6a23.dir/link.txt --verbose=1
/usr/bin/c++ -march=x86-64 -mtune=generic -O2 -pipe -fno-plt -Wno-unknown-pragmas -Wno-cpp -rdynamic CMakeFiles/cmTC_f6a23.dir/src.cxx.o -o cmTC_f6a23 -Wl,-O1,--sort-common,-z,relro,-z,now
make[1]: Leaving directory '/tmp/makepkg/deal-ii/src/build/CMakeFiles/CMakeTmp'
Source file was:
__attribute__((always_inline)) int fn () { return 0; }
int main () { return fn(); }
Performing C++ SOURCE FILE Test DEAL_II_COMPILER_HAS_RESTRICT_KEYWORD succeeded with the following output:
Change Dir: /tmp/makepkg/deal-ii/src/build/CMakeFiles/CMakeTmp
Run Build Command(s):/usr/bin/make -f Makefile cmTC_4c8d3/fast && /usr/bin/make -f CMakeFiles/cmTC_4c8d3.dir/build.make CMakeFiles/cmTC_4c8d3.dir/build
make[1]: Entering directory '/tmp/makepkg/deal-ii/src/build/CMakeFiles/CMakeTmp'
Building CXX object CMakeFiles/cmTC_4c8d3.dir/src.cxx.o
/usr/bin/c++ -DDEAL_II_COMPILER_HAS_RESTRICT_KEYWORD -march=x86-64 -mtune=generic -O2 -pipe -fno-plt -Wno-unknown-pragmas -Wno-cpp -o CMakeFiles/cmTC_4c8d3.dir/src.cxx.o -c /tmp/makepkg/deal-ii/src/build/CMakeFiles/CMakeTmp/src.cxx
Linking CXX executable cmTC_4c8d3
/usr/bin/cmake -E cmake_link_script CMakeFiles/cmTC_4c8d3.dir/link.txt --verbose=1
/usr/bin/c++ -march=x86-64 -mtune=generic -O2 -pipe -fno-plt -Wno-unknown-pragmas -Wno-cpp -rdynamic CMakeFiles/cmTC_4c8d3.dir/src.cxx.o -o cmTC_4c8d3 -Wl,-O1,--sort-common,-z,relro,-z,now
make[1]: Leaving directory '/tmp/makepkg/deal-ii/src/build/CMakeFiles/CMakeTmp'
Source file was:
void fn (double *__restrict a, double *__restrict b) { a[0] = b[0]; a[1] = b[0]; }
int main() { }
Performing C++ SOURCE FILE Test DEAL_II_COMPILER_HAS_DIAGNOSTIC_PRAGMA succeeded with the following output:
Change Dir: /tmp/makepkg/deal-ii/src/build/CMakeFiles/CMakeTmp
Run Build Command(s):/usr/bin/make -f Makefile cmTC_d2c99/fast && /usr/bin/make -f CMakeFiles/cmTC_d2c99.dir/build.make CMakeFiles/cmTC_d2c99.dir/build
make[1]: Entering directory '/tmp/makepkg/deal-ii/src/build/CMakeFiles/CMakeTmp'
Building CXX object CMakeFiles/cmTC_d2c99.dir/src.cxx.o
/usr/bin/c++ -DDEAL_II_COMPILER_HAS_DIAGNOSTIC_PRAGMA -march=x86-64 -mtune=generic -O2 -pipe -fno-plt -Wno-unknown-pragmas -Wno-cpp -Werror -o CMakeFiles/cmTC_d2c99.dir/src.cxx.o -c /tmp/makepkg/deal-ii/src/build/CMakeFiles/CMakeTmp/src.cxx
Linking CXX executable cmTC_d2c99
/usr/bin/cmake -E cmake_link_script CMakeFiles/cmTC_d2c99.dir/link.txt --verbose=1
/usr/bin/c++ -march=x86-64 -mtune=generic -O2 -pipe -fno-plt -Wno-unknown-pragmas -Wno-cpp -Werror -rdynamic CMakeFiles/cmTC_d2c99.dir/src.cxx.o -o cmTC_d2c99 -Wl,-O1,--sort-common,-z,relro,-z,now
make[1]: Leaving directory '/tmp/makepkg/deal-ii/src/build/CMakeFiles/CMakeTmp'
Source file was:
_Pragma("GCC diagnostic push")
_Pragma("GCC diagnostic ignored \"-Wextra\"")
_Pragma("GCC diagnostic ignored \"-Wunknown-pragmas\"")
_Pragma("GCC diagnostic ignored \"-Wpragmas\"")
int main() { return 0; }
_Pragma("GCC diagnostic pop")
Performing C++ SOURCE FILE Test DEAL_II_COMPILER_HAS_FUSE_LD_GOLD succeeded with the following output:
Change Dir: /tmp/makepkg/deal-ii/src/build/CMakeFiles/CMakeTmp
Run Build Command(s):/usr/bin/make -f Makefile cmTC_a7d9f/fast && /usr/bin/make -f CMakeFiles/cmTC_a7d9f.dir/build.make CMakeFiles/cmTC_a7d9f.dir/build
make[1]: Entering directory '/tmp/makepkg/deal-ii/src/build/CMakeFiles/CMakeTmp'
Building CXX object CMakeFiles/cmTC_a7d9f.dir/src.cxx.o
/usr/bin/c++ -DDEAL_II_COMPILER_HAS_FUSE_LD_GOLD -march=x86-64 -mtune=generic -O2 -pipe -fno-plt -Wno-unknown-pragmas -Wno-cpp -Werror -shared -fPIC -fuse-ld=gold -o CMakeFiles/cmTC_a7d9f.dir/src.cxx.o -c /tmp/makepkg/deal-ii/src/build/CMakeFiles/CMakeTmp/src.cxx
Linking CXX executable cmTC_a7d9f
/usr/bin/cmake -E cmake_link_script CMakeFiles/cmTC_a7d9f.dir/link.txt --verbose=1
/usr/bin/c++ -march=x86-64 -mtune=generic -O2 -pipe -fno-plt -Wno-unknown-pragmas -Wno-cpp -Werror -shared -fPIC -fuse-ld=gold -rdynamic CMakeFiles/cmTC_a7d9f.dir/src.cxx.o -o cmTC_a7d9f -Wl,-O1,--sort-common,-z,relro,-z,now
make[1]: Leaving directory '/tmp/makepkg/deal-ii/src/build/CMakeFiles/CMakeTmp'
Source file was:
#include <iostream>
void foo() { std::cout << "Hello, world!" << std::endl; }
Determining if the include file sys/resource.h exists passed with the following output:
Change Dir: /tmp/makepkg/deal-ii/src/build/CMakeFiles/CMakeTmp
Run Build Command(s):/usr/bin/make -f Makefile cmTC_5c39b/fast && /usr/bin/make -f CMakeFiles/cmTC_5c39b.dir/build.make CMakeFiles/cmTC_5c39b.dir/build
make[1]: Entering directory '/tmp/makepkg/deal-ii/src/build/CMakeFiles/CMakeTmp'
Building CXX object CMakeFiles/cmTC_5c39b.dir/CheckIncludeFile.cxx.o
/usr/bin/c++ -march=x86-64 -mtune=generic -O2 -pipe -fno-plt -Wno-unknown-pragmas -Wno-cpp -O3 -DNDEBUG -o CMakeFiles/cmTC_5c39b.dir/CheckIncludeFile.cxx.o -c /tmp/makepkg/deal-ii/src/build/CMakeFiles/CMakeTmp/CheckIncludeFile.cxx
Linking CXX executable cmTC_5c39b
/usr/bin/cmake -E cmake_link_script CMakeFiles/cmTC_5c39b.dir/link.txt --verbose=1
/usr/bin/c++ -march=x86-64 -mtune=generic -O2 -pipe -fno-plt -Wno-unknown-pragmas -Wno-cpp -O3 -DNDEBUG -rdynamic CMakeFiles/cmTC_5c39b.dir/CheckIncludeFile.cxx.o -o cmTC_5c39b
make[1]: Leaving directory '/tmp/makepkg/deal-ii/src/build/CMakeFiles/CMakeTmp'
Determining if the include file unistd.h exists passed with the following output:
Change Dir: /tmp/makepkg/deal-ii/src/build/CMakeFiles/CMakeTmp
Run Build Command(s):/usr/bin/make -f Makefile cmTC_ab013/fast && /usr/bin/make -f CMakeFiles/cmTC_ab013.dir/build.make CMakeFiles/cmTC_ab013.dir/build
make[1]: Entering directory '/tmp/makepkg/deal-ii/src/build/CMakeFiles/CMakeTmp'
Building CXX object CMakeFiles/cmTC_ab013.dir/CheckIncludeFile.cxx.o
/usr/bin/c++ -march=x86-64 -mtune=generic -O2 -pipe -fno-plt -Wno-unknown-pragmas -Wno-cpp -O3 -DNDEBUG -o CMakeFiles/cmTC_ab013.dir/CheckIncludeFile.cxx.o -c /tmp/makepkg/deal-ii/src/build/CMakeFiles/CMakeTmp/CheckIncludeFile.cxx
Linking CXX executable cmTC_ab013
/usr/bin/cmake -E cmake_link_script CMakeFiles/cmTC_ab013.dir/link.txt --verbose=1
/usr/bin/c++ -march=x86-64 -mtune=generic -O2 -pipe -fno-plt -Wno-unknown-pragmas -Wno-cpp -O3 -DNDEBUG -rdynamic CMakeFiles/cmTC_ab013.dir/CheckIncludeFile.cxx.o -o cmTC_ab013
make[1]: Leaving directory '/tmp/makepkg/deal-ii/src/build/CMakeFiles/CMakeTmp'
Determining if the gethostname exist passed with the following output:
Change Dir: /tmp/makepkg/deal-ii/src/build/CMakeFiles/CMakeTmp
Run Build Command(s):/usr/bin/make -f Makefile cmTC_2efaa/fast && /usr/bin/make -f CMakeFiles/cmTC_2efaa.dir/build.make CMakeFiles/cmTC_2efaa.dir/build
make[1]: Entering directory '/tmp/makepkg/deal-ii/src/build/CMakeFiles/CMakeTmp'
Building CXX object CMakeFiles/cmTC_2efaa.dir/CheckSymbolExists.cxx.o
/usr/bin/c++ -march=x86-64 -mtune=generic -O2 -pipe -fno-plt -Wno-unknown-pragmas -Wno-cpp -O3 -DNDEBUG -o CMakeFiles/cmTC_2efaa.dir/CheckSymbolExists.cxx.o -c /tmp/makepkg/deal-ii/src/build/CMakeFiles/CMakeTmp/CheckSymbolExists.cxx
Linking CXX executable cmTC_2efaa
/usr/bin/cmake -E cmake_link_script CMakeFiles/cmTC_2efaa.dir/link.txt --verbose=1
/usr/bin/c++ -march=x86-64 -mtune=generic -O2 -pipe -fno-plt -Wno-unknown-pragmas -Wno-cpp -O3 -DNDEBUG -rdynamic CMakeFiles/cmTC_2efaa.dir/CheckSymbolExists.cxx.o -o cmTC_2efaa -Wl,-O1,--sort-common,-z,relro,-z,now
make[1]: Leaving directory '/tmp/makepkg/deal-ii/src/build/CMakeFiles/CMakeTmp'
File /tmp/makepkg/deal-ii/src/build/CMakeFiles/CMakeTmp/CheckSymbolExists.cxx:
/* */
#include <unistd.h>
int main(int argc, char** argv)
{
(void)argv;
#ifndef gethostname
return ((int*)(&gethostname))[argc];
#else
(void)argc;
return 0;
#endif
}
Determining if the getpid exist passed with the following output:
Change Dir: /tmp/makepkg/deal-ii/src/build/CMakeFiles/CMakeTmp
Run Build Command(s):/usr/bin/make -f Makefile cmTC_c2a91/fast && /usr/bin/make -f CMakeFiles/cmTC_c2a91.dir/build.make CMakeFiles/cmTC_c2a91.dir/build
make[1]: Entering directory '/tmp/makepkg/deal-ii/src/build/CMakeFiles/CMakeTmp'
Building CXX object CMakeFiles/cmTC_c2a91.dir/CheckSymbolExists.cxx.o
/usr/bin/c++ -march=x86-64 -mtune=generic -O2 -pipe -fno-plt -Wno-unknown-pragmas -Wno-cpp -O3 -DNDEBUG -o CMakeFiles/cmTC_c2a91.dir/CheckSymbolExists.cxx.o -c /tmp/makepkg/deal-ii/src/build/CMakeFiles/CMakeTmp/CheckSymbolExists.cxx
Linking CXX executable cmTC_c2a91
/usr/bin/cmake -E cmake_link_script CMakeFiles/cmTC_c2a91.dir/link.txt --verbose=1
/usr/bin/c++ -march=x86-64 -mtune=generic -O2 -pipe -fno-plt -Wno-unknown-pragmas -Wno-cpp -O3 -DNDEBUG -rdynamic CMakeFiles/cmTC_c2a91.dir/CheckSymbolExists.cxx.o -o cmTC_c2a91 -Wl,-O1,--sort-common,-z,relro,-z,now
make[1]: Leaving directory '/tmp/makepkg/deal-ii/src/build/CMakeFiles/CMakeTmp'
File /tmp/makepkg/deal-ii/src/build/CMakeFiles/CMakeTmp/CheckSymbolExists.cxx:
/* */
#include <unistd.h>
int main(int argc, char** argv)
{
(void)argv;
#ifndef getpid
return ((int*)(&getpid))[argc];
#else
(void)argc;
return 0;
#endif
}
Determining if the include file pthread.h exists passed with the following output:
Change Dir: /tmp/makepkg/deal-ii/src/build/CMakeFiles/CMakeTmp
Run Build Command(s):/usr/bin/make -f Makefile cmTC_cc321/fast && /usr/bin/make -f CMakeFiles/cmTC_cc321.dir/build.make CMakeFiles/cmTC_cc321.dir/build
make[1]: Entering directory '/tmp/makepkg/deal-ii/src/build/CMakeFiles/CMakeTmp'
Building C object CMakeFiles/cmTC_cc321.dir/CheckIncludeFile.c.o
/usr/bin/cc -O3 -DNDEBUG -o CMakeFiles/cmTC_cc321.dir/CheckIncludeFile.c.o -c /tmp/makepkg/deal-ii/src/build/CMakeFiles/CMakeTmp/CheckIncludeFile.c
Linking C executable cmTC_cc321
/usr/bin/cmake -E cmake_link_script CMakeFiles/cmTC_cc321.dir/link.txt --verbose=1
/usr/bin/cc -O3 -DNDEBUG -rdynamic CMakeFiles/cmTC_cc321.dir/CheckIncludeFile.c.o -o cmTC_cc321
make[1]: Leaving directory '/tmp/makepkg/deal-ii/src/build/CMakeFiles/CMakeTmp'
Determining if the function pthread_create exists in the pthread passed with the following output:
Change Dir: /tmp/makepkg/deal-ii/src/build/CMakeFiles/CMakeTmp
Run Build Command(s):/usr/bin/make -f Makefile cmTC_a2ec8/fast && /usr/bin/make -f CMakeFiles/cmTC_a2ec8.dir/build.make CMakeFiles/cmTC_a2ec8.dir/build
make[1]: Entering directory '/tmp/makepkg/deal-ii/src/build/CMakeFiles/CMakeTmp'
Building C object CMakeFiles/cmTC_a2ec8.dir/CheckFunctionExists.c.o
/usr/bin/cc -DCHECK_FUNCTION_EXISTS=pthread_create -O3 -DNDEBUG -o CMakeFiles/cmTC_a2ec8.dir/CheckFunctionExists.c.o -c /usr/share/cmake-3.21/Modules/CheckFunctionExists.c
Linking C executable cmTC_a2ec8
/usr/bin/cmake -E cmake_link_script CMakeFiles/cmTC_a2ec8.dir/link.txt --verbose=1
/usr/bin/cc -DCHECK_FUNCTION_EXISTS=pthread_create -O3 -DNDEBUG -rdynamic CMakeFiles/cmTC_a2ec8.dir/CheckFunctionExists.c.o -o cmTC_a2ec8 -lpthread
make[1]: Leaving directory '/tmp/makepkg/deal-ii/src/build/CMakeFiles/CMakeTmp'
Determining if the Fortran sgemm exists passed with the following output:
Change Dir: /tmp/makepkg/deal-ii/src/build/CMakeFiles/CMakeTmp
Run Build Command(s):/usr/bin/make -f Makefile cmTC_0d4bb/fast && /usr/bin/make -f CMakeFiles/cmTC_0d4bb.dir/build.make CMakeFiles/cmTC_0d4bb.dir/build
make[1]: Entering directory '/tmp/makepkg/deal-ii/src/build/CMakeFiles/CMakeTmp'
Building Fortran object CMakeFiles/cmTC_0d4bb.dir/testFortranCompiler.f.o
/usr/bin/gfortran -O3 -DNDEBUG -O3 -c /tmp/makepkg/deal-ii/src/build/CMakeFiles/CMakeTmp/testFortranCompiler.f -o CMakeFiles/cmTC_0d4bb.dir/testFortranCompiler.f.o
Linking Fortran executable cmTC_0d4bb
/usr/bin/cmake -E cmake_link_script CMakeFiles/cmTC_0d4bb.dir/link.txt --verbose=1
/usr/bin/gfortran -O3 -DNDEBUG -O3 CMakeFiles/cmTC_0d4bb.dir/testFortranCompiler.f.o -o cmTC_0d4bb -Wl,-rpath,/opt/intel/mkl/lib/intel64_lin /opt/intel/mkl/lib/intel64_lin/libmkl_gf_lp64.so /opt/intel/mkl/lib/intel64_lin/libmkl_gnu_thread.so /opt/intel/mkl/lib/intel64_lin/libmkl_core.so /usr/lib/libgomp.so -lpthread -lm -ldl
make[1]: Leaving directory '/tmp/makepkg/deal-ii/src/build/CMakeFiles/CMakeTmp'
Determining if the Fortran cheev exists passed with the following output:
Change Dir: /tmp/makepkg/deal-ii/src/build/CMakeFiles/CMakeTmp
Run Build Command(s):/usr/bin/make -f Makefile cmTC_b7773/fast && /usr/bin/make -f CMakeFiles/cmTC_b7773.dir/build.make CMakeFiles/cmTC_b7773.dir/build
make[1]: Entering directory '/tmp/makepkg/deal-ii/src/build/CMakeFiles/CMakeTmp'
Building Fortran object CMakeFiles/cmTC_b7773.dir/testFortranCompiler.f.o
/usr/bin/gfortran -O3 -DNDEBUG -O3 -c /tmp/makepkg/deal-ii/src/build/CMakeFiles/CMakeTmp/testFortranCompiler.f -o CMakeFiles/cmTC_b7773.dir/testFortranCompiler.f.o
Linking Fortran executable cmTC_b7773
/usr/bin/cmake -E cmake_link_script CMakeFiles/cmTC_b7773.dir/link.txt --verbose=1
/usr/bin/gfortran -O3 -DNDEBUG -O3 CMakeFiles/cmTC_b7773.dir/testFortranCompiler.f.o -o cmTC_b7773 -Wl,-rpath,/opt/intel/mkl/lib/intel64_lin /opt/intel/mkl/lib/intel64_lin/libmkl_gf_lp64.so /opt/intel/mkl/lib/intel64_lin/libmkl_gnu_thread.so /opt/intel/mkl/lib/intel64_lin/libmkl_core.so /usr/lib/libgomp.so -lpthread -lm -ldl -lpthread -lm -ldl
make[1]: Leaving directory '/tmp/makepkg/deal-ii/src/build/CMakeFiles/CMakeTmp'
Performing C SOURCE FILE Test LAPACK_SYMBOL_CHECK succeeded with the following output:
Change Dir: /tmp/makepkg/deal-ii/src/build/CMakeFiles/CMakeTmp
Run Build Command(s):/usr/bin/make -f Makefile cmTC_f32d9/fast && /usr/bin/make -f CMakeFiles/cmTC_f32d9.dir/build.make CMakeFiles/cmTC_f32d9.dir/build
make[1]: Entering directory '/tmp/makepkg/deal-ii/src/build/CMakeFiles/CMakeTmp'
Building C object CMakeFiles/cmTC_f32d9.dir/src.c.o
/usr/bin/cc -DLAPACK_SYMBOL_CHECK -O3 -DNDEBUG -o CMakeFiles/cmTC_f32d9.dir/src.c.o -c /tmp/makepkg/deal-ii/src/build/CMakeFiles/CMakeTmp/src.c
Linking C executable cmTC_f32d9
/usr/bin/cmake -E cmake_link_script CMakeFiles/cmTC_f32d9.dir/link.txt --verbose=1
/usr/bin/cc -O3 -DNDEBUG -rdynamic CMakeFiles/cmTC_f32d9.dir/src.c.o -o cmTC_f32d9 -Wl,-rpath,/opt/intel/mkl/lib/intel64_lin -Wl,-O1,--sort-common,-z,relro,-z,now /opt/intel/mkl/lib/intel64_lin/libmkl_gf_lp64.so /opt/intel/mkl/lib/intel64_lin/libmkl_gnu_thread.so /opt/intel/mkl/lib/intel64_lin/libmkl_core.so /usr/lib/libgomp.so -lm -ldl
make[1]: Leaving directory '/tmp/makepkg/deal-ii/src/build/CMakeFiles/CMakeTmp'
Source file was:
#define MANGLE(name, NAME) name ## _
char MANGLE(daxpy, DAXPY)(); char MANGLE(dgeev, DGEEV)(); char MANGLE(dgeevx, DGEEVX)(); char MANGLE(dgelsd, DGELSD)();
char MANGLE(dgemm, DGEMM)(); char MANGLE(dgemv, DGEMV)(); char MANGLE(dgeqrf, DGEQRF)(); char MANGLE(dgesdd, DGESDD)();
char MANGLE(dgesvd, DGESVD)(); char MANGLE(dgetrf, DGETRF)(); char MANGLE(dgetri, DGETRI)(); char MANGLE(dgetrs, DGETRS)();
char MANGLE(dorgqr, DORGQR)(); char MANGLE(dormqr, DORMQR)(); char MANGLE(dstev, DSTEV)(); char MANGLE(dsyevx, DSYEVX)();
char MANGLE(dsygv, DSYGV)(); char MANGLE(dsygvx, DSYGVX)(); char MANGLE(dtrtrs, DTRTRS)(); char MANGLE(saxpy, SAXPY)();
char MANGLE(sgeev, SGEEV)(); char MANGLE(sgeevx, SGEEVX)(); char MANGLE(sgelsd, SGELSD)(); char MANGLE(sgemm, SGEMM)();
char MANGLE(sgemv, SGEMV)(); char MANGLE(sgeqrf, SGEQRF)(); char MANGLE(sgesdd, SGESDD)(); char MANGLE(sgesvd, SGESVD)();
char MANGLE(sgetrf, SGETRF)(); char MANGLE(sgetri, SGETRI)(); char MANGLE(sgetrs, SGETRS)(); char MANGLE(sorgqr, SORGQR)();
char MANGLE(sormqr, SORMQR)(); char MANGLE(sstev, SSTEV)(); char MANGLE(ssyevx, SSYEVX)(); char MANGLE(ssygv, SSYGV)();
char MANGLE(ssygvx, SSYGVX)(); char MANGLE(strtrs, STRTRS)();
int main(){
MANGLE(daxpy, DAXPY)(); MANGLE(dgeev, DGEEV)(); MANGLE(dgeevx, DGEEVX)(); MANGLE(dgelsd, DGELSD)(); MANGLE(dgemm, DGEMM)();
MANGLE(dgemv, DGEMV)(); MANGLE(dgeqrf, DGEQRF)(); MANGLE(dgesdd, DGESDD)(); MANGLE(dgesvd, DGESVD)(); MANGLE(dgetrf, DGETRF)();
MANGLE(dgetri, DGETRI)(); MANGLE(dgetrs, DGETRS)(); MANGLE(dorgqr, DORGQR)(); MANGLE(dormqr, DORMQR)(); MANGLE(dstev, DSTEV)();
MANGLE(dsyevx, DSYEVX)(); MANGLE(dsygv, DSYGV)(); MANGLE(dsygvx, DSYGVX)(); MANGLE(dtrtrs, DTRTRS)(); MANGLE(saxpy, SAXPY)();
MANGLE(sgeev, SGEEV)(); MANGLE(sgeevx, SGEEVX)(); MANGLE(sgelsd, SGELSD)(); MANGLE(sgemm, SGEMM)(); MANGLE(sgemv, SGEMV)();
MANGLE(sgeqrf, SGEQRF)(); MANGLE(sgesdd, SGESDD)(); MANGLE(sgesvd, SGESVD)(); MANGLE(sgetrf, SGETRF)(); MANGLE(sgetri, SGETRI)();
MANGLE(sgetrs, SGETRS)(); MANGLE(sorgqr, SORGQR)(); MANGLE(sormqr, SORMQR)(); MANGLE(sstev, SSTEV)(); MANGLE(ssyevx, SSYEVX)();
MANGLE(ssygv, SSYGV)(); MANGLE(ssygvx, SSYGVX)(); MANGLE(strtrs, STRTRS)();
return 0;
}
Performing C++ SOURCE FILE Test MKL_SYMBOL_CHECK succeeded with the following output:
Change Dir: /tmp/makepkg/deal-ii/src/build/CMakeFiles/CMakeTmp
Run Build Command(s):/usr/bin/make -f Makefile cmTC_e0c6a/fast && /usr/bin/make -f CMakeFiles/cmTC_e0c6a.dir/build.make CMakeFiles/cmTC_e0c6a.dir/build
make[1]: Entering directory '/tmp/makepkg/deal-ii/src/build/CMakeFiles/CMakeTmp'
Building CXX object CMakeFiles/cmTC_e0c6a.dir/src.cxx.o
/usr/bin/c++ -DMKL_SYMBOL_CHECK -I/opt/intel/mkl/include -O3 -DNDEBUG -o CMakeFiles/cmTC_e0c6a.dir/src.cxx.o -c /tmp/makepkg/deal-ii/src/build/CMakeFiles/CMakeTmp/src.cxx
Linking CXX executable cmTC_e0c6a
/usr/bin/cmake -E cmake_link_script CMakeFiles/cmTC_e0c6a.dir/link.txt --verbose=1
/usr/bin/c++ -O3 -DNDEBUG -rdynamic CMakeFiles/cmTC_e0c6a.dir/src.cxx.o -o cmTC_e0c6a -Wl,-rpath,/opt/intel/mkl/lib/intel64_lin -Wl,-O1,--sort-common,-z,relro,-z,now /opt/intel/mkl/lib/intel64_lin/libmkl_gf_lp64.so /opt/intel/mkl/lib/intel64_lin/libmkl_gnu_thread.so /opt/intel/mkl/lib/intel64_lin/libmkl_core.so /usr/lib/libgomp.so -lm -ldl
make[1]: Leaving directory '/tmp/makepkg/deal-ii/src/build/CMakeFiles/CMakeTmp'
Source file was:
#include <mkl.h>
#include <vector>
int main(){
const int m = 5;
const int n = 2;
std::vector<double> A(m*n,0.);
std::vector<double> B(m*n,0.);
mkl_domatcopy('C', 'T', m, n, 1., A.data(), n, B.data(), m);
return 0;
}
Performing C++ SOURCE FILE Test MPI_HAVE_MPI_SEEK_SET succeeded with the following output:
Change Dir: /tmp/makepkg/deal-ii/src/build/CMakeFiles/CMakeTmp
Run Build Command(s):/usr/bin/make -f Makefile cmTC_29108/fast && /usr/bin/make -f CMakeFiles/cmTC_29108.dir/build.make CMakeFiles/cmTC_29108.dir/build
make[1]: Entering directory '/tmp/makepkg/deal-ii/src/build/CMakeFiles/CMakeTmp'
Building CXX object CMakeFiles/cmTC_29108.dir/src.cxx.o
/usr/bin/c++ -DMPI_HAVE_MPI_SEEK_SET -march=x86-64 -mtune=generic -O2 -pipe -fno-plt -Wno-unknown-pragmas -Wno-cpp -O3 -DNDEBUG -o CMakeFiles/cmTC_29108.dir/src.cxx.o -c /tmp/makepkg/deal-ii/src/build/CMakeFiles/CMakeTmp/src.cxx
Linking CXX executable cmTC_29108
/usr/bin/cmake -E cmake_link_script CMakeFiles/cmTC_29108.dir/link.txt --verbose=1
/usr/bin/c++ -march=x86-64 -mtune=generic -O2 -pipe -fno-plt -Wno-unknown-pragmas -Wno-cpp -O3 -DNDEBUG -rdynamic CMakeFiles/cmTC_29108.dir/src.cxx.o -o cmTC_29108 -Wl,-rpath,/usr/lib/openmpi -Wl,-O1,--sort-common,-z,relro,-z,now /usr/lib/openmpi/libmpi_cxx.so /usr/lib/openmpi/libmpi.so
make[1]: Leaving directory '/tmp/makepkg/deal-ii/src/build/CMakeFiles/CMakeTmp'
Source file was:
#include <mpi.h>
#ifndef MPI_SEEK_SET
# error
#endif
int main() {}
Performing C++ SOURCE FILE Test MPI_UNDERLINKAGE_OK succeeded with the following output:
Change Dir: /tmp/makepkg/deal-ii/src/build/CMakeFiles/CMakeTmp
Run Build Command(s):/usr/bin/make -f Makefile cmTC_91c6a/fast && /usr/bin/make -f CMakeFiles/cmTC_91c6a.dir/build.make CMakeFiles/cmTC_91c6a.dir/build
make[1]: Entering directory '/tmp/makepkg/deal-ii/src/build/CMakeFiles/CMakeTmp'
Building CXX object CMakeFiles/cmTC_91c6a.dir/src.cxx.o
/usr/bin/c++ -DMPI_UNDERLINKAGE_OK -march=x86-64 -mtune=generic -O2 -pipe -fno-plt -Wno-unknown-pragmas -Wno-cpp -pedantic -fPIC -Wall -Wextra -Wmissing-braces -Woverloaded-virtual -Wpointer-arith -Wsign-compare -Wsuggest-override -Wswitch -Wsynth -Wwrite-strings -Wno-placement-new -Wno-deprecated-declarations -Wno-literal-suffix -Wno-psabi -Wno-class-memaccess -fopenmp-simd -O3 -DNDEBUG -o CMakeFiles/cmTC_91c6a.dir/src.cxx.o -c /tmp/makepkg/deal-ii/src/build/CMakeFiles/CMakeTmp/src.cxx
Linking CXX executable cmTC_91c6a
/usr/bin/cmake -E cmake_link_script CMakeFiles/cmTC_91c6a.dir/link.txt --verbose=1
/usr/bin/c++ -march=x86-64 -mtune=generic -O2 -pipe -fno-plt -Wno-unknown-pragmas -Wno-cpp -pedantic -fPIC -Wall -Wextra -Wmissing-braces -Woverloaded-virtual -Wpointer-arith -Wsign-compare -Wsuggest-override -Wswitch -Wsynth -Wwrite-strings -Wno-placement-new -Wno-deprecated-declarations -Wno-literal-suffix -Wno-psabi -Wno-class-memaccess -fopenmp-simd -O3 -DNDEBUG -rdynamic CMakeFiles/cmTC_91c6a.dir/src.cxx.o -o cmTC_91c6a -Wl,-rpath,/usr/lib/openmpi -Wl,-O1,--sort-common,-z,relro,-z,now -rdynamic -fuse-ld=gold -lpthread /usr/lib/openmpi/libmpi_cxx.so /usr/lib/openmpi/libmpi.so /usr/lib/openmpi/libmpi_usempif08.so /usr/lib/openmpi/libmpi_usempi_ignore_tkr.so /usr/lib/openmpi/libmpi_mpifh.so /usr/lib/openmpi/libmpi.so /usr/lib/openmpi/libmpi.so /usr/lib/openmpi/libmpi_usempif08.so /usr/lib/openmpi/libmpi_usempi_ignore_tkr.so /usr/lib/openmpi/libmpi_mpifh.so
make[1]: Leaving directory '/tmp/makepkg/deal-ii/src/build/CMakeFiles/CMakeTmp'
Source file was:
int main(){ return 0; }
Performing C++ SOURCE FILE Test BOOST_IOSTREAMS_USABLE succeeded with the following output:
Change Dir: /tmp/makepkg/deal-ii/src/build/CMakeFiles/CMakeTmp