Skip to content

Instantly share code, notes, and snippets.

Embed
What would you like to do?
13:06:54 ~/W/p/a/ghc-head-may2018-clang-sad (master|✔) $ make -j1
===--- building phase 0
/Applications/Xcode.app/Contents/Developer/usr/bin/make --no-print-directory -f ghc.mk phase=0 phase_0_builds
make[1]: Nothing to be done for `phase_0_builds'.
===--- building phase 1
/Applications/Xcode.app/Contents/Developer/usr/bin/make --no-print-directory -f ghc.mk phase=1 phase_1_builds
make[1]: Nothing to be done for `phase_1_builds'.
===--- building final phase
/Applications/Xcode.app/Contents/Developer/usr/bin/make --no-print-directory -f ghc.mk phase=final all
"rm" -f rts/dist/build/libHSrts_l.a
echo rts/dist/build/Adjustor.l_o rts/dist/build/Arena.l_o rts/dist/build/Capability.l_o rts/dist/build/CheckUnload.l_o rts/dist/build/ClosureFlags.l_o rts/dist/build/Disassembler.l_o rts/dist/build/FileLock.l_o rts/dist/build/Globals.l_o rts/dist/build/Hash.l_o rts/dist/build/Heap.l_o rts/dist/build/Hpc.l_o rts/dist/build/HsFFI.l_o rts/dist/build/Inlines.l_o rts/dist/build/Interpreter.l_o rts/dist/build/LdvProfile.l_o rts/dist/build/Libdw.l_o rts/dist/build/LibdwPool.l_o rts/dist/build/Linker.l_o rts/dist/build/Messages.l_o rts/dist/build/OldARMAtomic.l_o rts/dist/build/PathUtils.l_o rts/dist/build/Pool.l_o rts/dist/build/Printer.l_o rts/dist/build/ProfHeap.l_o rts/dist/build/ProfilerReport.l_o rts/dist/build/ProfilerReportJson.l_o rts/dist/build/Profiling.l_o rts/dist/build/Proftimer.l_o rts/dist/build/RaiseAsync.l_o rts/dist/build/RetainerProfile.l_o rts/dist/build/RetainerSet.l_o rts/dist/build/RtsAPI.l_o rts/dist/build/RtsDllMain.l_o rts/dist/build/RtsFlags.l_o rts/dist/build/RtsMain.l_o rts/dist/build/RtsMessages.l_o rts/dist/build/RtsStartup.l_o rts/dist/build/RtsSymbolInfo.l_o rts/dist/build/RtsSymbols.l_o rts/dist/build/RtsUtils.l_o rts/dist/build/STM.l_o rts/dist/build/Schedule.l_o rts/dist/build/Sparks.l_o rts/dist/build/Stable.l_o rts/dist/build/StaticPtrTable.l_o rts/dist/build/Stats.l_o rts/dist/build/StgCRun.l_o rts/dist/build/StgPrimFloat.l_o rts/dist/build/Task.l_o rts/dist/build/ThreadLabels.l_o rts/dist/build/ThreadPaused.l_o rts/dist/build/Threads.l_o rts/dist/build/Ticky.l_o rts/dist/build/Timer.l_o rts/dist/build/TopHandler.l_o rts/dist/build/Trace.l_o rts/dist/build/WSDeque.l_o rts/dist/build/Weak.l_o rts/dist/build/fs.l_o rts/dist/build/xxhash.l_o rts/dist/build/hooks/FlagDefaults.l_o rts/dist/build/hooks/LongGCSync.l_o rts/dist/build/hooks/MallocFail.l_o rts/dist/build/hooks/OnExit.l_o rts/dist/build/hooks/OutOfHeap.l_o rts/dist/build/hooks/StackOverflow.l_o rts/dist/build/sm/BlockAlloc.l_o rts/dist/build/sm/CNF.l_o rts/dist/build/sm/Compact.l_o rts/dist/build/sm/Evac.l_o rts/dist/build/sm/Evac_thr.l_o rts/dist/build/sm/GC.l_o rts/dist/build/sm/GCAux.l_o rts/dist/build/sm/GCUtils.l_o rts/dist/build/sm/MBlock.l_o rts/dist/build/sm/MarkWeak.l_o rts/dist/build/sm/Sanity.l_o rts/dist/build/sm/Scav.l_o rts/dist/build/sm/Scav_thr.l_o rts/dist/build/sm/Storage.l_o rts/dist/build/sm/Sweep.l_o rts/dist/build/eventlog/EventLog.l_o rts/dist/build/eventlog/EventLogWriter.l_o rts/dist/build/linker/CacheFlush.l_o rts/dist/build/linker/Elf.l_o rts/dist/build/linker/LoadArchive.l_o rts/dist/build/linker/M32Alloc.l_o rts/dist/build/linker/MachO.l_o rts/dist/build/linker/PEi386.l_o rts/dist/build/linker/SymbolExtras.l_o rts/dist/build/linker/elf_got.l_o rts/dist/build/linker/elf_plt.l_o rts/dist/build/linker/elf_plt_aarch64.l_o rts/dist/build/linker/elf_plt_arm.l_o rts/dist/build/linker/elf_reloc.l_o rts/dist/build/linker/elf_reloc_aarch64.l_o rts/dist/build/linker/elf_util.l_o rts/dist/build/posix/GetEnv.l_o rts/dist/build/posix/GetTime.l_o rts/dist/build/posix/Itimer.l_o rts/dist/build/posix/OSMem.l_o rts/dist/build/posix/OSThreads.l_o rts/dist/build/posix/Select.l_o rts/dist/build/posix/Signals.l_o rts/dist/build/posix/TTY.l_o rts/dist/build/Apply.l_o rts/dist/build/Compact.l_o rts/dist/build/Exception.l_o rts/dist/build/HeapStackCheck.l_o rts/dist/build/PrimOps.l_o rts/dist/build/StgMiscClosures.l_o rts/dist/build/StgStartup.l_o rts/dist/build/StgStdThunks.l_o rts/dist/build/Updates.l_o rts/dist/build/AutoApply.l_o | "xargs" "ar" qcls rts/dist/build/libHSrts_l.a
/Applications/Xcode.app/Contents/Developer/Toolchains/XcodeDefault.xctoolchain/usr/bin/ranlib: file: rts/dist/build/libHSrts_l.a(Disassembler.l_o) has no symbols
/Applications/Xcode.app/Contents/Developer/Toolchains/XcodeDefault.xctoolchain/usr/bin/ranlib: file: rts/dist/build/libHSrts_l.a(LdvProfile.l_o) has no symbols
/Applications/Xcode.app/Contents/Developer/Toolchains/XcodeDefault.xctoolchain/usr/bin/ranlib: file: rts/dist/build/libHSrts_l.a(OldARMAtomic.l_o) has no symbols
/Applications/Xcode.app/Contents/Developer/Toolchains/XcodeDefault.xctoolchain/usr/bin/ranlib: file: rts/dist/build/libHSrts_l.a(ProfilerReport.l_o) has no symbols
/Applications/Xcode.app/Contents/Developer/Toolchains/XcodeDefault.xctoolchain/usr/bin/ranlib: file: rts/dist/build/libHSrts_l.a(ProfilerReportJson.l_o) has no symbols
/Applications/Xcode.app/Contents/Developer/Toolchains/XcodeDefault.xctoolchain/usr/bin/ranlib: file: rts/dist/build/libHSrts_l.a(Profiling.l_o) has no symbols
/Applications/Xcode.app/Contents/Developer/Toolchains/XcodeDefault.xctoolchain/usr/bin/ranlib: file: rts/dist/build/libHSrts_l.a(RetainerProfile.l_o) has no symbols
/Applications/Xcode.app/Contents/Developer/Toolchains/XcodeDefault.xctoolchain/usr/bin/ranlib: file: rts/dist/build/libHSrts_l.a(RetainerSet.l_o) has no symbols
/Applications/Xcode.app/Contents/Developer/Toolchains/XcodeDefault.xctoolchain/usr/bin/ranlib: file: rts/dist/build/libHSrts_l.a(RtsDllMain.l_o) has no symbols
/Applications/Xcode.app/Contents/Developer/Toolchains/XcodeDefault.xctoolchain/usr/bin/ranlib: file: rts/dist/build/libHSrts_l.a(Evac_thr.l_o) has no symbols
/Applications/Xcode.app/Contents/Developer/Toolchains/XcodeDefault.xctoolchain/usr/bin/ranlib: file: rts/dist/build/libHSrts_l.a(Sanity.l_o) has no symbols
/Applications/Xcode.app/Contents/Developer/Toolchains/XcodeDefault.xctoolchain/usr/bin/ranlib: file: rts/dist/build/libHSrts_l.a(Scav_thr.l_o) has no symbols
/Applications/Xcode.app/Contents/Developer/Toolchains/XcodeDefault.xctoolchain/usr/bin/ranlib: file: rts/dist/build/libHSrts_l.a(Elf.l_o) has no symbols
/Applications/Xcode.app/Contents/Developer/Toolchains/XcodeDefault.xctoolchain/usr/bin/ranlib: file: rts/dist/build/libHSrts_l.a(PEi386.l_o) has no symbols
/Applications/Xcode.app/Contents/Developer/Toolchains/XcodeDefault.xctoolchain/usr/bin/ranlib: file: rts/dist/build/libHSrts_l.a(elf_got.l_o) has no symbols
/Applications/Xcode.app/Contents/Developer/Toolchains/XcodeDefault.xctoolchain/usr/bin/ranlib: file: rts/dist/build/libHSrts_l.a(elf_plt.l_o) has no symbols
/Applications/Xcode.app/Contents/Developer/Toolchains/XcodeDefault.xctoolchain/usr/bin/ranlib: file: rts/dist/build/libHSrts_l.a(elf_plt_aarch64.l_o) has no symbols
/Applications/Xcode.app/Contents/Developer/Toolchains/XcodeDefault.xctoolchain/usr/bin/ranlib: file: rts/dist/build/libHSrts_l.a(elf_plt_arm.l_o) has no symbols
/Applications/Xcode.app/Contents/Developer/Toolchains/XcodeDefault.xctoolchain/usr/bin/ranlib: file: rts/dist/build/libHSrts_l.a(elf_reloc.l_o) has no symbols
/Applications/Xcode.app/Contents/Developer/Toolchains/XcodeDefault.xctoolchain/usr/bin/ranlib: file: rts/dist/build/libHSrts_l.a(elf_reloc_aarch64.l_o) has no symbols
/Applications/Xcode.app/Contents/Developer/Toolchains/XcodeDefault.xctoolchain/usr/bin/ranlib: file: rts/dist/build/libHSrts_l.a(elf_util.l_o) has no symbols
"inplace/bin/ghc-stage1" -optc-fno-stack-protector -optc-Wall -optc-Wall -optc-Wextra -optc-Wstrict-prototypes -optc-Wmissing-prototypes -optc-Wmissing-declarations -optc-Winline -optc-Waggregate-return -optc-Wpointer-arith -optc-Wmissing-noreturn -optc-Wnested-externs -optc-Wredundant-decls -optc-Wundef -optc-Iincludes -optc-Iincludes/dist -optc-Iincludes/dist-derivedconstants/header -optc-Iincludes/dist-ghcconstants/header -optc-Irts -optc-Irts/dist/build -optc-DCOMPILING_RTS -optc-DFS_NAMESPACE=rts -optc-fno-strict-aliasing -optc-fno-common -optc-DDTRACE -optc-Irts/dist/build/./autogen -optc-Werror=unused-but-set-variable -optc-Wno-error=inline -optc-O2 -optc-fomit-frame-pointer -optc-g -optc-fno-omit-frame-pointer -optc-g -optc-O0 -optc-DRtsWay=\"rts_debug\" -optc-w -static -optc-DDEBUG -ticky -DTICKY_TICKY -eventlog -O0 -H64m -Wall -Iincludes -Iincludes/dist -Iincludes/dist-derivedconstants/header -Iincludes/dist-ghcconstants/header -Irts -Irts/dist/build -DCOMPILING_RTS -DFS_NAMESPACE=rts -this-unit-id rts -dcmm-lint -DDTRACE -i -irts -irts/dist/build -Irts/dist/build -irts/dist/build/./autogen -Irts/dist/build/./autogen -O2 -Wcpp-undef -O0 -Wnoncanonical-monad-instances -c rts/StgCRun.c -o rts/dist/build/StgCRun.debug_o
clang -cc1as: fatal error: error in backend: No open frame
`gcc-8' failed in phase `Assembler'. (Exit code: 1)
make[1]: *** [rts/dist/build/StgCRun.debug_o] Error 1
make: *** [all] Error 2
13:08:32 ~/W/p/a/ghc-head-may2018-clang-sad (master|✔) $
clang -fno-stack-protector -DTABLES_NEXT_TO_CODE -fno-stack-protector -Wall -Wall -Wextra -Wstrict-prototypes -Wmissing-prototypes 13:09:03 ~/W/p/a/ghc-head-may2018-clang-sad
13:09:14 ~/W/p/a/ghc-head-may2018-clang-sad (master|✔) $
"inplace/bin/ghc-stage1" -optc-fno-stack-protector -optc-Wall -optc-Wall -optc-Wextra -optc-Wstrict-prototypes -optc-Wmissing-prototypes -optc-Wmissing-declarations -optc-Winline -optc-Waggregate-return -optc-Wpointer-arith -optc-Wmissing-noreturn -optc-Wnested-externs -optc-Wredundant-decls -optc-Wundef -optc-Iincludes -optc-Iincludes/dist -optc-Iincludes/dist-derivedconstants/header -optc-Iincludes/dist-ghcconstants/header -optc-Irts -optc-Irts/dist/build -optc-DCOMPILING_RTS -optc-DFS_NAMESPACE=rts -optc-fno-strict-aliasing -optc-fno-common -optc-DDTRACE -optc-Irts/dist/build/./autogen -optc-Werror=unused-but-set-variable -optc-Wno-error=inline -optc-O2 -optc-fomit-frame-pointer -optc-g -optc-fno-omit-frame-pointer -optc-g -optc-O0 -optc-DRtsWay=\"rts_debug\" -optc-w -static -optc-DDEBUG -ticky -DTICKY_TICKY -eventlog -O0 -H64m -Wall -Iincludes -Iincludes/dist -Iincludes/dist-derivedconstants/header -Iincludes/dist-ghcconstants/header -Irts -Irts/dist/build -DCOMPILING_RTS -DFS_NAMESPACE=rts -this-unit-id rts -dcmm-lint -DDTRACE -i -irts -irts/dist/build -Irts/dist/build -irts/dist/build/./autogen -Irts/dist/build/./autogen -O2 -Wcpp-undef -O0 -Wnoncanonical-monad-instances -c rts/StgCRun.c -o rts/dist/build/StgCRun.debug_o --keep-tmp-files -v3
Glasgow Haskell Compiler, Version 8.5.20180531, stage 1 booted by GHC version 8.2.2
Using binary package database: /Users/carter/WorkSpace/projects/active/ghc-head-may2018-clang-sad/inplace/lib/package.conf.d/package.cache
package flags []
loading package database /Users/carter/WorkSpace/projects/active/ghc-head-may2018-clang-sad/inplace/lib/package.conf.d
wired-in package ghc-prim mapped to ghc-prim-0.5.3
wired-in package integer-gmp mapped to integer-gmp-1.0.2.0
wired-in package base mapped to base-4.12.0.0
wired-in package rts mapped to rts
wired-in package template-haskell mapped to template-haskell-2.14.0.0
wired-in package ghc mapped to ghc-8.5
wired-in package dph-seq not found.
wired-in package dph-par not found.
*** Deleting temp files:
Deleting:
*** Deleting temp dirs:
Deleting:
ghc-stage1: unrecognised flag: --keep-tmp-files
did you mean one of:
-keep-tmp-files
-keep-hc-files
-keep-hi-files
Usage: For basic information, try the `--help' option.
13:09:23 ~/W/p/a/ghc-head-may2018-clang-sad (master|✔) $
"inplace/bin/ghc-stage1" -optc-fno-stack-protector -optc-Wall -optc-Wall -optc-Wextra -optc-Wstrict-prototypes -optc-Wmissing-prototypes -optc-Wmissing-declarations -optc-Winline -optc-Waggregate-return -optc-Wpointer-arith -optc-Wmissing-noreturn -optc-Wnested-externs -optc-Wredundant-decls -optc-Wundef -optc-Iincludes -optc-Iincludes/dist -optc-Iincludes/dist-derivedconstants/header -optc-Iincludes/dist-ghcconstants/header -optc-Irts -optc-Irts/dist/build -optc-DCOMPILING_RTS -optc-DFS_NAMESPACE=rts -optc-fno-strict-aliasing -optc-fno-common -optc-DDTRACE -optc-Irts/dist/build/./autogen -optc-Werror=unused-but-set-variable -optc-Wno-error=inline -optc-O2 -optc-fomit-frame-pointer -optc-g -optc-fno-omit-frame-pointer -optc-g -optc-O0 -optc-DRtsWay=\"rts_debug\" -optc-w -static -optc-DDEBUG -ticky -DTICKY_TICKY -eventlog -O0 -H64m -Wall -Iincludes -Iincludes/dist -Iincludes/dist-derivedconstants/header -Iincludes/dist-ghcconstants/header -Irts -Irts/dist/build -DCOMPILING_RTS -DFS_NAMESPACE=rts -this-unit-id rts -dcmm-lint -DDTRACE -i -irts -irts/dist/build -Irts/dist/build -irts/dist/build/./autogen -Irts/dist/build/./autogen -O2 -Wcpp-undef -O0 -Wnoncanonical-monad-instances -c rts/StgCRun.c -o rts/dist/build/StgCRun.debug_o -keep-tmp-files -v3
Glasgow Haskell Compiler, Version 8.5.20180531, stage 1 booted by GHC version 8.2.2
Using binary package database: /Users/carter/WorkSpace/projects/active/ghc-head-may2018-clang-sad/inplace/lib/package.conf.d/package.cache
package flags []
loading package database /Users/carter/WorkSpace/projects/active/ghc-head-may2018-clang-sad/inplace/lib/package.conf.d
wired-in package ghc-prim mapped to ghc-prim-0.5.3
wired-in package integer-gmp mapped to integer-gmp-1.0.2.0
wired-in package base mapped to base-4.12.0.0
wired-in package rts mapped to rts
wired-in package template-haskell mapped to template-haskell-2.14.0.0
wired-in package ghc mapped to ghc-8.5
wired-in package dph-seq not found.
wired-in package dph-par not found.
Created temporary directory: /var/folders/py/wgp_hj9d2rl3cx48yym_ynj00000gn/T/ghc22029_0
*** C Compiler:
/usr/local/bin/gcc-8 -fno-stack-protector -DTABLES_NEXT_TO_CODE -fno-stack-protector -Wall -Wall -Wextra -Wstrict-prototypes -Wmissing-prototypes -Wmissing-declarations -Winline -Waggregate-return -Wpointer-arith -Wmissing-noreturn -Wnested-externs -Wredundant-decls -Wundef -Iincludes -Iincludes/dist -Iincludes/dist-derivedconstants/header -Iincludes/dist-ghcconstants/header -Irts -Irts/dist/build -DCOMPILING_RTS '-DFS_NAMESPACE=rts' -fno-strict-aliasing -fno-common -DDTRACE -Irts/dist/build/./autogen '-Werror=unused-but-set-variable' '-Wno-error=inline' -O2 -fomit-frame-pointer -g -fno-omit-frame-pointer -g -O0 '-DRtsWay="rts_debug"' -w -DDEBUG -DTRACING -x c rts/StgCRun.c -o /var/folders/py/wgp_hj9d2rl3cx48yym_ynj00000gn/T/ghc22029_0/ghc_1.s -fno-common -U__PIC__ -D__PIC__ -Wimplicit -S -include /Users/carter/WorkSpace/projects/active/ghc-head-may2018-clang-sad/includes/ghcversion.h -Iincludes -Iincludes/dist -Iincludes/dist-derivedconstants/header -Iincludes/dist-ghcconstants/header -Irts -Irts/dist/build -Irts/dist/build -Irts/dist/build/./autogen -I/Users/carter/WorkSpace/projects/active/ghc-head-may2018-clang-sad/libraries/base/include -I/Users/carter/WorkSpace/projects/active/ghc-head-may2018-clang-sad/libraries/base/dist-install/build/include -I/Users/carter/WorkSpace/projects/active/ghc-head-may2018-clang-sad/libraries/integer-gmp/include -I/Users/carter/WorkSpace/projects/active/ghc-head-may2018-clang-sad/libraries/integer-gmp/dist-install/build/include -I/Users/carter/WorkSpace/projects/active/ghc-head-may2018-clang-sad/rts/dist/build -I/Users/carter/WorkSpace/projects/active/ghc-head-may2018-clang-sad/includes -I/Users/carter/WorkSpace/projects/active/ghc-head-may2018-clang-sad/includes/dist-derivedconstants/header
*** Assembler:
/usr/local/bin/gcc-8 -fno-stack-protector -DTABLES_NEXT_TO_CODE -Iincludes -Iincludes/dist -Iincludes/dist-derivedconstants/header -Iincludes/dist-ghcconstants/header -Irts -Irts/dist/build -Irts/dist/build -Irts/dist/build/./autogen -fno-common -U__PIC__ -D__PIC__ -x assembler -c /var/folders/py/wgp_hj9d2rl3cx48yym_ynj00000gn/T/ghc22029_0/ghc_1.s -o rts/dist/build/StgCRun.debug_o
clang -cc1as: fatal error: error in backend: No open frame
`gcc-8' failed in phase `Assembler'. (Exit code: 1)
Sign up for free to join this conversation on GitHub. Already have an account? Sign in to comment
You can’t perform that action at this time.