Skip to content

Instantly share code, notes, and snippets.

Embed
What would you like to do?
ChristophMacbook:rootpy deil$ git clean -fdx
Removing rootpy/__pycache__/
Removing rootpy/extern/__pycache__/
Removing rootpy/extern/hep/__pycache__/
Removing rootpy/extern/lockfile/__pycache__/
Removing rootpy/extern/progressbar/__pycache__/
Removing rootpy/extern/shortuuid/__pycache__/
Removing rootpy/interactive/__pycache__/
Removing rootpy/io/__pycache__/
Removing rootpy/io/tests/__pycache__/
Removing rootpy/logger/__pycache__/
Removing rootpy/logger/tests/__pycache__/
Removing rootpy/memory/__pycache__/
Removing rootpy/memory/tests/__pycache__/
Removing rootpy/plotting/__pycache__/
Removing rootpy/plotting/contrib/__pycache__/
Removing rootpy/plotting/contrib/tests/__pycache__/
Removing rootpy/plotting/style/__pycache__/
Removing rootpy/plotting/style/atlas/__pycache__/
Removing rootpy/plotting/style/cmstdr/__pycache__/
Removing rootpy/plotting/style/default/__pycache__/
Removing rootpy/plotting/style/lhcb/__pycache__/
Removing rootpy/plotting/style/tests/__pycache__/
Removing rootpy/plotting/tests/__pycache__/
Removing rootpy/stats/__pycache__/
Removing rootpy/stats/histfactory/__pycache__/
Removing rootpy/stats/histfactory/tests/__pycache__/
Removing rootpy/stats/tests/__pycache__/
Removing rootpy/testdata/__pycache__/
Removing rootpy/tests/__pycache__/
Removing rootpy/tree/__pycache__/
Removing rootpy/tree/tests/__pycache__/
Removing rootpy/utils/__pycache__/
Removing rootpy/utils/tests/__pycache__/
ChristophMacbook:rootpy deil$ make clean
ChristophMacbook:rootpy deil$ make
running build_ext
/var/folders/sb/4qv5j4m90pz1rw7m70rj1b1r0000gn/T/tmprmhhx1md/x86_64-53430/dicts/74dccd35e261cf60_ACLiC_dict.cxx:203:10: warning: 'const'
qualifier on reference type 'vector<RooStats::HistFactory::HistoSys, allocator<RooStats::HistFactory::HistoSys> >::reference'
(aka 'RooStats::HistFactory::HistoSys &') has no effect [-Wignored-qualifiers]
const vector<RooStats::HistFactory::HistoSys,allocator<RooStats::HistFactory::HistoSys> >::reference obj = ((vector<RooStats::...
^~~~~~
/var/folders/sb/4qv5j4m90pz1rw7m70rj1b1r0000gn/T/tmprmhhx1md/x86_64-53430/dicts/74dccd35e261cf60_ACLiC_dict.cxx:313:10: warning: 'const'
qualifier on reference type 'vector<RooStats::HistFactory::HistoSys, allocator<RooStats::HistFactory::HistoSys> >::reference'
(aka 'RooStats::HistFactory::HistoSys &') has no effect [-Wignored-qualifiers]
const vector<RooStats::HistFactory::HistoSys,allocator<RooStats::HistFactory::HistoSys> >::reference obj = ((vector<RooStats::...
^~~~~~
/var/folders/sb/4qv5j4m90pz1rw7m70rj1b1r0000gn/T/tmprmhhx1md/x86_64-53430/dicts/74dccd35e261cf60_ACLiC_dict.cxx:589:10: warning: 'const'
qualifier on reference type 'vector<RooStats::HistFactory::HistoSys, allocator<RooStats::HistFactory::HistoSys> >::iterator::reference'
(aka 'RooStats::HistFactory::HistoSys &') has no effect [-Wignored-qualifiers]
const vector<RooStats::HistFactory::HistoSys,allocator<RooStats::HistFactory::HistoSys> >::iterator::reference obj = ((const v...
^~~~~~
/var/folders/sb/4qv5j4m90pz1rw7m70rj1b1r0000gn/T/tmprmhhx1md/x86_64-53430/dicts/74dccd35e261cf60_ACLiC_dict.cxx:651:10: warning: 'const'
qualifier on reference type 'vector<RooStats::HistFactory::HistoSys, allocator<RooStats::HistFactory::HistoSys> >::iterator::reference'
(aka 'RooStats::HistFactory::HistoSys &') has no effect [-Wignored-qualifiers]
const vector<RooStats::HistFactory::HistoSys,allocator<RooStats::HistFactory::HistoSys> >::iterator::reference obj = ((const v...
^~~~~~
4 warnings generated.
/var/folders/sb/4qv5j4m90pz1rw7m70rj1b1r0000gn/T/tmprmhhx1md/x86_64-53430/dicts/8ec4fdeb406132ac_ACLiC_dict.cxx:203:10: warning: 'const'
qualifier on reference type 'vector<RooStats::HistFactory::HistoFactor, allocator<RooStats::HistFactory::HistoFactor> >::reference'
(aka 'RooStats::HistFactory::HistoFactor &') has no effect [-Wignored-qualifiers]
const vector<RooStats::HistFactory::HistoFactor,allocator<RooStats::HistFactory::HistoFactor> >::reference obj = ((vector<RooS...
^~~~~~
/var/folders/sb/4qv5j4m90pz1rw7m70rj1b1r0000gn/T/tmprmhhx1md/x86_64-53430/dicts/8ec4fdeb406132ac_ACLiC_dict.cxx:313:10: warning: 'const'
qualifier on reference type 'vector<RooStats::HistFactory::HistoFactor, allocator<RooStats::HistFactory::HistoFactor> >::reference'
(aka 'RooStats::HistFactory::HistoFactor &') has no effect [-Wignored-qualifiers]
const vector<RooStats::HistFactory::HistoFactor,allocator<RooStats::HistFactory::HistoFactor> >::reference obj = ((vector<RooS...
^~~~~~
/var/folders/sb/4qv5j4m90pz1rw7m70rj1b1r0000gn/T/tmprmhhx1md/x86_64-53430/dicts/8ec4fdeb406132ac_ACLiC_dict.cxx:589:10: warning: 'const'
qualifier on reference type 'vector<RooStats::HistFactory::HistoFactor, allocator<RooStats::HistFactory::HistoFactor>
>::iterator::reference' (aka 'RooStats::HistFactory::HistoFactor &') has no effect [-Wignored-qualifiers]
const vector<RooStats::HistFactory::HistoFactor,allocator<RooStats::HistFactory::HistoFactor> >::iterator::reference obj = ((c...
^~~~~~
/var/folders/sb/4qv5j4m90pz1rw7m70rj1b1r0000gn/T/tmprmhhx1md/x86_64-53430/dicts/8ec4fdeb406132ac_ACLiC_dict.cxx:651:10: warning: 'const'
qualifier on reference type 'vector<RooStats::HistFactory::HistoFactor, allocator<RooStats::HistFactory::HistoFactor>
>::iterator::reference' (aka 'RooStats::HistFactory::HistoFactor &') has no effect [-Wignored-qualifiers]
const vector<RooStats::HistFactory::HistoFactor,allocator<RooStats::HistFactory::HistoFactor> >::iterator::reference obj = ((c...
^~~~~~
4 warnings generated.
/var/folders/sb/4qv5j4m90pz1rw7m70rj1b1r0000gn/T/tmprmhhx1md/x86_64-53430/dicts/a9a04aa43df476fa_ACLiC_dict.cxx:203:10: warning: 'const'
qualifier on reference type 'vector<RooStats::HistFactory::NormFactor, allocator<RooStats::HistFactory::NormFactor> >::reference'
(aka 'RooStats::HistFactory::NormFactor &') has no effect [-Wignored-qualifiers]
const vector<RooStats::HistFactory::NormFactor,allocator<RooStats::HistFactory::NormFactor> >::reference obj = ((vector<RooSta...
^~~~~~
/var/folders/sb/4qv5j4m90pz1rw7m70rj1b1r0000gn/T/tmprmhhx1md/x86_64-53430/dicts/a9a04aa43df476fa_ACLiC_dict.cxx:313:10: warning: 'const'
qualifier on reference type 'vector<RooStats::HistFactory::NormFactor, allocator<RooStats::HistFactory::NormFactor> >::reference'
(aka 'RooStats::HistFactory::NormFactor &') has no effect [-Wignored-qualifiers]
const vector<RooStats::HistFactory::NormFactor,allocator<RooStats::HistFactory::NormFactor> >::reference obj = ((vector<RooSta...
^~~~~~
/var/folders/sb/4qv5j4m90pz1rw7m70rj1b1r0000gn/T/tmprmhhx1md/x86_64-53430/dicts/a9a04aa43df476fa_ACLiC_dict.cxx:589:10: warning: 'const'
qualifier on reference type 'vector<RooStats::HistFactory::NormFactor, allocator<RooStats::HistFactory::NormFactor>
>::iterator::reference' (aka 'RooStats::HistFactory::NormFactor &') has no effect [-Wignored-qualifiers]
const vector<RooStats::HistFactory::NormFactor,allocator<RooStats::HistFactory::NormFactor> >::iterator::reference obj = ((con...
^~~~~~
/var/folders/sb/4qv5j4m90pz1rw7m70rj1b1r0000gn/T/tmprmhhx1md/x86_64-53430/dicts/a9a04aa43df476fa_ACLiC_dict.cxx:651:10: warning: 'const'
qualifier on reference type 'vector<RooStats::HistFactory::NormFactor, allocator<RooStats::HistFactory::NormFactor>
>::iterator::reference' (aka 'RooStats::HistFactory::NormFactor &') has no effect [-Wignored-qualifiers]
const vector<RooStats::HistFactory::NormFactor,allocator<RooStats::HistFactory::NormFactor> >::iterator::reference obj = ((con...
^~~~~~
4 warnings generated.
/var/folders/sb/4qv5j4m90pz1rw7m70rj1b1r0000gn/T/tmprmhhx1md/x86_64-53430/dicts/ffb8d077a9f22fe2_ACLiC_dict.cxx:203:10: warning: 'const'
qualifier on reference type 'vector<RooStats::HistFactory::OverallSys, allocator<RooStats::HistFactory::OverallSys> >::reference'
(aka 'RooStats::HistFactory::OverallSys &') has no effect [-Wignored-qualifiers]
const vector<RooStats::HistFactory::OverallSys,allocator<RooStats::HistFactory::OverallSys> >::reference obj = ((vector<RooSta...
^~~~~~
/var/folders/sb/4qv5j4m90pz1rw7m70rj1b1r0000gn/T/tmprmhhx1md/x86_64-53430/dicts/ffb8d077a9f22fe2_ACLiC_dict.cxx:313:10: warning: 'const'
qualifier on reference type 'vector<RooStats::HistFactory::OverallSys, allocator<RooStats::HistFactory::OverallSys> >::reference'
(aka 'RooStats::HistFactory::OverallSys &') has no effect [-Wignored-qualifiers]
const vector<RooStats::HistFactory::OverallSys,allocator<RooStats::HistFactory::OverallSys> >::reference obj = ((vector<RooSta...
^~~~~~
/var/folders/sb/4qv5j4m90pz1rw7m70rj1b1r0000gn/T/tmprmhhx1md/x86_64-53430/dicts/ffb8d077a9f22fe2_ACLiC_dict.cxx:589:10: warning: 'const'
qualifier on reference type 'vector<RooStats::HistFactory::OverallSys, allocator<RooStats::HistFactory::OverallSys>
>::iterator::reference' (aka 'RooStats::HistFactory::OverallSys &') has no effect [-Wignored-qualifiers]
const vector<RooStats::HistFactory::OverallSys,allocator<RooStats::HistFactory::OverallSys> >::iterator::reference obj = ((con...
^~~~~~
/var/folders/sb/4qv5j4m90pz1rw7m70rj1b1r0000gn/T/tmprmhhx1md/x86_64-53430/dicts/ffb8d077a9f22fe2_ACLiC_dict.cxx:651:10: warning: 'const'
qualifier on reference type 'vector<RooStats::HistFactory::OverallSys, allocator<RooStats::HistFactory::OverallSys>
>::iterator::reference' (aka 'RooStats::HistFactory::OverallSys &') has no effect [-Wignored-qualifiers]
const vector<RooStats::HistFactory::OverallSys,allocator<RooStats::HistFactory::OverallSys> >::iterator::reference obj = ((con...
^~~~~~
4 warnings generated.
/var/folders/sb/4qv5j4m90pz1rw7m70rj1b1r0000gn/T/tmprmhhx1md/x86_64-53430/dicts/c984498d808e63de_ACLiC_dict.cxx:203:10: warning: 'const'
qualifier on reference type 'vector<RooStats::HistFactory::ShapeFactor, allocator<RooStats::HistFactory::ShapeFactor> >::reference'
(aka 'RooStats::HistFactory::ShapeFactor &') has no effect [-Wignored-qualifiers]
const vector<RooStats::HistFactory::ShapeFactor,allocator<RooStats::HistFactory::ShapeFactor> >::reference obj = ((vector<RooS...
^~~~~~
/var/folders/sb/4qv5j4m90pz1rw7m70rj1b1r0000gn/T/tmprmhhx1md/x86_64-53430/dicts/c984498d808e63de_ACLiC_dict.cxx:313:10: warning: 'const'
qualifier on reference type 'vector<RooStats::HistFactory::ShapeFactor, allocator<RooStats::HistFactory::ShapeFactor> >::reference'
(aka 'RooStats::HistFactory::ShapeFactor &') has no effect [-Wignored-qualifiers]
const vector<RooStats::HistFactory::ShapeFactor,allocator<RooStats::HistFactory::ShapeFactor> >::reference obj = ((vector<RooS...
^~~~~~
/var/folders/sb/4qv5j4m90pz1rw7m70rj1b1r0000gn/T/tmprmhhx1md/x86_64-53430/dicts/c984498d808e63de_ACLiC_dict.cxx:589:10: warning: 'const'
qualifier on reference type 'vector<RooStats::HistFactory::ShapeFactor, allocator<RooStats::HistFactory::ShapeFactor>
>::iterator::reference' (aka 'RooStats::HistFactory::ShapeFactor &') has no effect [-Wignored-qualifiers]
const vector<RooStats::HistFactory::ShapeFactor,allocator<RooStats::HistFactory::ShapeFactor> >::iterator::reference obj = ((c...
^~~~~~
/var/folders/sb/4qv5j4m90pz1rw7m70rj1b1r0000gn/T/tmprmhhx1md/x86_64-53430/dicts/c984498d808e63de_ACLiC_dict.cxx:651:10: warning: 'const'
qualifier on reference type 'vector<RooStats::HistFactory::ShapeFactor, allocator<RooStats::HistFactory::ShapeFactor>
>::iterator::reference' (aka 'RooStats::HistFactory::ShapeFactor &') has no effect [-Wignored-qualifiers]
const vector<RooStats::HistFactory::ShapeFactor,allocator<RooStats::HistFactory::ShapeFactor> >::iterator::reference obj = ((c...
^~~~~~
4 warnings generated.
/var/folders/sb/4qv5j4m90pz1rw7m70rj1b1r0000gn/T/tmprmhhx1md/x86_64-53430/dicts/966401057ba7ed3e_ACLiC_dict.cxx:203:10: warning: 'const'
qualifier on reference type 'vector<RooStats::HistFactory::ShapeSys, allocator<RooStats::HistFactory::ShapeSys> >::reference'
(aka 'RooStats::HistFactory::ShapeSys &') has no effect [-Wignored-qualifiers]
const vector<RooStats::HistFactory::ShapeSys,allocator<RooStats::HistFactory::ShapeSys> >::reference obj = ((vector<RooStats::...
^~~~~~
/var/folders/sb/4qv5j4m90pz1rw7m70rj1b1r0000gn/T/tmprmhhx1md/x86_64-53430/dicts/966401057ba7ed3e_ACLiC_dict.cxx:313:10: warning: 'const'
qualifier on reference type 'vector<RooStats::HistFactory::ShapeSys, allocator<RooStats::HistFactory::ShapeSys> >::reference'
(aka 'RooStats::HistFactory::ShapeSys &') has no effect [-Wignored-qualifiers]
const vector<RooStats::HistFactory::ShapeSys,allocator<RooStats::HistFactory::ShapeSys> >::reference obj = ((vector<RooStats::...
^~~~~~
/var/folders/sb/4qv5j4m90pz1rw7m70rj1b1r0000gn/T/tmprmhhx1md/x86_64-53430/dicts/966401057ba7ed3e_ACLiC_dict.cxx:589:10: warning: 'const'
qualifier on reference type 'vector<RooStats::HistFactory::ShapeSys, allocator<RooStats::HistFactory::ShapeSys> >::iterator::reference'
(aka 'RooStats::HistFactory::ShapeSys &') has no effect [-Wignored-qualifiers]
const vector<RooStats::HistFactory::ShapeSys,allocator<RooStats::HistFactory::ShapeSys> >::iterator::reference obj = ((const v...
^~~~~~
/var/folders/sb/4qv5j4m90pz1rw7m70rj1b1r0000gn/T/tmprmhhx1md/x86_64-53430/dicts/966401057ba7ed3e_ACLiC_dict.cxx:651:10: warning: 'const'
qualifier on reference type 'vector<RooStats::HistFactory::ShapeSys, allocator<RooStats::HistFactory::ShapeSys> >::iterator::reference'
(aka 'RooStats::HistFactory::ShapeSys &') has no effect [-Wignored-qualifiers]
const vector<RooStats::HistFactory::ShapeSys,allocator<RooStats::HistFactory::ShapeSys> >::iterator::reference obj = ((const v...
^~~~~~
4 warnings generated.
/var/folders/sb/4qv5j4m90pz1rw7m70rj1b1r0000gn/T/tmprmhhx1md/x86_64-53430/dicts/d314910f83d9e62a_ACLiC_dict.cxx:203:10: warning: 'const'
qualifier on reference type 'vector<RooStats::HistFactory::Sample, allocator<RooStats::HistFactory::Sample> >::reference'
(aka 'RooStats::HistFactory::Sample &') has no effect [-Wignored-qualifiers]
const vector<RooStats::HistFactory::Sample,allocator<RooStats::HistFactory::Sample> >::reference obj = ((vector<RooStats::Hist...
^~~~~~
/var/folders/sb/4qv5j4m90pz1rw7m70rj1b1r0000gn/T/tmprmhhx1md/x86_64-53430/dicts/d314910f83d9e62a_ACLiC_dict.cxx:313:10: warning: 'const'
qualifier on reference type 'vector<RooStats::HistFactory::Sample, allocator<RooStats::HistFactory::Sample> >::reference'
(aka 'RooStats::HistFactory::Sample &') has no effect [-Wignored-qualifiers]
const vector<RooStats::HistFactory::Sample,allocator<RooStats::HistFactory::Sample> >::reference obj = ((vector<RooStats::Hist...
^~~~~~
/var/folders/sb/4qv5j4m90pz1rw7m70rj1b1r0000gn/T/tmprmhhx1md/x86_64-53430/dicts/d314910f83d9e62a_ACLiC_dict.cxx:589:10: warning: 'const'
qualifier on reference type 'vector<RooStats::HistFactory::Sample, allocator<RooStats::HistFactory::Sample> >::iterator::reference'
(aka 'RooStats::HistFactory::Sample &') has no effect [-Wignored-qualifiers]
const vector<RooStats::HistFactory::Sample,allocator<RooStats::HistFactory::Sample> >::iterator::reference obj = ((const vecto...
^~~~~~
/var/folders/sb/4qv5j4m90pz1rw7m70rj1b1r0000gn/T/tmprmhhx1md/x86_64-53430/dicts/d314910f83d9e62a_ACLiC_dict.cxx:651:10: warning: 'const'
qualifier on reference type 'vector<RooStats::HistFactory::Sample, allocator<RooStats::HistFactory::Sample> >::iterator::reference'
(aka 'RooStats::HistFactory::Sample &') has no effect [-Wignored-qualifiers]
const vector<RooStats::HistFactory::Sample,allocator<RooStats::HistFactory::Sample> >::iterator::reference obj = ((const vecto...
^~~~~~
4 warnings generated.
/var/folders/sb/4qv5j4m90pz1rw7m70rj1b1r0000gn/T/tmprmhhx1md/x86_64-53430/dicts/9af9027ba3d349f7_ACLiC_dict.cxx:203:10: warning: 'const'
qualifier on reference type 'vector<RooStats::HistFactory::Data, allocator<RooStats::HistFactory::Data> >::reference'
(aka 'RooStats::HistFactory::Data &') has no effect [-Wignored-qualifiers]
const vector<RooStats::HistFactory::Data,allocator<RooStats::HistFactory::Data> >::reference obj = ((vector<RooStats::HistFact...
^~~~~~
/var/folders/sb/4qv5j4m90pz1rw7m70rj1b1r0000gn/T/tmprmhhx1md/x86_64-53430/dicts/9af9027ba3d349f7_ACLiC_dict.cxx:313:10: warning: 'const'
qualifier on reference type 'vector<RooStats::HistFactory::Data, allocator<RooStats::HistFactory::Data> >::reference'
(aka 'RooStats::HistFactory::Data &') has no effect [-Wignored-qualifiers]
const vector<RooStats::HistFactory::Data,allocator<RooStats::HistFactory::Data> >::reference obj = ((vector<RooStats::HistFact...
^~~~~~
/var/folders/sb/4qv5j4m90pz1rw7m70rj1b1r0000gn/T/tmprmhhx1md/x86_64-53430/dicts/9af9027ba3d349f7_ACLiC_dict.cxx:589:10: warning: 'const'
qualifier on reference type 'vector<RooStats::HistFactory::Data, allocator<RooStats::HistFactory::Data> >::iterator::reference'
(aka 'RooStats::HistFactory::Data &') has no effect [-Wignored-qualifiers]
const vector<RooStats::HistFactory::Data,allocator<RooStats::HistFactory::Data> >::iterator::reference obj = ((const vector<Ro...
^~~~~~
/var/folders/sb/4qv5j4m90pz1rw7m70rj1b1r0000gn/T/tmprmhhx1md/x86_64-53430/dicts/9af9027ba3d349f7_ACLiC_dict.cxx:651:10: warning: 'const'
qualifier on reference type 'vector<RooStats::HistFactory::Data, allocator<RooStats::HistFactory::Data> >::iterator::reference'
(aka 'RooStats::HistFactory::Data &') has no effect [-Wignored-qualifiers]
const vector<RooStats::HistFactory::Data,allocator<RooStats::HistFactory::Data> >::iterator::reference obj = ((const vector<Ro...
^~~~~~
4 warnings generated.
/var/folders/sb/4qv5j4m90pz1rw7m70rj1b1r0000gn/T/tmprmhhx1md/x86_64-53430/dicts/9e1f1d99a73e1ed9_ACLiC_dict.cxx:203:10: warning: 'const'
qualifier on reference type 'vector<RooStats::HistFactory::Channel, allocator<RooStats::HistFactory::Channel> >::reference'
(aka 'RooStats::HistFactory::Channel &') has no effect [-Wignored-qualifiers]
const vector<RooStats::HistFactory::Channel,allocator<RooStats::HistFactory::Channel> >::reference obj = ((vector<RooStats::Hi...
^~~~~~
/var/folders/sb/4qv5j4m90pz1rw7m70rj1b1r0000gn/T/tmprmhhx1md/x86_64-53430/dicts/9e1f1d99a73e1ed9_ACLiC_dict.cxx:313:10: warning: 'const'
qualifier on reference type 'vector<RooStats::HistFactory::Channel, allocator<RooStats::HistFactory::Channel> >::reference'
(aka 'RooStats::HistFactory::Channel &') has no effect [-Wignored-qualifiers]
const vector<RooStats::HistFactory::Channel,allocator<RooStats::HistFactory::Channel> >::reference obj = ((vector<RooStats::Hi...
^~~~~~
/var/folders/sb/4qv5j4m90pz1rw7m70rj1b1r0000gn/T/tmprmhhx1md/x86_64-53430/dicts/9e1f1d99a73e1ed9_ACLiC_dict.cxx:589:10: warning: 'const'
qualifier on reference type 'vector<RooStats::HistFactory::Channel, allocator<RooStats::HistFactory::Channel> >::iterator::reference'
(aka 'RooStats::HistFactory::Channel &') has no effect [-Wignored-qualifiers]
const vector<RooStats::HistFactory::Channel,allocator<RooStats::HistFactory::Channel> >::iterator::reference obj = ((const vec...
^~~~~~
/var/folders/sb/4qv5j4m90pz1rw7m70rj1b1r0000gn/T/tmprmhhx1md/x86_64-53430/dicts/9e1f1d99a73e1ed9_ACLiC_dict.cxx:651:10: warning: 'const'
qualifier on reference type 'vector<RooStats::HistFactory::Channel, allocator<RooStats::HistFactory::Channel> >::iterator::reference'
(aka 'RooStats::HistFactory::Channel &') has no effect [-Wignored-qualifiers]
const vector<RooStats::HistFactory::Channel,allocator<RooStats::HistFactory::Channel> >::iterator::reference obj = ((const vec...
^~~~~~
4 warnings generated.
/var/folders/sb/4qv5j4m90pz1rw7m70rj1b1r0000gn/T/tmprmhhx1md/x86_64-53430/dicts/c484bc7f63902418_ACLiC_dict.cxx:203:10: warning: 'const'
qualifier on reference type 'vector<RooStats::HistFactory::Measurement, allocator<RooStats::HistFactory::Measurement> >::reference'
(aka 'RooStats::HistFactory::Measurement &') has no effect [-Wignored-qualifiers]
const vector<RooStats::HistFactory::Measurement,allocator<RooStats::HistFactory::Measurement> >::reference obj = ((vector<RooS...
^~~~~~
/var/folders/sb/4qv5j4m90pz1rw7m70rj1b1r0000gn/T/tmprmhhx1md/x86_64-53430/dicts/c484bc7f63902418_ACLiC_dict.cxx:313:10: warning: 'const'
qualifier on reference type 'vector<RooStats::HistFactory::Measurement, allocator<RooStats::HistFactory::Measurement> >::reference'
(aka 'RooStats::HistFactory::Measurement &') has no effect [-Wignored-qualifiers]
const vector<RooStats::HistFactory::Measurement,allocator<RooStats::HistFactory::Measurement> >::reference obj = ((vector<RooS...
^~~~~~
/var/folders/sb/4qv5j4m90pz1rw7m70rj1b1r0000gn/T/tmprmhhx1md/x86_64-53430/dicts/c484bc7f63902418_ACLiC_dict.cxx:589:10: warning: 'const'
qualifier on reference type 'vector<RooStats::HistFactory::Measurement, allocator<RooStats::HistFactory::Measurement>
>::iterator::reference' (aka 'RooStats::HistFactory::Measurement &') has no effect [-Wignored-qualifiers]
const vector<RooStats::HistFactory::Measurement,allocator<RooStats::HistFactory::Measurement> >::iterator::reference obj = ((c...
^~~~~~
/var/folders/sb/4qv5j4m90pz1rw7m70rj1b1r0000gn/T/tmprmhhx1md/x86_64-53430/dicts/c484bc7f63902418_ACLiC_dict.cxx:651:10: warning: 'const'
qualifier on reference type 'vector<RooStats::HistFactory::Measurement, allocator<RooStats::HistFactory::Measurement>
>::iterator::reference' (aka 'RooStats::HistFactory::Measurement &') has no effect [-Wignored-qualifiers]
const vector<RooStats::HistFactory::Measurement,allocator<RooStats::HistFactory::Measurement> >::iterator::reference obj = ((c...
^~~~~~
4 warnings generated.
rootpy.io.tests.test_file.test_tempfile ... ok
rootpy.io.tests.test_file.test_memfile ... ok
rootpy.io.tests.test_file.test_file_open ... ok
rootpy.io.tests.test_file.test_context ... ok
rootpy.io.tests.test_file.test_file_get ... ok
rootpy.io.tests.test_file.test_file_item ... ok
rootpy.io.tests.test_file.test_file_attr ... ok
rootpy.io.tests.test_file.test_file_contains ... ok
rootpy.io.tests.test_file.test_no_dangling_files ... ok
rootpy.io.tests.test_file.test_keepalive ... ok
rootpy.io.tests.test_file.test_keepalive_canvas ... ok
rootpy.io.tests.test_pickler.test_pickler ... ok
Failure: SkipTest () ... SKIP
rootpy.logger.tests.test_threading.test_multithread_exceptions ... SKIP
rootpy.memory.tests.test_getownership.test_getownership ... ok
Failure: FileNotFoundError ([Errno 2] No such file or directory: 'pkg-config python --variable=includedir') ... ERROR
rootpy.plotting.style.tests.test_style.test_get_style ... ok
rootpy.plotting.tests.test_graph.test_init ... ok
rootpy.plotting.tests.test_graph.test_init_from_hist ... ok
rootpy.plotting.tests.test_graph.test_init_from_file_1d ... ok
rootpy.plotting.tests.test_graph.test_init_from_file_2d ... ok
rootpy.plotting.tests.test_graph.test_xerr ... ok
rootpy.plotting.tests.test_graph.test_divide ... ok
rootpy.plotting.tests.test_hist.test_init ... ok
rootpy.plotting.tests.test_hist.test_init_from_graph ... ok
rootpy.plotting.tests.test_hist.test_init_edge_order ... ok
rootpy.plotting.tests.test_hist.test_init_edge_repeated ... ok
rootpy.plotting.tests.test_hist.test_edges ... ok
rootpy.plotting.tests.test_hist.test_edgesl ... ok
rootpy.plotting.tests.test_hist.test_edgesh ... ok
rootpy.plotting.tests.test_hist.test_width ... ok
rootpy.plotting.tests.test_hist.test_bounds ... ok
rootpy.plotting.tests.test_hist.test_ravel ... ok
rootpy.plotting.tests.test_hist.test_uniform ... ok
rootpy.plotting.tests.test_hist.test_stack ... ok
rootpy.plotting.tests.test_hist.test_indexing ... ok
rootpy.plotting.tests.test_hist.test_slice_assign ... ok
rootpy.plotting.tests.test_hist.test_slice_assign_bad ... ok
rootpy.plotting.tests.test_hist.test_overflow_underflow ... ok
rootpy.plotting.tests.test_hist.test_merge_bins ... ok
rootpy.plotting.tests.test_hist.test_rebinning ... ok
rootpy.plotting.tests.test_hist.test_quantiles ... ok
rootpy.plotting.tests.test_hist.test_compatibility ... ok
rootpy.plotting.tests.test_hist.test_power ... ok
rootpy.plotting.tests.test_hist.test_integral ... ok
rootpy.plotting.tests.test_hist.test_integral_error ... ok
rootpy.plotting.tests.test_hist.test_poisson_errors ... ok
rootpy.plotting.tests.test_hist.test_overall_efficiency ... ok
rootpy.plotting.tests.test_hist.test_efficiency ... ok
rootpy.plotting.tests.test_hist.test_uniform_binned ... ok
rootpy.plotting.tests.test_legend.test_init ... ok
rootpy.plotting.tests.test_plottable.test_plottable_clone ... ok
rootpy.plotting.tests.test_profile.test_init ... ok
rootpy.plotting.tests.test_profile.test_init_profiled_edges ... ok
rootpy.plotting.tests.test_profile.test_init_option ... ok
rootpy.plotting.tests.test_profile.test_init_edge_order ... ok
rootpy.plotting.tests.test_profile.test_init_edge_repeated ... ok
rootpy.plotting.tests.test_profile.test_init_profiled_edge_order ... ok
rootpy.plotting.tests.test_profile.test_init_profiled_edge_repeated ... ok
rootpy.plotting.tests.test_root2matplotlib.test_errorbar ... ok
rootpy.plotting.tests.test_root2matplotlib.test_bar ... ok
rootpy.plotting.tests.test_root2matplotlib.test_hist ... ok
rootpy.plotting.tests.test_root2matplotlib.test_hist2d ... ok
rootpy.plotting.tests.test_root2matplotlib.test_imshow ... ok
rootpy.plotting.tests.test_root2matplotlib.test_contour ... ok
rootpy.plotting.tests.test_utils.test_limits ... ok
rootpy.stats.tests.test_correlated_values.test_correlated_values ... ok
rootpy.tree.tests.test_categories.test_from_string ... ok
rootpy.tree.tests.test_categories.test_len ... ok
rootpy.tree.tests.test_cut.test_safe ... ok
rootpy.tree.tests.test_tree.test_attrs ... /var/folders/sb/4qv5j4m90pz1rw7m70rj1b1r0000gn/T/tmprmhhx1md/x86_64-53430/dicts/ccad4664192b899b_ACLiC_dict.cxx:203:10: warning: 'const'
qualifier on reference type 'vector<int, allocator<int> >::reference' (aka 'int &') has no effect [-Wignored-qualifiers]
const vector<int,allocator<int> >::reference obj = ((vector<int,allocator<int> >*) G__getstructoffset())->at((vector<int,alloc...
^~~~~~
/var/folders/sb/4qv5j4m90pz1rw7m70rj1b1r0000gn/T/tmprmhhx1md/x86_64-53430/dicts/ccad4664192b899b_ACLiC_dict.cxx:313:10: warning: 'const'
qualifier on reference type 'vector<int, allocator<int> >::reference' (aka 'int &') has no effect [-Wignored-qualifiers]
const vector<int,allocator<int> >::reference obj = ((vector<int,allocator<int> >*) G__getstructoffset())->operator[]((vector<i...
^~~~~~
/var/folders/sb/4qv5j4m90pz1rw7m70rj1b1r0000gn/T/tmprmhhx1md/x86_64-53430/dicts/ccad4664192b899b_ACLiC_dict.cxx:589:10: warning: 'const'
qualifier on reference type 'vector<int, allocator<int> >::iterator::reference' (aka 'int &') has no effect [-Wignored-qualifiers]
const vector<int,allocator<int> >::iterator::reference obj = ((const vector<int,allocator<int> >::iterator*) G__getstructoffse...
^~~~~~
/var/folders/sb/4qv5j4m90pz1rw7m70rj1b1r0000gn/T/tmprmhhx1md/x86_64-53430/dicts/ccad4664192b899b_ACLiC_dict.cxx:651:10: warning: 'const'
qualifier on reference type 'vector<int, allocator<int> >::iterator::reference' (aka 'int &') has no effect [-Wignored-qualifiers]
const vector<int,allocator<int> >::iterator::reference obj = ((const vector<int,allocator<int> >::iterator*) G__getstructoffse...
^~~~~~
4 warnings generated.
Note: Link requested for already precompiled class vector<float,allocator<float> > (ignore this message) :0:
Note: Link requested for already precompiled class vector<float,allocator<float> >::iterator (ignore this message) :0:
/var/folders/sb/4qv5j4m90pz1rw7m70rj1b1r0000gn/T/tmprmhhx1md/x86_64-53430/dicts/0139c333aa42dfd9_ACLiC_dict.cxx:203:10: warning: 'const'
qualifier on reference type 'vector<TLorentzVector, allocator<TLorentzVector> >::reference' (aka 'TLorentzVector &') has no effect
[-Wignored-qualifiers]
const vector<TLorentzVector,allocator<TLorentzVector> >::reference obj = ((vector<TLorentzVector,allocator<TLorentzVector> >*...
^~~~~~
/var/folders/sb/4qv5j4m90pz1rw7m70rj1b1r0000gn/T/tmprmhhx1md/x86_64-53430/dicts/0139c333aa42dfd9_ACLiC_dict.cxx:313:10: warning: 'const'
qualifier on reference type 'vector<TLorentzVector, allocator<TLorentzVector> >::reference' (aka 'TLorentzVector &') has no effect
[-Wignored-qualifiers]
const vector<TLorentzVector,allocator<TLorentzVector> >::reference obj = ((vector<TLorentzVector,allocator<TLorentzVector> >*...
^~~~~~
/var/folders/sb/4qv5j4m90pz1rw7m70rj1b1r0000gn/T/tmprmhhx1md/x86_64-53430/dicts/0139c333aa42dfd9_ACLiC_dict.cxx:589:10: warning: 'const'
qualifier on reference type 'vector<TLorentzVector, allocator<TLorentzVector> >::iterator::reference' (aka 'TLorentzVector &') has no
effect [-Wignored-qualifiers]
const vector<TLorentzVector,allocator<TLorentzVector> >::iterator::reference obj = ((const vector<TLorentzVector,allocator<TLo...
^~~~~~
/var/folders/sb/4qv5j4m90pz1rw7m70rj1b1r0000gn/T/tmprmhhx1md/x86_64-53430/dicts/0139c333aa42dfd9_ACLiC_dict.cxx:651:10: warning: 'const'
qualifier on reference type 'vector<TLorentzVector, allocator<TLorentzVector> >::iterator::reference' (aka 'TLorentzVector &') has no
effect [-Wignored-qualifiers]
const vector<TLorentzVector,allocator<TLorentzVector> >::iterator::reference obj = ((const vector<TLorentzVector,allocator<TLo...
^~~~~~
4 warnings generated.
Traceback (most recent call last):
File "_ctypes/callbacks.c", line 234, in 'calling callback function'
File "/Users/deil/code/rootpy/rootpy/logger/roothandler.py", line 47, in python_logging_error_handler
from ..utils import quickroot as QROOT
File "/opt/local/Library/Frameworks/Python.framework/Versions/3.4/lib/python3.4/site-packages/ROOT.py", line 352, in _importhook
return _orig_ihook( name, *args, **kwds )
File "<frozen importlib._bootstrap>", line 2280, in _handle_fromlist
TypeError: bad argument type for built-in operation
Traceback (most recent call last):
File "_ctypes/callbacks.c", line 234, in 'calling callback function'
File "/Users/deil/code/rootpy/rootpy/logger/roothandler.py", line 47, in python_logging_error_handler
from ..utils import quickroot as QROOT
File "/opt/local/Library/Frameworks/Python.framework/Versions/3.4/lib/python3.4/site-packages/ROOT.py", line 352, in _importhook
return _orig_ihook( name, *args, **kwds )
File "<frozen importlib._bootstrap>", line 2280, in _handle_fromlist
TypeError: bad argument type for built-in operation
Traceback (most recent call last):
File "_ctypes/callbacks.c", line 234, in 'calling callback function'
File "/Users/deil/code/rootpy/rootpy/logger/roothandler.py", line 47, in python_logging_error_handler
from ..utils import quickroot as QROOT
File "/opt/local/Library/Frameworks/Python.framework/Versions/3.4/lib/python3.4/site-packages/ROOT.py", line 352, in _importhook
return _orig_ihook( name, *args, **kwds )
File "<frozen importlib._bootstrap>", line 2280, in _handle_fromlist
TypeError: bad argument type for built-in operation
Traceback (most recent call last):
File "_ctypes/callbacks.c", line 234, in 'calling callback function'
File "/Users/deil/code/rootpy/rootpy/logger/roothandler.py", line 47, in python_logging_error_handler
from ..utils import quickroot as QROOT
File "/opt/local/Library/Frameworks/Python.framework/Versions/3.4/lib/python3.4/site-packages/ROOT.py", line 352, in _importhook
return _orig_ihook( name, *args, **kwds )
File "<frozen importlib._bootstrap>", line 2280, in _handle_fromlist
TypeError: bad argument type for built-in operation
Traceback (most recent call last):
File "_ctypes/callbacks.c", line 234, in 'calling callback function'
File "/Users/deil/code/rootpy/rootpy/logger/roothandler.py", line 47, in python_logging_error_handler
from ..utils import quickroot as QROOT
File "/opt/local/Library/Frameworks/Python.framework/Versions/3.4/lib/python3.4/site-packages/ROOT.py", line 352, in _importhook
return _orig_ihook( name, *args, **kwds )
File "<frozen importlib._bootstrap>", line 2280, in _handle_fromlist
TypeError: bad argument type for built-in operation
Traceback (most recent call last):
File "_ctypes/callbacks.c", line 234, in 'calling callback function'
File "/Users/deil/code/rootpy/rootpy/logger/roothandler.py", line 47, in python_logging_error_handler
from ..utils import quickroot as QROOT
File "/opt/local/Library/Frameworks/Python.framework/Versions/3.4/lib/python3.4/site-packages/ROOT.py", line 352, in _importhook
return _orig_ihook( name, *args, **kwds )
File "<frozen importlib._bootstrap>", line 2280, in _handle_fromlist
TypeError: bad argument type for built-in operation
Traceback (most recent call last):
File "_ctypes/callbacks.c", line 234, in 'calling callback function'
File "/Users/deil/code/rootpy/rootpy/logger/roothandler.py", line 47, in python_logging_error_handler
from ..utils import quickroot as QROOT
File "/opt/local/Library/Frameworks/Python.framework/Versions/3.4/lib/python3.4/site-packages/ROOT.py", line 352, in _importhook
return _orig_ihook( name, *args, **kwds )
File "<frozen importlib._bootstrap>", line 2280, in _handle_fromlist
TypeError: bad argument type for built-in operation
Traceback (most recent call last):
File "_ctypes/callbacks.c", line 234, in 'calling callback function'
File "/Users/deil/code/rootpy/rootpy/logger/roothandler.py", line 47, in python_logging_error_handler
from ..utils import quickroot as QROOT
File "/opt/local/Library/Frameworks/Python.framework/Versions/3.4/lib/python3.4/site-packages/ROOT.py", line 352, in _importhook
return _orig_ihook( name, *args, **kwds )
File "<frozen importlib._bootstrap>", line 2280, in _handle_fromlist
TypeError: bad argument type for built-in operation
Traceback (most recent call last):
File "_ctypes/callbacks.c", line 234, in 'calling callback function'
File "/Users/deil/code/rootpy/rootpy/logger/roothandler.py", line 47, in python_logging_error_handler
from ..utils import quickroot as QROOT
File "/opt/local/Library/Frameworks/Python.framework/Versions/3.4/lib/python3.4/site-packages/ROOT.py", line 352, in _importhook
return _orig_ihook( name, *args, **kwds )
File "<frozen importlib._bootstrap>", line 2280, in _handle_fromlist
TypeError: bad argument type for built-in operation
FAIL
rootpy.tree.tests.test_tree.test_draw ... ok
rootpy.tree.tests.test_tree.test_chain_draw ... SKIP: Python 3 support not implemented
rootpy.tree.tests.test_tree.test_chain_draw_hist_init_first ... SKIP: Python 3 support not implemented
rootpy.tree.tests.test_tree.test_require_file_bad ... ok
rootpy.tree.tests.test_tree.test_require_file_good ... ok
rootpy.tree.tests.test_tree.test_require_file_not_writable ... ok
rootpy.tree.tests.test_tree.test_draw_regex ... ok
rootpy.tree.tests.test_tree.test_file_assoc ... ok
rootpy.tree.tests.test_tree.test_csv ... Traceback (most recent call last):
File "_ctypes/callbacks.c", line 234, in 'calling callback function'
File "/Users/deil/code/rootpy/rootpy/logger/roothandler.py", line 47, in python_logging_error_handler
from ..utils import quickroot as QROOT
File "/opt/local/Library/Frameworks/Python.framework/Versions/3.4/lib/python3.4/site-packages/ROOT.py", line 352, in _importhook
return _orig_ihook( name, *args, **kwds )
File "<frozen importlib._bootstrap>", line 2280, in _handle_fromlist
TypeError: bad argument type for built-in operation
Traceback (most recent call last):
File "_ctypes/callbacks.c", line 234, in 'calling callback function'
File "/Users/deil/code/rootpy/rootpy/logger/roothandler.py", line 47, in python_logging_error_handler
from ..utils import quickroot as QROOT
File "/opt/local/Library/Frameworks/Python.framework/Versions/3.4/lib/python3.4/site-packages/ROOT.py", line 352, in _importhook
return _orig_ihook( name, *args, **kwds )
File "<frozen importlib._bootstrap>", line 2280, in _handle_fromlist
TypeError: bad argument type for built-in operation
Traceback (most recent call last):
File "_ctypes/callbacks.c", line 234, in 'calling callback function'
File "/Users/deil/code/rootpy/rootpy/logger/roothandler.py", line 47, in python_logging_error_handler
from ..utils import quickroot as QROOT
File "/opt/local/Library/Frameworks/Python.framework/Versions/3.4/lib/python3.4/site-packages/ROOT.py", line 352, in _importhook
return _orig_ihook( name, *args, **kwds )
File "<frozen importlib._bootstrap>", line 2280, in _handle_fromlist
TypeError: bad argument type for built-in operation
Traceback (most recent call last):
File "_ctypes/callbacks.c", line 234, in 'calling callback function'
File "/Users/deil/code/rootpy/rootpy/logger/roothandler.py", line 47, in python_logging_error_handler
from ..utils import quickroot as QROOT
File "/opt/local/Library/Frameworks/Python.framework/Versions/3.4/lib/python3.4/site-packages/ROOT.py", line 352, in _importhook
return _orig_ihook( name, *args, **kwds )
File "<frozen importlib._bootstrap>", line 2280, in _handle_fromlist
TypeError: bad argument type for built-in operation
Traceback (most recent call last):
File "_ctypes/callbacks.c", line 234, in 'calling callback function'
File "/Users/deil/code/rootpy/rootpy/logger/roothandler.py", line 47, in python_logging_error_handler
from ..utils import quickroot as QROOT
File "/opt/local/Library/Frameworks/Python.framework/Versions/3.4/lib/python3.4/site-packages/ROOT.py", line 352, in _importhook
return _orig_ihook( name, *args, **kwds )
File "<frozen importlib._bootstrap>", line 2280, in _handle_fromlist
TypeError: bad argument type for built-in operation
Traceback (most recent call last):
File "_ctypes/callbacks.c", line 234, in 'calling callback function'
File "/Users/deil/code/rootpy/rootpy/logger/roothandler.py", line 47, in python_logging_error_handler
from ..utils import quickroot as QROOT
File "/opt/local/Library/Frameworks/Python.framework/Versions/3.4/lib/python3.4/site-packages/ROOT.py", line 352, in _importhook
return _orig_ihook( name, *args, **kwds )
File "<frozen importlib._bootstrap>", line 2280, in _handle_fromlist
TypeError: bad argument type for built-in operation
Traceback (most recent call last):
File "_ctypes/callbacks.c", line 234, in 'calling callback function'
File "/Users/deil/code/rootpy/rootpy/logger/roothandler.py", line 47, in python_logging_error_handler
from ..utils import quickroot as QROOT
File "/opt/local/Library/Frameworks/Python.framework/Versions/3.4/lib/python3.4/site-packages/ROOT.py", line 352, in _importhook
return _orig_ihook( name, *args, **kwds )
File "<frozen importlib._bootstrap>", line 2280, in _handle_fromlist
TypeError: bad argument type for built-in operation
Traceback (most recent call last):
File "_ctypes/callbacks.c", line 234, in 'calling callback function'
File "/Users/deil/code/rootpy/rootpy/logger/roothandler.py", line 47, in python_logging_error_handler
from ..utils import quickroot as QROOT
File "/opt/local/Library/Frameworks/Python.framework/Versions/3.4/lib/python3.4/site-packages/ROOT.py", line 352, in _importhook
return _orig_ihook( name, *args, **kwds )
File "<frozen importlib._bootstrap>", line 2280, in _handle_fromlist
TypeError: bad argument type for built-in operation
Traceback (most recent call last):
File "_ctypes/callbacks.c", line 234, in 'calling callback function'
File "/Users/deil/code/rootpy/rootpy/logger/roothandler.py", line 47, in python_logging_error_handler
from ..utils import quickroot as QROOT
File "/opt/local/Library/Frameworks/Python.framework/Versions/3.4/lib/python3.4/site-packages/ROOT.py", line 352, in _importhook
return _orig_ihook( name, *args, **kwds )
File "<frozen importlib._bootstrap>", line 2280, in _handle_fromlist
TypeError: bad argument type for built-in operation
Traceback (most recent call last):
File "_ctypes/callbacks.c", line 234, in 'calling callback function'
File "/Users/deil/code/rootpy/rootpy/logger/roothandler.py", line 47, in python_logging_error_handler
from ..utils import quickroot as QROOT
File "/opt/local/Library/Frameworks/Python.framework/Versions/3.4/lib/python3.4/site-packages/ROOT.py", line 352, in _importhook
return _orig_ihook( name, *args, **kwds )
File "<frozen importlib._bootstrap>", line 2280, in _handle_fromlist
TypeError: bad argument type for built-in operation
Traceback (most recent call last):
File "_ctypes/callbacks.c", line 234, in 'calling callback function'
File "/Users/deil/code/rootpy/rootpy/logger/roothandler.py", line 47, in python_logging_error_handler
from ..utils import quickroot as QROOT
File "/opt/local/Library/Frameworks/Python.framework/Versions/3.4/lib/python3.4/site-packages/ROOT.py", line 352, in _importhook
return _orig_ihook( name, *args, **kwds )
File "<frozen importlib._bootstrap>", line 2280, in _handle_fromlist
TypeError: bad argument type for built-in operation
Traceback (most recent call last):
File "_ctypes/callbacks.c", line 234, in 'calling callback function'
File "/Users/deil/code/rootpy/rootpy/logger/roothandler.py", line 47, in python_logging_error_handler
from ..utils import quickroot as QROOT
File "/opt/local/Library/Frameworks/Python.framework/Versions/3.4/lib/python3.4/site-packages/ROOT.py", line 352, in _importhook
return _orig_ihook( name, *args, **kwds )
File "<frozen importlib._bootstrap>", line 2280, in _handle_fromlist
TypeError: bad argument type for built-in operation
Traceback (most recent call last):
File "_ctypes/callbacks.c", line 234, in 'calling callback function'
File "/Users/deil/code/rootpy/rootpy/logger/roothandler.py", line 47, in python_logging_error_handler
from ..utils import quickroot as QROOT
File "/opt/local/Library/Frameworks/Python.framework/Versions/3.4/lib/python3.4/site-packages/ROOT.py", line 352, in _importhook
return _orig_ihook( name, *args, **kwds )
File "<frozen importlib._bootstrap>", line 2280, in _handle_fromlist
TypeError: bad argument type for built-in operation
Traceback (most recent call last):
File "_ctypes/callbacks.c", line 234, in 'calling callback function'
File "/Users/deil/code/rootpy/rootpy/logger/roothandler.py", line 47, in python_logging_error_handler
from ..utils import quickroot as QROOT
File "/opt/local/Library/Frameworks/Python.framework/Versions/3.4/lib/python3.4/site-packages/ROOT.py", line 352, in _importhook
return _orig_ihook( name, *args, **kwds )
File "<frozen importlib._bootstrap>", line 2280, in _handle_fromlist
TypeError: bad argument type for built-in operation
Traceback (most recent call last):
File "_ctypes/callbacks.c", line 234, in 'calling callback function'
File "/Users/deil/code/rootpy/rootpy/logger/roothandler.py", line 47, in python_logging_error_handler
from ..utils import quickroot as QROOT
File "/opt/local/Library/Frameworks/Python.framework/Versions/3.4/lib/python3.4/site-packages/ROOT.py", line 352, in _importhook
return _orig_ihook( name, *args, **kwds )
File "<frozen importlib._bootstrap>", line 2280, in _handle_fromlist
TypeError: bad argument type for built-in operation
Traceback (most recent call last):
File "_ctypes/callbacks.c", line 234, in 'calling callback function'
File "/Users/deil/code/rootpy/rootpy/logger/roothandler.py", line 47, in python_logging_error_handler
from ..utils import quickroot as QROOT
File "/opt/local/Library/Frameworks/Python.framework/Versions/3.4/lib/python3.4/site-packages/ROOT.py", line 352, in _importhook
return _orig_ihook( name, *args, **kwds )
File "<frozen importlib._bootstrap>", line 2280, in _handle_fromlist
TypeError: bad argument type for built-in operation
Traceback (most recent call last):
File "_ctypes/callbacks.c", line 234, in 'calling callback function'
File "/Users/deil/code/rootpy/rootpy/logger/roothandler.py", line 47, in python_logging_error_handler
from ..utils import quickroot as QROOT
File "/opt/local/Library/Frameworks/Python.framework/Versions/3.4/lib/python3.4/site-packages/ROOT.py", line 352, in _importhook
return _orig_ihook( name, *args, **kwds )
File "<frozen importlib._bootstrap>", line 2280, in _handle_fromlist
TypeError: bad argument type for built-in operation
Traceback (most recent call last):
File "_ctypes/callbacks.c", line 234, in 'calling callback function'
File "/Users/deil/code/rootpy/rootpy/logger/roothandler.py", line 47, in python_logging_error_handler
from ..utils import quickroot as QROOT
File "/opt/local/Library/Frameworks/Python.framework/Versions/3.4/lib/python3.4/site-packages/ROOT.py", line 352, in _importhook
return _orig_ihook( name, *args, **kwds )
File "<frozen importlib._bootstrap>", line 2280, in _handle_fromlist
TypeError: bad argument type for built-in operation
Traceback (most recent call last):
File "_ctypes/callbacks.c", line 234, in 'calling callback function'
File "/Users/deil/code/rootpy/rootpy/logger/roothandler.py", line 47, in python_logging_error_handler
from ..utils import quickroot as QROOT
File "/opt/local/Library/Frameworks/Python.framework/Versions/3.4/lib/python3.4/site-packages/ROOT.py", line 352, in _importhook
return _orig_ihook( name, *args, **kwds )
File "<frozen importlib._bootstrap>", line 2280, in _handle_fromlist
TypeError: bad argument type for built-in operation
Traceback (most recent call last):
File "_ctypes/callbacks.c", line 234, in 'calling callback function'
File "/Users/deil/code/rootpy/rootpy/logger/roothandler.py", line 47, in python_logging_error_handler
from ..utils import quickroot as QROOT
File "/opt/local/Library/Frameworks/Python.framework/Versions/3.4/lib/python3.4/site-packages/ROOT.py", line 352, in _importhook
return _orig_ihook( name, *args, **kwds )
File "<frozen importlib._bootstrap>", line 2280, in _handle_fromlist
TypeError: bad argument type for built-in operation
Traceback (most recent call last):
File "_ctypes/callbacks.c", line 234, in 'calling callback function'
File "/Users/deil/code/rootpy/rootpy/logger/roothandler.py", line 47, in python_logging_error_handler
from ..utils import quickroot as QROOT
File "/opt/local/Library/Frameworks/Python.framework/Versions/3.4/lib/python3.4/site-packages/ROOT.py", line 352, in _importhook
return _orig_ihook( name, *args, **kwds )
File "<frozen importlib._bootstrap>", line 2280, in _handle_fromlist
TypeError: bad argument type for built-in operation
Traceback (most recent call last):
File "_ctypes/callbacks.c", line 234, in 'calling callback function'
File "/Users/deil/code/rootpy/rootpy/logger/roothandler.py", line 47, in python_logging_error_handler
from ..utils import quickroot as QROOT
File "/opt/local/Library/Frameworks/Python.framework/Versions/3.4/lib/python3.4/site-packages/ROOT.py", line 352, in _importhook
return _orig_ihook( name, *args, **kwds )
File "<frozen importlib._bootstrap>", line 2280, in _handle_fromlist
TypeError: bad argument type for built-in operation
Traceback (most recent call last):
File "_ctypes/callbacks.c", line 234, in 'calling callback function'
File "/Users/deil/code/rootpy/rootpy/logger/roothandler.py", line 47, in python_logging_error_handler
from ..utils import quickroot as QROOT
File "/opt/local/Library/Frameworks/Python.framework/Versions/3.4/lib/python3.4/site-packages/ROOT.py", line 352, in _importhook
return _orig_ihook( name, *args, **kwds )
File "<frozen importlib._bootstrap>", line 2280, in _handle_fromlist
TypeError: bad argument type for built-in operation
Traceback (most recent call last):
File "_ctypes/callbacks.c", line 234, in 'calling callback function'
File "/Users/deil/code/rootpy/rootpy/logger/roothandler.py", line 47, in python_logging_error_handler
from ..utils import quickroot as QROOT
File "/opt/local/Library/Frameworks/Python.framework/Versions/3.4/lib/python3.4/site-packages/ROOT.py", line 352, in _importhook
return _orig_ihook( name, *args, **kwds )
File "<frozen importlib._bootstrap>", line 2280, in _handle_fromlist
TypeError: bad argument type for built-in operation
Traceback (most recent call last):
File "_ctypes/callbacks.c", line 234, in 'calling callback function'
File "/Users/deil/code/rootpy/rootpy/logger/roothandler.py", line 47, in python_logging_error_handler
from ..utils import quickroot as QROOT
File "/opt/local/Library/Frameworks/Python.framework/Versions/3.4/lib/python3.4/site-packages/ROOT.py", line 352, in _importhook
return _orig_ihook( name, *args, **kwds )
File "<frozen importlib._bootstrap>", line 2280, in _handle_fromlist
TypeError: bad argument type for built-in operation
Traceback (most recent call last):
File "_ctypes/callbacks.c", line 234, in 'calling callback function'
File "/Users/deil/code/rootpy/rootpy/logger/roothandler.py", line 47, in python_logging_error_handler
from ..utils import quickroot as QROOT
File "/opt/local/Library/Frameworks/Python.framework/Versions/3.4/lib/python3.4/site-packages/ROOT.py", line 352, in _importhook
return _orig_ihook( name, *args, **kwds )
File "<frozen importlib._bootstrap>", line 2280, in _handle_fromlist
TypeError: bad argument type for built-in operation
Traceback (most recent call last):
File "_ctypes/callbacks.c", line 234, in 'calling callback function'
File "/Users/deil/code/rootpy/rootpy/logger/roothandler.py", line 47, in python_logging_error_handler
from ..utils import quickroot as QROOT
File "/opt/local/Library/Frameworks/Python.framework/Versions/3.4/lib/python3.4/site-packages/ROOT.py", line 352, in _importhook
return _orig_ihook( name, *args, **kwds )
File "<frozen importlib._bootstrap>", line 2280, in _handle_fromlist
TypeError: bad argument type for built-in operation
Traceback (most recent call last):
File "_ctypes/callbacks.c", line 234, in 'calling callback function'
File "/Users/deil/code/rootpy/rootpy/logger/roothandler.py", line 47, in python_logging_error_handler
from ..utils import quickroot as QROOT
File "/opt/local/Library/Frameworks/Python.framework/Versions/3.4/lib/python3.4/site-packages/ROOT.py", line 352, in _importhook
return _orig_ihook( name, *args, **kwds )
File "<frozen importlib._bootstrap>", line 2280, in _handle_fromlist
TypeError: bad argument type for built-in operation
Traceback (most recent call last):
File "_ctypes/callbacks.c", line 234, in 'calling callback function'
File "/Users/deil/code/rootpy/rootpy/logger/roothandler.py", line 47, in python_logging_error_handler
from ..utils import quickroot as QROOT
File "/opt/local/Library/Frameworks/Python.framework/Versions/3.4/lib/python3.4/site-packages/ROOT.py", line 352, in _importhook
return _orig_ihook( name, *args, **kwds )
File "<frozen importlib._bootstrap>", line 2280, in _handle_fromlist
TypeError: bad argument type for built-in operation
Traceback (most recent call last):
File "_ctypes/callbacks.c", line 234, in 'calling callback function'
File "/Users/deil/code/rootpy/rootpy/logger/roothandler.py", line 47, in python_logging_error_handler
from ..utils import quickroot as QROOT
File "/opt/local/Library/Frameworks/Python.framework/Versions/3.4/lib/python3.4/site-packages/ROOT.py", line 352, in _importhook
return _orig_ihook( name, *args, **kwds )
File "<frozen importlib._bootstrap>", line 2280, in _handle_fromlist
TypeError: bad argument type for built-in operation
Traceback (most recent call last):
File "_ctypes/callbacks.c", line 234, in 'calling callback function'
File "/Users/deil/code/rootpy/rootpy/logger/roothandler.py", line 47, in python_logging_error_handler
from ..utils import quickroot as QROOT
File "/opt/local/Library/Frameworks/Python.framework/Versions/3.4/lib/python3.4/site-packages/ROOT.py", line 352, in _importhook
return _orig_ihook( name, *args, **kwds )
File "<frozen importlib._bootstrap>", line 2280, in _handle_fromlist
TypeError: bad argument type for built-in operation
Traceback (most recent call last):
File "_ctypes/callbacks.c", line 234, in 'calling callback function'
File "/Users/deil/code/rootpy/rootpy/logger/roothandler.py", line 47, in python_logging_error_handler
from ..utils import quickroot as QROOT
File "/opt/local/Library/Frameworks/Python.framework/Versions/3.4/lib/python3.4/site-packages/ROOT.py", line 352, in _importhook
return _orig_ihook( name, *args, **kwds )
File "<frozen importlib._bootstrap>", line 2280, in _handle_fromlist
TypeError: bad argument type for built-in operation
Traceback (most recent call last):
File "_ctypes/callbacks.c", line 234, in 'calling callback function'
File "/Users/deil/code/rootpy/rootpy/logger/roothandler.py", line 47, in python_logging_error_handler
from ..utils import quickroot as QROOT
File "/opt/local/Library/Frameworks/Python.framework/Versions/3.4/lib/python3.4/site-packages/ROOT.py", line 352, in _importhook
return _orig_ihook( name, *args, **kwds )
File "<frozen importlib._bootstrap>", line 2280, in _handle_fromlist
TypeError: bad argument type for built-in operation
Traceback (most recent call last):
File "_ctypes/callbacks.c", line 234, in 'calling callback function'
File "/Users/deil/code/rootpy/rootpy/logger/roothandler.py", line 47, in python_logging_error_handler
from ..utils import quickroot as QROOT
File "/opt/local/Library/Frameworks/Python.framework/Versions/3.4/lib/python3.4/site-packages/ROOT.py", line 352, in _importhook
return _orig_ihook( name, *args, **kwds )
File "<frozen importlib._bootstrap>", line 2280, in _handle_fromlist
TypeError: bad argument type for built-in operation
Traceback (most recent call last):
File "_ctypes/callbacks.c", line 234, in 'calling callback function'
File "/Users/deil/code/rootpy/rootpy/logger/roothandler.py", line 47, in python_logging_error_handler
from ..utils import quickroot as QROOT
File "/opt/local/Library/Frameworks/Python.framework/Versions/3.4/lib/python3.4/site-packages/ROOT.py", line 352, in _importhook
return _orig_ihook( name, *args, **kwds )
File "<frozen importlib._bootstrap>", line 2280, in _handle_fromlist
TypeError: bad argument type for built-in operation
Traceback (most recent call last):
File "_ctypes/callbacks.c", line 234, in 'calling callback function'
File "/Users/deil/code/rootpy/rootpy/logger/roothandler.py", line 47, in python_logging_error_handler
from ..utils import quickroot as QROOT
File "/opt/local/Library/Frameworks/Python.framework/Versions/3.4/lib/python3.4/site-packages/ROOT.py", line 352, in _importhook
return _orig_ihook( name, *args, **kwds )
File "<frozen importlib._bootstrap>", line 2280, in _handle_fromlist
TypeError: bad argument type for built-in operation
Traceback (most recent call last):
File "_ctypes/callbacks.c", line 234, in 'calling callback function'
File "/Users/deil/code/rootpy/rootpy/logger/roothandler.py", line 47, in python_logging_error_handler
from ..utils import quickroot as QROOT
File "/opt/local/Library/Frameworks/Python.framework/Versions/3.4/lib/python3.4/site-packages/ROOT.py", line 352, in _importhook
return _orig_ihook( name, *args, **kwds )
File "<frozen importlib._bootstrap>", line 2280, in _handle_fromlist
TypeError: bad argument type for built-in operation
Traceback (most recent call last):
File "_ctypes/callbacks.c", line 234, in 'calling callback function'
File "/Users/deil/code/rootpy/rootpy/logger/roothandler.py", line 47, in python_logging_error_handler
from ..utils import quickroot as QROOT
File "/opt/local/Library/Frameworks/Python.framework/Versions/3.4/lib/python3.4/site-packages/ROOT.py", line 352, in _importhook
return _orig_ihook( name, *args, **kwds )
File "<frozen importlib._bootstrap>", line 2280, in _handle_fromlist
TypeError: bad argument type for built-in operation
Traceback (most recent call last):
File "_ctypes/callbacks.c", line 234, in 'calling callback function'
File "/Users/deil/code/rootpy/rootpy/logger/roothandler.py", line 47, in python_logging_error_handler
from ..utils import quickroot as QROOT
File "/opt/local/Library/Frameworks/Python.framework/Versions/3.4/lib/python3.4/site-packages/ROOT.py", line 352, in _importhook
return _orig_ihook( name, *args, **kwds )
File "<frozen importlib._bootstrap>", line 2280, in _handle_fromlist
TypeError: bad argument type for built-in operation
Traceback (most recent call last):
File "_ctypes/callbacks.c", line 234, in 'calling callback function'
File "/Users/deil/code/rootpy/rootpy/logger/roothandler.py", line 47, in python_logging_error_handler
from ..utils import quickroot as QROOT
File "/opt/local/Library/Frameworks/Python.framework/Versions/3.4/lib/python3.4/site-packages/ROOT.py", line 352, in _importhook
return _orig_ihook( name, *args, **kwds )
File "<frozen importlib._bootstrap>", line 2280, in _handle_fromlist
TypeError: bad argument type for built-in operation
Traceback (most recent call last):
File "_ctypes/callbacks.c", line 234, in 'calling callback function'
File "/Users/deil/code/rootpy/rootpy/logger/roothandler.py", line 47, in python_logging_error_handler
from ..utils import quickroot as QROOT
File "/opt/local/Library/Frameworks/Python.framework/Versions/3.4/lib/python3.4/site-packages/ROOT.py", line 352, in _importhook
return _orig_ihook( name, *args, **kwds )
File "<frozen importlib._bootstrap>", line 2280, in _handle_fromlist
TypeError: bad argument type for built-in operation
Traceback (most recent call last):
File "_ctypes/callbacks.c", line 234, in 'calling callback function'
File "/Users/deil/code/rootpy/rootpy/logger/roothandler.py", line 47, in python_logging_error_handler
from ..utils import quickroot as QROOT
File "/opt/local/Library/Frameworks/Python.framework/Versions/3.4/lib/python3.4/site-packages/ROOT.py", line 352, in _importhook
return _orig_ihook( name, *args, **kwds )
File "<frozen importlib._bootstrap>", line 2280, in _handle_fromlist
TypeError: bad argument type for built-in operation
Traceback (most recent call last):
File "_ctypes/callbacks.c", line 234, in 'calling callback function'
File "/Users/deil/code/rootpy/rootpy/logger/roothandler.py", line 47, in python_logging_error_handler
from ..utils import quickroot as QROOT
File "/opt/local/Library/Frameworks/Python.framework/Versions/3.4/lib/python3.4/site-packages/ROOT.py", line 352, in _importhook
return _orig_ihook( name, *args, **kwds )
File "<frozen importlib._bootstrap>", line 2280, in _handle_fromlist
TypeError: bad argument type for built-in operation
Traceback (most recent call last):
File "_ctypes/callbacks.c", line 234, in 'calling callback function'
File "/Users/deil/code/rootpy/rootpy/logger/roothandler.py", line 47, in python_logging_error_handler
from ..utils import quickroot as QROOT
File "/opt/local/Library/Frameworks/Python.framework/Versions/3.4/lib/python3.4/site-packages/ROOT.py", line 352, in _importhook
return _orig_ihook( name, *args, **kwds )
File "<frozen importlib._bootstrap>", line 2280, in _handle_fromlist
TypeError: bad argument type for built-in operation
Traceback (most recent call last):
File "_ctypes/callbacks.c", line 234, in 'calling callback function'
File "/Users/deil/code/rootpy/rootpy/logger/roothandler.py", line 47, in python_logging_error_handler
from ..utils import quickroot as QROOT
File "/opt/local/Library/Frameworks/Python.framework/Versions/3.4/lib/python3.4/site-packages/ROOT.py", line 352, in _importhook
return _orig_ihook( name, *args, **kwds )
File "<frozen importlib._bootstrap>", line 2280, in _handle_fromlist
TypeError: bad argument type for built-in operation
Traceback (most recent call last):
File "_ctypes/callbacks.c", line 234, in 'calling callback function'
File "/Users/deil/code/rootpy/rootpy/logger/roothandler.py", line 47, in python_logging_error_handler
from ..utils import quickroot as QROOT
File "/opt/local/Library/Frameworks/Python.framework/Versions/3.4/lib/python3.4/site-packages/ROOT.py", line 352, in _importhook
return _orig_ihook( name, *args, **kwds )
File "<frozen importlib._bootstrap>", line 2280, in _handle_fromlist
TypeError: bad argument type for built-in operation
Traceback (most recent call last):
File "_ctypes/callbacks.c", line 234, in 'calling callback function'
File "/Users/deil/code/rootpy/rootpy/logger/roothandler.py", line 47, in python_logging_error_handler
from ..utils import quickroot as QROOT
File "/opt/local/Library/Frameworks/Python.framework/Versions/3.4/lib/python3.4/site-packages/ROOT.py", line 352, in _importhook
return _orig_ihook( name, *args, **kwds )
File "<frozen importlib._bootstrap>", line 2280, in _handle_fromlist
TypeError: bad argument type for built-in operation
Traceback (most recent call last):
File "_ctypes/callbacks.c", line 234, in 'calling callback function'
File "/Users/deil/code/rootpy/rootpy/logger/roothandler.py", line 47, in python_logging_error_handler
from ..utils import quickroot as QROOT
File "/opt/local/Library/Frameworks/Python.framework/Versions/3.4/lib/python3.4/site-packages/ROOT.py", line 352, in _importhook
return _orig_ihook( name, *args, **kwds )
File "<frozen importlib._bootstrap>", line 2280, in _handle_fromlist
TypeError: bad argument type for built-in operation
Traceback (most recent call last):
File "_ctypes/callbacks.c", line 234, in 'calling callback function'
File "/Users/deil/code/rootpy/rootpy/logger/roothandler.py", line 47, in python_logging_error_handler
from ..utils import quickroot as QROOT
File "/opt/local/Library/Frameworks/Python.framework/Versions/3.4/lib/python3.4/site-packages/ROOT.py", line 352, in _importhook
return _orig_ihook( name, *args, **kwds )
File "<frozen importlib._bootstrap>", line 2280, in _handle_fromlist
TypeError: bad argument type for built-in operation
Traceback (most recent call last):
File "_ctypes/callbacks.c", line 234, in 'calling callback function'
File "/Users/deil/code/rootpy/rootpy/logger/roothandler.py", line 47, in python_logging_error_handler
from ..utils import quickroot as QROOT
File "/opt/local/Library/Frameworks/Python.framework/Versions/3.4/lib/python3.4/site-packages/ROOT.py", line 352, in _importhook
return _orig_ihook( name, *args, **kwds )
File "<frozen importlib._bootstrap>", line 2280, in _handle_fromlist
TypeError: bad argument type for built-in operation
Traceback (most recent call last):
File "_ctypes/callbacks.c", line 234, in 'calling callback function'
File "/Users/deil/code/rootpy/rootpy/logger/roothandler.py", line 47, in python_logging_error_handler
from ..utils import quickroot as QROOT
File "/opt/local/Library/Frameworks/Python.framework/Versions/3.4/lib/python3.4/site-packages/ROOT.py", line 352, in _importhook
return _orig_ihook( name, *args, **kwds )
File "<frozen importlib._bootstrap>", line 2280, in _handle_fromlist
TypeError: bad argument type for built-in operation
Traceback (most recent call last):
File "_ctypes/callbacks.c", line 234, in 'calling callback function'
File "/Users/deil/code/rootpy/rootpy/logger/roothandler.py", line 47, in python_logging_error_handler
from ..utils import quickroot as QROOT
File "/opt/local/Library/Frameworks/Python.framework/Versions/3.4/lib/python3.4/site-packages/ROOT.py", line 352, in _importhook
return _orig_ihook( name, *args, **kwds )
File "<frozen importlib._bootstrap>", line 2280, in _handle_fromlist
TypeError: bad argument type for built-in operation
Traceback (most recent call last):
File "_ctypes/callbacks.c", line 234, in 'calling callback function'
File "/Users/deil/code/rootpy/rootpy/logger/roothandler.py", line 47, in python_logging_error_handler
from ..utils import quickroot as QROOT
File "/opt/local/Library/Frameworks/Python.framework/Versions/3.4/lib/python3.4/site-packages/ROOT.py", line 352, in _importhook
return _orig_ihook( name, *args, **kwds )
File "<frozen importlib._bootstrap>", line 2280, in _handle_fromlist
TypeError: bad argument type for built-in operation
Traceback (most recent call last):
File "_ctypes/callbacks.c", line 234, in 'calling callback function'
File "/Users/deil/code/rootpy/rootpy/logger/roothandler.py", line 47, in python_logging_error_handler
from ..utils import quickroot as QROOT
File "/opt/local/Library/Frameworks/Python.framework/Versions/3.4/lib/python3.4/site-packages/ROOT.py", line 352, in _importhook
return _orig_ihook( name, *args, **kwds )
File "<frozen importlib._bootstrap>", line 2280, in _handle_fromlist
TypeError: bad argument type for built-in operation
Traceback (most recent call last):
File "_ctypes/callbacks.c", line 234, in 'calling callback function'
File "/Users/deil/code/rootpy/rootpy/logger/roothandler.py", line 47, in python_logging_error_handler
from ..utils import quickroot as QROOT
File "/opt/local/Library/Frameworks/Python.framework/Versions/3.4/lib/python3.4/site-packages/ROOT.py", line 352, in _importhook
return _orig_ihook( name, *args, **kwds )
File "<frozen importlib._bootstrap>", line 2280, in _handle_fromlist
TypeError: bad argument type for built-in operation
Traceback (most recent call last):
File "_ctypes/callbacks.c", line 234, in 'calling callback function'
File "/Users/deil/code/rootpy/rootpy/logger/roothandler.py", line 47, in python_logging_error_handler
from ..utils import quickroot as QROOT
File "/opt/local/Library/Frameworks/Python.framework/Versions/3.4/lib/python3.4/site-packages/ROOT.py", line 352, in _importhook
return _orig_ihook( name, *args, **kwds )
File "<frozen importlib._bootstrap>", line 2280, in _handle_fromlist
TypeError: bad argument type for built-in operation
Traceback (most recent call last):
File "_ctypes/callbacks.c", line 234, in 'calling callback function'
File "/Users/deil/code/rootpy/rootpy/logger/roothandler.py", line 47, in python_logging_error_handler
from ..utils import quickroot as QROOT
File "/opt/local/Library/Frameworks/Python.framework/Versions/3.4/lib/python3.4/site-packages/ROOT.py", line 352, in _importhook
return _orig_ihook( name, *args, **kwds )
File "<frozen importlib._bootstrap>", line 2280, in _handle_fromlist
TypeError: bad argument type for built-in operation
Traceback (most recent call last):
File "_ctypes/callbacks.c", line 234, in 'calling callback function'
File "/Users/deil/code/rootpy/rootpy/logger/roothandler.py", line 47, in python_logging_error_handler
from ..utils import quickroot as QROOT
File "/opt/local/Library/Frameworks/Python.framework/Versions/3.4/lib/python3.4/site-packages/ROOT.py", line 352, in _importhook
return _orig_ihook( name, *args, **kwds )
File "<frozen importlib._bootstrap>", line 2280, in _handle_fromlist
TypeError: bad argument type for built-in operation
Traceback (most recent call last):
File "_ctypes/callbacks.c", line 234, in 'calling callback function'
File "/Users/deil/code/rootpy/rootpy/logger/roothandler.py", line 47, in python_logging_error_handler
from ..utils import quickroot as QROOT
File "/opt/local/Library/Frameworks/Python.framework/Versions/3.4/lib/python3.4/site-packages/ROOT.py", line 352, in _importhook
return _orig_ihook( name, *args, **kwds )
File "<frozen importlib._bootstrap>", line 2280, in _handle_fromlist
TypeError: bad argument type for built-in operation
Traceback (most recent call last):
File "_ctypes/callbacks.c", line 234, in 'calling callback function'
File "/Users/deil/code/rootpy/rootpy/logger/roothandler.py", line 47, in python_logging_error_handler
from ..utils import quickroot as QROOT
File "/opt/local/Library/Frameworks/Python.framework/Versions/3.4/lib/python3.4/site-packages/ROOT.py", line 352, in _importhook
return _orig_ihook( name, *args, **kwds )
File "<frozen importlib._bootstrap>", line 2280, in _handle_fromlist
TypeError: bad argument type for built-in operation
FAIL
rootpy.tree.tests.test_tree.test_ntuple ... ok
rootpy.tree.tests.test_treetypes.test_convert ... ok
rootpy.utils.tests.test_hook.test_inject ... ERROR
rootpy.utils.tests.test_hook.test_hooks ... ok
rootpy.utils.tests.test_module_facade.test_module_facade ... ok
rootpy.utils.tests.test_module_facade.test_internal_facade ... ok
rootpy.tests.test_ROOT.test_ROOT ... ok
rootpy.tests.test_base.test_object ... ok
rootpy.tests.test_compiled.test_compiled ... ok
rootpy.tests.test_decorators.test_snake_case_methods ... ok
rootpy.tests.test_decorators.test_snake_case_methods_descriptor ... ok
rootpy.tests.test_decorators.test_method_file_check_good ... ok
rootpy.tests.test_decorators.test_method_file_check_bad ... ok
rootpy.tests.test_decorators.test_method_file_cd ... ok
rootpy.tests.test_root2hdf5.test_root2hdf5 ... /opt/local/Library/Frameworks/Python.framework/Versions/3.4/lib/python3.4/site-packages/pkg_resources/__init__.py:197: RuntimeWarning: You have iterated over the result of pkg_resources.parse_version. This is a legacy behavior which is inconsistent with the new version class introduced in setuptools 8.0. In most cases, conversion to a tuple is unnecessary. For comparison of versions, sort the Version instances directly. If you have another use case requiring the tuple, please file a bug with the setuptools project describing that need.
stacklevel=1,
ok
rootpy.tests.test_root2hdf5.test_root2hdf5_chunked ... ok
rootpy.tests.test_root2hdf5.test_root2hdf5_chunked_selected ... ok
rootpy.tests.test_stl.test_parse ... ok
======================================================================
ERROR: Failure: FileNotFoundError ([Errno 2] No such file or directory: 'pkg-config python --variable=includedir')
----------------------------------------------------------------------
Traceback (most recent call last):
File "/opt/local/Library/Frameworks/Python.framework/Versions/3.4/lib/python3.4/site-packages/nose/failure.py", line 39, in runTest
raise self.exc_val.with_traceback(self.tb)
File "/opt/local/Library/Frameworks/Python.framework/Versions/3.4/lib/python3.4/site-packages/nose/loader.py", line 411, in loadTestsFromName
addr.filename, addr.module)
File "/opt/local/Library/Frameworks/Python.framework/Versions/3.4/lib/python3.4/site-packages/nose/importer.py", line 47, in importFromPath
return self.importFromDir(dir_path, fqname)
File "/opt/local/Library/Frameworks/Python.framework/Versions/3.4/lib/python3.4/site-packages/nose/importer.py", line 94, in importFromDir
mod = load_module(part_fqname, fh, filename, desc)
File "/opt/local/Library/Frameworks/Python.framework/Versions/3.4/lib/python3.4/imp.py", line 235, in load_module
return load_source(name, filename, file)
File "/opt/local/Library/Frameworks/Python.framework/Versions/3.4/lib/python3.4/imp.py", line 171, in load_source
module = methods.load()
File "<frozen importlib._bootstrap>", line 1220, in load
File "<frozen importlib._bootstrap>", line 1200, in _load_unlocked
File "<frozen importlib._bootstrap>", line 1129, in _exec
File "<frozen importlib._bootstrap>", line 1471, in exec_module
File "<frozen importlib._bootstrap>", line 321, in _call_with_frames_removed
File "/Users/deil/code/rootpy/rootpy/memory/tests/test_keepalive.py", line 11, in <module>
from rootpy.memory.deletion import monitor_deletion
File "/opt/local/Library/Frameworks/Python.framework/Versions/3.4/lib/python3.4/site-packages/ROOT.py", line 352, in _importhook
return _orig_ihook( name, *args, **kwds )
File "/Users/deil/code/rootpy/rootpy/memory/deletion.py", line 61, in <module>
C.add_python_includepath()
File "/Users/deil/code/rootpy/rootpy/compiled.py", line 272, in add_python_includepath
'-I"{0}"'.format(self.python_include_path))
File "/Users/deil/code/rootpy/rootpy/utils/module_facade.py", line 17, in __get__
result = super(computed_once_classproperty, self).__get__(object_, type_)
File "/Users/deil/code/rootpy/rootpy/compiled.py", line 255, in python_include_path
path = path()
File "/Users/deil/code/rootpy/rootpy/compiled.py", line 230, in pkgconfig
output = check_output(cmd)
File "/opt/local/Library/Frameworks/Python.framework/Versions/3.4/lib/python3.4/subprocess.py", line 607, in check_output
with Popen(*popenargs, stdout=PIPE, **kwargs) as process:
File "/opt/local/Library/Frameworks/Python.framework/Versions/3.4/lib/python3.4/subprocess.py", line 859, in __init__
restore_signals, start_new_session)
File "/opt/local/Library/Frameworks/Python.framework/Versions/3.4/lib/python3.4/subprocess.py", line 1457, in _execute_child
raise child_exception_type(errno_num, err_msg)
FileNotFoundError: [Errno 2] No such file or directory: 'pkg-config python --variable=includedir'
======================================================================
ERROR: rootpy.utils.tests.test_hook.test_inject
----------------------------------------------------------------------
Traceback (most recent call last):
File "/opt/local/Library/Frameworks/Python.framework/Versions/3.4/lib/python3.4/site-packages/nose/case.py", line 198, in runTest
self.test(*self.arg)
File "/Users/deil/code/rootpy/rootpy/utils/tests/test_hook.py", line 57, in test_inject
hooked = H.inject_closure_values(wrap, ANOTHER=NEWANOTHER, nonexist=999)
File "/Users/deil/code/rootpy/rootpy/utils/inject_closure.py", line 145, in inject_closure_values
newfunc = _inject_closure_values(func, **kwargs)
File "/Users/deil/code/rootpy/rootpy/utils/inject_closure.py", line 110, in _inject_closure_values
c = byteplay.Code.from_code(func_code)
File "/Users/deil/code/rootpy/rootpy/extern/byteplay3.py", line 148, in from_code
code[-1]=(LOAD_CONST,Code.from_code(lastarg))
File "/Users/deil/code/rootpy/rootpy/extern/byteplay3.py", line 133, in from_code
co_code=co.co_code
AttributeError: 'str' object has no attribute 'co_code'
======================================================================
FAIL: rootpy.tree.tests.test_tree.test_attrs
----------------------------------------------------------------------
Traceback (most recent call last):
File "/opt/local/Library/Frameworks/Python.framework/Versions/3.4/lib/python3.4/site-packages/nose/case.py", line 198, in runTest
self.test(*self.arg)
File "/Users/deil/code/rootpy/rootpy/tree/tests/test_tree.py", line 123, in test_attrs
assert_equal(len(event.b) > 0, True)
nose.proxy.AssertionError: False != True
-------------------- >> begin captured logging << --------------------
rootpy.stl: INFO: generating dictionary for vector<int> ...
ROOT.TMacOSXSystem.ACLiC: INFO: creating shared library /var/folders/sb/4qv5j4m90pz1rw7m70rj1b1r0000gn/T/tmprmhhx1md/x86_64-53430/dicts/ccad4664192b899b.so
ROOT.TClassTable.Add: WARNING: class vector<int,allocator<int> >::iterator already in TClassTable
rootpy.stl: INFO: generating dictionary for vector<float> ...
ROOT.TMacOSXSystem.ACLiC: INFO: creating shared library /var/folders/sb/4qv5j4m90pz1rw7m70rj1b1r0000gn/T/tmprmhhx1md/x86_64-53430/dicts/15fe54d5c4df2bfd.so
rootpy.stl: INFO: generating dictionary for vector<TLorentzVector> ...
ROOT.TMacOSXSystem.ACLiC: INFO: creating shared library /var/folders/sb/4qv5j4m90pz1rw7m70rj1b1r0000gn/T/tmprmhhx1md/x86_64-53430/dicts/0139c333aa42dfd9.so
ROOT.TTree.Bronch: WARNING: Using split mode on a class: TLorentzVector with a custom Streamer
--------------------- >> end captured logging << ---------------------
======================================================================
FAIL: rootpy.tree.tests.test_tree.test_csv
----------------------------------------------------------------------
Traceback (most recent call last):
File "/opt/local/Library/Frameworks/Python.framework/Versions/3.4/lib/python3.4/site-packages/nose/case.py", line 198, in runTest
self.test(*self.arg)
File "/Users/deil/code/rootpy/rootpy/tree/tests/test_tree.py", line 270, in test_csv
assert_equal(output.getvalue(), true_output)
AssertionError: 'RunN[2414 chars]Ndf\n0,0,0,0,0,0,0.0,0.0,0.0,0.0,0.0,0.0,0.0,0[2530 chars],0\n' != 'RunN[2414 chars]Ndf\n19003,56,171,734439407672,1077155751,2141[6780 chars],0\n'
Diff is 11835 characters long. Set self.maxDiff to None to see it.
----------------------------------------------------------------------
Ran 98 tests in 17.644s
FAILED (SKIP=4, errors=2, failures=2)
make: *** [test-code] Error 1
Sign up for free to join this conversation on GitHub. Already have an account? Sign in to comment