Instantly share code, notes, and snippets.

Embed
What would you like to do?
simple 12-Dec-2018 17:16:57 Build Automation Tests - QA - Parent Portal iOS Tests CI - newAppiumTry - Gandalf #25 (AT-MTV179-GANN-25) started building on agent c69e564deef1
simple 12-Dec-2018 17:16:57 Remote agent on host c69e564deef1
simple 12-Dec-2018 17:16:57 Build working directory is /root/bamboo-agent-home/xml-data/build-dir/AT-MTV179-GANN
simple 12-Dec-2018 17:16:57 Executing build Automation Tests - QA - Parent Portal iOS Tests CI - newAppiumTry - Gandalf #25 (AT-MTV179-GANN-25)
simple 12-Dec-2018 17:16:57 Starting task 'Checkout test automation' of type 'com.atlassian.bamboo.plugins.vcs:task.vcs.checkout'
simple 12-Dec-2018 17:16:57 Build always requires a clean checkout
simple 12-Dec-2018 17:16:57 Cleaning build directory '/root/bamboo-agent-home/xml-data/build-dir/AT-MTV179-GANN'
simple 12-Dec-2018 17:16:57 Build always requires a clean checkout
simple 12-Dec-2018 17:16:57 Cleaning build directory '/root/bamboo-agent-home/xml-data/build-dir/AT-MTV179-GANN/ofw-zephyr-qa'
simple 12-Dec-2018 17:16:57 Checking out into /root/bamboo-agent-home/xml-data/build-dir/AT-MTV179-GANN
simple 12-Dec-2018 17:16:57 Updating source code to revision: e5c9ab2ff369341c3155cccdbce5ee5b49b66d28
simple 12-Dec-2018 17:16:58 Fetching 'refs/heads/newAppiumTry' from 'ssh://git@bitbucket.avirat.net:7999/ofw/ofw-mobilev2-qa.git'.
simple 12-Dec-2018 17:16:58 Warning: Permanently added '[127.0.0.1]:45484' (RSA) to the list of known hosts.
simple 12-Dec-2018 17:16:58 Checking out revision e5c9ab2ff369341c3155cccdbce5ee5b49b66d28.
simple 12-Dec-2018 17:16:58 Creating local git repository in '/root/bamboo-agent-home/xml-data/build-dir/AT-MTV179-GANN/.git'.
simple 12-Dec-2018 17:16:58 fatal: destination path '/root/bamboo-agent-home/xml-data/build-dir/AT-MTV179-GANN' already exists and is not an empty directory.
error 12-Dec-2018 17:16:58 Checkout to revision e5c9ab2ff369341c3155cccdbce5ee5b49b66d28 has failed.
simple 12-Dec-2018 17:16:58 fatal: Not a git repository (or any of the parent directories): .git
simple 12-Dec-2018 17:16:58 Warning: failed to checkout source code to directory '/root/bamboo-agent-home/xml-data/build-dir/AT-MTV179-GANN', trying to recover...
simple 12-Dec-2018 17:16:58 Cleaned source directory '/root/bamboo-agent-home/xml-data/build-dir/AT-MTV179-GANN'...
simple 12-Dec-2018 17:16:58 Checking out revision e5c9ab2ff369341c3155cccdbce5ee5b49b66d28.
simple 12-Dec-2018 17:16:58 Creating local git repository in '/root/bamboo-agent-home/xml-data/build-dir/AT-MTV179-GANN/.git'.
simple 12-Dec-2018 17:16:58 Cloning into '/root/bamboo-agent-home/xml-data/build-dir/AT-MTV179-GANN'...
simple 12-Dec-2018 17:16:58 done.
simple 12-Dec-2018 17:16:58 Switched to a new branch 'newAppiumTry'
simple 12-Dec-2018 17:16:58 Branch newAppiumTry set up to track remote branch newAppiumTry from origin.
simple 12-Dec-2018 17:16:58 Checkout completed, recover successful.
simple 12-Dec-2018 17:16:58 Updated source code to revision: e5c9ab2ff369341c3155cccdbce5ee5b49b66d28
simple 12-Dec-2018 17:16:58 Checking out into /root/bamboo-agent-home/xml-data/build-dir/AT-MTV179-GANN/ofw-zephyr-qa
simple 12-Dec-2018 17:16:58 Updating source code to revision: 9d316208bb231ad73ef762a3e9191203438aed30
simple 12-Dec-2018 17:16:58 Fetching 'refs/heads/master' from 'ssh://git@bitbucket.avirat.net:7999/ofw/ofw-zephyr-qa.git'.
simple 12-Dec-2018 17:16:58 Warning: Permanently added '[127.0.0.1]:45484' (RSA) to the list of known hosts.
simple 12-Dec-2018 17:16:58 Checking out revision 9d316208bb231ad73ef762a3e9191203438aed30.
simple 12-Dec-2018 17:16:58 Creating local git repository in '/root/bamboo-agent-home/xml-data/build-dir/AT-MTV179-GANN/ofw-zephyr-qa/.git'.
simple 12-Dec-2018 17:16:58 Cloning into '/root/bamboo-agent-home/xml-data/build-dir/AT-MTV179-GANN/ofw-zephyr-qa'...
simple 12-Dec-2018 17:16:58 done.
simple 12-Dec-2018 17:16:58 Already on 'master'
simple 12-Dec-2018 17:16:58 Your branch is up-to-date with 'origin/master'.
simple 12-Dec-2018 17:16:58 Updated source code to revision: 9d316208bb231ad73ef762a3e9191203438aed30
simple 12-Dec-2018 17:16:58 Finished task 'Checkout test automation' with result: Success
simple 12-Dec-2018 17:16:58 Running pre-build action: Artifactory Release Staging
simple 12-Dec-2018 17:16:58 Running pre-build action: VCS Version Collector
simple 12-Dec-2018 17:16:58 Running pre-build action: Hung Build Killer PreBuildAction
command 12-Dec-2018 17:16:58 Substituting variable: ${bamboo.appium.path} with /Users/svctest/appium
command 12-Dec-2018 17:16:58 Substituting variable: ${bamboo.appium.binary} with ./node_modules/appium/build/lib/main.js
command 12-Dec-2018 17:16:58 Substituting variable: ${bamboo.devices.gandalf.port} with 4741
command 12-Dec-2018 17:16:58 Substituting variable: ${bamboo.appium.temp} with /tmp/appium
command 12-Dec-2018 17:16:58 Substituting variable: ${bamboo.devices.gandalf.name} with gandalfipad
command 12-Dec-2018 17:16:58 Substituting variable: ${bamboo.appium.nodeConfig} with ./nodes
command 12-Dec-2018 17:16:58 Substituting variable: ${bamboo.devices.gandalf.name} with gandalfipad
command 12-Dec-2018 17:16:58 Substituting variable: ${bamboo.appium.logs} with /Users/svctest/appium/logs
command 12-Dec-2018 17:16:58 Substituting variable: ${bamboo.buildResultKey} with AT-MTV179-GANN-25
command 12-Dec-2018 17:16:58 Substituting variable: ${bamboo.devices.gandalf.name} with gandalfipad
command 12-Dec-2018 17:16:58 Substituting variable: ${bamboo.testuser} with svctest
simple 12-Dec-2018 17:16:58 Starting task 'Start appium' of type 'com.atlassian.bamboo.plugins.bamboo-scp-plugin:sshtask'
simple 12-Dec-2018 17:16:58 Connecting to qa01.avirat.net on port: 22
simple 12-Dec-2018 17:16:58 Executing [
simple 12-Dec-2018 17:16:58 PATH=$PATH:/usr/local/bin
simple 12-Dec-2018 17:16:58 cd /Users/svctest/appium
simple 12-Dec-2018 17:16:58 nohup ./node_modules/appium/build/lib/main.js -p 4741 --tmp /tmp/appium/gandalfipad --nodeconfig ./nodes/gandalfipad.json &> /Users/svctest/appium/logs/AT-MTV179-GANN-25-gandalfipad.log &
simple 12-Dec-2018 17:16:58 ]
simple 12-Dec-2018 17:16:58 [
simple 12-Dec-2018 17:16:58 PATH=$PATH:/usr/local/bin
simple 12-Dec-2018 17:16:58 cd /Users/svctest/appium
simple 12-Dec-2018 17:16:58 nohup ./node_modules/appium/build/lib/main.js -p 4741 --tmp /tmp/appium/gandalfipad --nodeconfig ./nodes/gandalfipad.json &> /Users/svctest/appium/logs/AT-MTV179-GANN-25-gandalfipad.log &
simple 12-Dec-2018 17:16:58 ] has finished.
simple 12-Dec-2018 17:16:58 Result: exit code = 0
simple 12-Dec-2018 17:16:58 Finished task 'Start appium' with result: Success
command 12-Dec-2018 17:16:58 Substituting variable: ${bamboo.appium.node} with 10.57.85.10
command 12-Dec-2018 17:16:58 Substituting variable: ${bamboo.devices.gandalf.port} with 4741
simple 12-Dec-2018 17:16:58 Starting task 'Wait for appium grid registration' of type 'com.atlassian.bamboo.plugins.scripttask:task.builder.script'
command 12-Dec-2018 17:16:58 Beginning to execute external process for build 'Automation Tests - QA - Parent Portal iOS Tests CI - newAppiumTry - Gandalf #25 (AT-MTV179-GANN-25)'\n ... running command line: \n/bin/sh /root/bamboo-agent-home/temp/AT-MTV179-GANN-25-ScriptBuildTask-6646451731049296705.sh\n ... in: /root/bamboo-agent-home/xml-data/build-dir/AT-MTV179-GANN\n ... using extra environment variables: \nbamboo_planRepository_1_branch=newAppiumTry\nbamboo_planRepository_2_branch=master\nbamboo_planRepository_1_branchDisplayName=newAppiumTry\nbamboo_repository_revision_number=e5c9ab2ff369341c3155cccdbce5ee5b49b66d28\nbamboo_jira_password=********\nbamboo_buildKey=AT-MTV179-GANN\nbamboo_devices_gandalf_udid=48527f94911a9d6cd0cf1c98fc92061021b5f15c\nbamboo_repository_56787397_git_branch=newAppiumTry\nbamboo_appium_temp=/tmp/appium\nbamboo_planRepository_2_branchDisplayName=master\nbamboo_shortJobName=Gandalf\nbamboo_buildResultsUrl=https://bamboo.avirat.net/browse/AT-MTV179-GANN-25\nbamboo_planRepository_repositoryUrl=ssh://git@bitbucket.avirat.net:7999/ofw/ofw-mobilev2-qa.git\nbamboo_agentId=57114846\nbamboo_devices_radagast_name=radagastiphone7\nbamboo_capability_phase=func\nbamboo_planRepository_revision=e5c9ab2ff369341c3155cccdbce5ee5b49b66d28\nbamboo_appium_logs=/Users/svctest/appium/logs\nbamboo_portal=QA iOS Mobilev2\nbamboo_devices_radagast_port=4742\nbamboo_capability_env=func\nbamboo_planRepository_previousRevision=78802119837004c1dd6b47def00d2ce40ada778c\nbamboo_repository_branch_name=newAppiumTry\nbamboo_grid_host=qa-docker02.avirat.net\nbamboo_capability_remote_agent=True\nbamboo_repository_56787397_branch_name=newAppiumTry\nbamboo_cucumber_options=--monochrome --plugin pretty --plugin junit:target/test-report.xml --plugin html:target/cucumber-report/cucumber.html --plugin json:target/cucumber-report/cucumber.json --tags ~@ignore --tags @appiumTest\nbamboo_repository_51150856_git_username=\nbamboo_repository_56787397_name=Mobilev2-qa\nbamboo_dependenciesDisabled=false\nbamboo_capability_build_agent=true\nbamboo_repository_56787397_previous_revision_number=78802119837004c1dd6b47def00d2ce40ada778c\nbamboo_planRepository_branch=newAppiumTry\nbamboo_devices_merlin_port=4740\nbamboo_devices_saruman_udid=699d7b2b6003d9920dbb6cae7e4317de26b796b4\nbamboo_planRepository_1_type=bbserver\nbamboo_planRepository_branchName=newAppiumTry\nbamboo_devices_merlin_name=merliniphone6s\nbamboo_repository_56787397_git_username=\nbamboo_capability_system_builderivy_Ivy=/usr/share/ant\nbamboo_capability_system_jdk_JDK=/usr/lib/jvm/java-8-oracle\nbamboo_COMPOSE_HTTP_TIMEOUT=300\nbamboo_capability_system_builder_gradle_Gradle=/usr/share/gradle\nbamboo_planRepository_1_username=\nbamboo_planRepository_type=bbserver\nbamboo_ManualBuildTriggerReason_userName=cyoung\nbamboo_planRepository_2_branchName=master\nbamboo_capability_system_builder_node_Node_js=/usr/bin/node\nbamboo_dockerProject=qa-mobile-grid\nbamboo_capability_docker_compose_version=1.16.1\nbamboo_capability_system_builder_ant_Ant=/usr/share/ant\nbamboo_capability_system_builder_mvn3_Maven_3=/usr/share/maven\nbamboo_planKey=AT-MTV179\nbamboo_planRepository_username=\nbamboo_repository_51150856_branch_name=master\nbamboo_ios_app_path=/Users/svctest/appium/mobilev2app/iOS_Automation_Build119/OFWTapQA.ipa\nbamboo_repository_51150856_previous_revision_number=9d316208bb231ad73ef762a3e9191203438aed30\nbamboo_planRepository_1_branchName=newAppiumTry\nbamboo_capability_system_builder_maven_Artifactory_Maven_3=/usr/share/maven\nbamboo_resultsUrl=https://bamboo.avirat.net/browse/AT-MTV179-GANN-25\nbamboo_build_working_directory=/root/bamboo-agent-home/xml-data/build-dir/AT-MTV179-GANN\nbamboo_planRepository_1_name=Mobilev2-qa\nbamboo_capability_system_builder_command_Docker_Compose=/usr/local/bin/docker-compose\nbamboo_jira_username=qaimac\nbamboo_shortPlanName=newAppiumTry\nbamboo_planRepository_2_username=\nbamboo_planRepository_name=Mobilev2-qa\nbamboo_buildNumber=25\nbamboo_repository_51150856_git_branch=master\nbamboo_testuser=svctest\nbamboo_planName=Automation Tests - QA - Parent Portal iOS Tests CI - newAppiumTry\nbamboo_docker_service_name=mobilev2iOSGrid\nbamboo_shortPlanKey=MTV179\nbamboo_repository_56787397_git_repositoryUrl=ssh://git@bitbucket.avirat.net:7999/ofw/ofw-mobilev2-qa.git\nbamboo_shortJobKey=GANN\nbamboo_planRepository_2_name=ofw-zephyr-qa\nbamboo_repository_51150856_revision_number=9d316208bb231ad73ef762a3e9191203438aed30\nbamboo_buildTimeStamp=2018-12-12T17:16:57.843Z\nbamboo_repository_previous_revision_number=78802119837004c1dd6b47def00d2ce40ada778c\nbamboo_capability_system_builder_mvn2_Maven_2=/usr/share/maven2\nbamboo_devices_radagast_udid=88153e130154876994e7e3e5b3049a512e1d419f\nbamboo_repository_git_branch=newAppiumTry\nbamboo_buildResultKey=AT-MTV179-GANN-25\nbamboo_appium_binary=./node_modules/appium/build/lib/main.js\nbamboo_buildPlanName=Automation Tests - QA - Parent Portal iOS Tests CI - newAppiumTry - Gandalf\nbamboo_appium_nodeConfig=./nodes\nbamboo_capability_docker_version=17.06.2-ce\nbamboo_planRepository_1_revision=e5c9ab2ff369341c3155cccdbce5ee5b49b66d28\nbamboo_capability_system_hg_executable=/usr/bin/hg\nbamboo_repository_name=ofw-zephyr-qa\nbamboo_planRepository_2_previousRevision=9d316208bb231ad73ef762a3e9191203438aed30\nbamboo_repository_51150856_git_repositoryUrl=ssh://git@bitbucket.avirat.net:7999/ofw/ofw-zephyr-qa.git\nbamboo_appium_path=/Users/svctest/appium\nbamboo_devices_merlin_udid=7acdca75f205d22e2d6eb3194a9b5def4966b529\nbamboo_buildFailed=false\nbamboo_capability_system_jdk_JDK_1_8_0_191=/usr/lib/jvm/java-8-oracle\nbamboo_capability_system_docker_executable=/usr/bin/docker\nbamboo_grid_url=http://qa-docker02.avirat.net:4450/wd/hub\nbamboo_agentWorkingDirectory=/root/bamboo-agent-home/xml-data/build-dir\nbamboo_planRepository_2_revision=9d316208bb231ad73ef762a3e9191203438aed30\nbamboo_capability_system_git_executable=/usr/bin/git\nbamboo_repository_git_username=\nbamboo_planRepository_1_previousRevision=78802119837004c1dd6b47def00d2ce40ada778c\nbamboo_planRepository_branchDisplayName=newAppiumTry\nbamboo_repository_51150856_name=ofw-zephyr-qa\nbamboo_planRepository_2_type=bbserver\nbamboo_appium_node=10.57.85.10\nbamboo_plan_storageTag=plan-56592529\nbamboo_planRepository_2_repositoryUrl=ssh://git@bitbucket.avirat.net:7999/ofw/ofw-zephyr-qa.git\nbamboo_repository_git_repositoryUrl=ssh://git@bitbucket.avirat.net:7999/ofw/ofw-mobilev2-qa.git\nbamboo_working_directory=/root/bamboo-agent-home/xml-data/build-dir/AT-MTV179-GANN\nbamboo_devices_saruman_port=4743\nbamboo_planRepository_1_repositoryUrl=ssh://git@bitbucket.avirat.net:7999/ofw/ofw-mobilev2-qa.git\nbamboo_repository_56787397_revision_number=e5c9ab2ff369341c3155cccdbce5ee5b49b66d28\nbamboo_devices_gandalf_name=gandalfipad\nbamboo_capability_system_jdk_JDK_1_8=/usr/lib/jvm/java-8-oracle\nbamboo_capability_system_jdk_JDK_1_7=/usr/lib/jvm/java-7-openjdk-amd64\nbamboo_devices_gandalf_port=4741\nbamboo_devices_saruman_name=sarumanipadmini4\n
build 12-Dec-2018 17:16:58 Waiting for response from appium...
build 12-Dec-2018 17:17:03 Node online.
simple 12-Dec-2018 17:17:03 Finished task 'Wait for appium grid registration' with result: Success
command 12-Dec-2018 17:17:03 Substituting variable: ${bamboo.cucumber.options} with --monochrome --plugin pretty --plugin junit:target/test-report.xml --plugin html:target/cucumber-report/cucumber.html --plugin json:target/cucumber-report/cucumber.json --tags ~@ignore --tags @appiumTest
command 12-Dec-2018 17:17:03 Substituting variable: ${bamboo.grid.url} with http://qa-docker02.avirat.net:4450/wd/hub
command 12-Dec-2018 17:17:03 Substituting variable: ${bamboo.ios.app.path} with /Users/svctest/appium/mobilev2app/iOS_Automation_Build119/OFWTapQA.ipa
simple 12-Dec-2018 17:17:03 Starting task 'Run Tests' of type 'com.atlassian.bamboo.plugins.scripttask:task.builder.script'
command 12-Dec-2018 17:17:03 Beginning to execute external process for build 'Automation Tests - QA - Parent Portal iOS Tests CI - newAppiumTry - Gandalf #25 (AT-MTV179-GANN-25)'\n ... running command line: \n/bin/sh /root/bamboo-agent-home/temp/AT-MTV179-GANN-25-ScriptBuildTask-5810066920641574999.sh\n ... in: /root/bamboo-agent-home/xml-data/build-dir/AT-MTV179-GANN\n ... using extra environment variables: \nbamboo_planRepository_1_branch=newAppiumTry\nbamboo_planRepository_2_branch=master\nbamboo_build_commandline_com_atlassian_bamboo_plugins_scripttask_task_builder_script_10=/bin/sh /root/bamboo-agent-home/temp/AT-MTV179-GANN-25-ScriptBuildTask-6646451731049296705.sh\nbamboo_planRepository_1_branchDisplayName=newAppiumTry\nbamboo_repository_revision_number=e5c9ab2ff369341c3155cccdbce5ee5b49b66d28\nbamboo_jira_password=********\nbamboo_buildKey=AT-MTV179-GANN\nbamboo_devices_gandalf_udid=48527f94911a9d6cd0cf1c98fc92061021b5f15c\nbamboo_repository_56787397_git_branch=newAppiumTry\nbamboo_appium_temp=/tmp/appium\nbamboo_planRepository_2_branchDisplayName=master\nbamboo_shortJobName=Gandalf\nbamboo_buildResultsUrl=https://bamboo.avirat.net/browse/AT-MTV179-GANN-25\nbamboo_planRepository_repositoryUrl=ssh://git@bitbucket.avirat.net:7999/ofw/ofw-mobilev2-qa.git\nbamboo_agentId=57114846\nbamboo_devices_radagast_name=radagastiphone7\nbamboo_capability_phase=func\nbamboo_planRepository_revision=e5c9ab2ff369341c3155cccdbce5ee5b49b66d28\nbamboo_appium_logs=/Users/svctest/appium/logs\nbamboo_portal=QA iOS Mobilev2\nbamboo_devices_radagast_port=4742\nbamboo_capability_env=func\nbamboo_planRepository_previousRevision=78802119837004c1dd6b47def00d2ce40ada778c\nbamboo_repository_branch_name=newAppiumTry\nbamboo_grid_host=qa-docker02.avirat.net\nbamboo_capability_remote_agent=True\nbamboo_repository_56787397_branch_name=newAppiumTry\nbamboo_cucumber_options=--monochrome --plugin pretty --plugin junit:target/test-report.xml --plugin html:target/cucumber-report/cucumber.html --plugin json:target/cucumber-report/cucumber.json --tags ~@ignore --tags @appiumTest\nbamboo_repository_51150856_git_username=\nbamboo_repository_56787397_name=Mobilev2-qa\nbamboo_dependenciesDisabled=false\nbamboo_capability_build_agent=true\nbamboo_repository_56787397_previous_revision_number=78802119837004c1dd6b47def00d2ce40ada778c\nbamboo_planRepository_branch=newAppiumTry\nbamboo_devices_merlin_port=4740\nbamboo_devices_saruman_udid=699d7b2b6003d9920dbb6cae7e4317de26b796b4\nbamboo_planRepository_1_type=bbserver\nbamboo_planRepository_branchName=newAppiumTry\nbamboo_devices_merlin_name=merliniphone6s\nbamboo_repository_56787397_git_username=\nbamboo_capability_system_builderivy_Ivy=/usr/share/ant\nbamboo_capability_system_jdk_JDK=/usr/lib/jvm/java-8-oracle\nbamboo_COMPOSE_HTTP_TIMEOUT=300\nbamboo_capability_system_builder_gradle_Gradle=/usr/share/gradle\nbamboo_planRepository_1_username=\nbamboo_planRepository_type=bbserver\nbamboo_ManualBuildTriggerReason_userName=cyoung\nbamboo_planRepository_2_branchName=master\nbamboo_capability_system_builder_node_Node_js=/usr/bin/node\nbamboo_dockerProject=qa-mobile-grid\nbamboo_capability_docker_compose_version=1.16.1\nbamboo_capability_system_builder_ant_Ant=/usr/share/ant\nbamboo_capability_system_builder_mvn3_Maven_3=/usr/share/maven\nbamboo_planKey=AT-MTV179\nbamboo_planRepository_username=\nbamboo_repository_51150856_branch_name=master\nbamboo_ios_app_path=/Users/svctest/appium/mobilev2app/iOS_Automation_Build119/OFWTapQA.ipa\nbamboo_repository_51150856_previous_revision_number=9d316208bb231ad73ef762a3e9191203438aed30\nbamboo_planRepository_1_branchName=newAppiumTry\nbamboo_capability_system_builder_maven_Artifactory_Maven_3=/usr/share/maven\nbamboo_resultsUrl=https://bamboo.avirat.net/browse/AT-MTV179-GANN-25\nbamboo_build_working_directory=/root/bamboo-agent-home/xml-data/build-dir/AT-MTV179-GANN\nbamboo_planRepository_1_name=Mobilev2-qa\nbamboo_capability_system_builder_command_Docker_Compose=/usr/local/bin/docker-compose\nbamboo_jira_username=qaimac\nbamboo_shortPlanName=newAppiumTry\nbamboo_planRepository_2_username=\nbamboo_planRepository_name=Mobilev2-qa\nbamboo_buildNumber=25\nbamboo_repository_51150856_git_branch=master\nbamboo_testuser=svctest\nbamboo_planName=Automation Tests - QA - Parent Portal iOS Tests CI - newAppiumTry\nbamboo_docker_service_name=mobilev2iOSGrid\nbamboo_shortPlanKey=MTV179\nbamboo_repository_56787397_git_repositoryUrl=ssh://git@bitbucket.avirat.net:7999/ofw/ofw-mobilev2-qa.git\nbamboo_shortJobKey=GANN\nbamboo_planRepository_2_name=ofw-zephyr-qa\nbamboo_repository_51150856_revision_number=9d316208bb231ad73ef762a3e9191203438aed30\nbamboo_buildTimeStamp=2018-12-12T17:16:57.843Z\nbamboo_repository_previous_revision_number=78802119837004c1dd6b47def00d2ce40ada778c\nbamboo_capability_system_builder_mvn2_Maven_2=/usr/share/maven2\nbamboo_devices_radagast_udid=88153e130154876994e7e3e5b3049a512e1d419f\nbamboo_repository_git_branch=newAppiumTry\nbamboo_buildResultKey=AT-MTV179-GANN-25\nbamboo_appium_binary=./node_modules/appium/build/lib/main.js\nbamboo_buildPlanName=Automation Tests - QA - Parent Portal iOS Tests CI - newAppiumTry - Gandalf\nbamboo_appium_nodeConfig=./nodes\nbamboo_capability_docker_version=17.06.2-ce\nbamboo_planRepository_1_revision=e5c9ab2ff369341c3155cccdbce5ee5b49b66d28\nbamboo_capability_system_hg_executable=/usr/bin/hg\nbamboo_repository_name=ofw-zephyr-qa\nbamboo_planRepository_2_previousRevision=9d316208bb231ad73ef762a3e9191203438aed30\nbamboo_repository_51150856_git_repositoryUrl=ssh://git@bitbucket.avirat.net:7999/ofw/ofw-zephyr-qa.git\nbamboo_appium_path=/Users/svctest/appium\nbamboo_devices_merlin_udid=7acdca75f205d22e2d6eb3194a9b5def4966b529\nbamboo_buildFailed=false\nbamboo_capability_system_jdk_JDK_1_8_0_191=/usr/lib/jvm/java-8-oracle\nbamboo_capability_system_docker_executable=/usr/bin/docker\nbamboo_grid_url=http://qa-docker02.avirat.net:4450/wd/hub\nbamboo_agentWorkingDirectory=/root/bamboo-agent-home/xml-data/build-dir\nbamboo_planRepository_2_revision=9d316208bb231ad73ef762a3e9191203438aed30\nbamboo_capability_system_git_executable=/usr/bin/git\nbamboo_repository_git_username=\nbamboo_planRepository_1_previousRevision=78802119837004c1dd6b47def00d2ce40ada778c\nbamboo_planRepository_branchDisplayName=newAppiumTry\nbamboo_repository_51150856_name=ofw-zephyr-qa\nbamboo_planRepository_2_type=bbserver\nbamboo_appium_node=10.57.85.10\nbamboo_plan_storageTag=plan-56592529\nbamboo_planRepository_2_repositoryUrl=ssh://git@bitbucket.avirat.net:7999/ofw/ofw-zephyr-qa.git\nbamboo_repository_git_repositoryUrl=ssh://git@bitbucket.avirat.net:7999/ofw/ofw-mobilev2-qa.git\nbamboo_working_directory=/root/bamboo-agent-home/xml-data/build-dir/AT-MTV179-GANN\nbamboo_devices_saruman_port=4743\nbamboo_planRepository_1_repositoryUrl=ssh://git@bitbucket.avirat.net:7999/ofw/ofw-mobilev2-qa.git\nbamboo_repository_56787397_revision_number=e5c9ab2ff369341c3155cccdbce5ee5b49b66d28\nbamboo_devices_gandalf_name=gandalfipad\nbamboo_capability_system_jdk_JDK_1_8=/usr/lib/jvm/java-8-oracle\nbamboo_capability_system_jdk_JDK_1_7=/usr/lib/jvm/java-7-openjdk-amd64\nbamboo_devices_gandalf_port=4741\nbamboo_devices_saruman_name=sarumanipadmini4\n
error 12-Dec-2018 17:17:03 java version "1.8.0_191"
error 12-Dec-2018 17:17:03 Java(TM) SE Runtime Environment (build 1.8.0_191-b12)
error 12-Dec-2018 17:17:03 Java HotSpot(TM) 64-Bit Server VM (build 25.191-b12, mixed mode)
build 12-Dec-2018 17:17:07 [buildinfo] Not using buildInfo properties file for this build.
build 12-Dec-2018 17:17:07 > Task :clean UP-TO-DATE
build 12-Dec-2018 17:17:08
build 12-Dec-2018 17:17:08 > Task :compileJava
error 12-Dec-2018 17:17:08 Note: /root/bamboo-agent-home/xml-data/build-dir/AT-MTV179-GANN/src/main/java/cucumber/client/ScreenObject.java uses or overrides a deprecated API.
error 12-Dec-2018 17:17:08 Note: Recompile with -Xlint:deprecation for details.
error 12-Dec-2018 17:17:08 Note: /root/bamboo-agent-home/xml-data/build-dir/AT-MTV179-GANN/src/main/java/cucumber/client/ScreenObject.java uses unchecked or unsafe operations.
error 12-Dec-2018 17:17:08 Note: Recompile with -Xlint:unchecked for details.
build 12-Dec-2018 17:17:08
build 12-Dec-2018 17:17:08 > Task :processResources NO-SOURCE
build 12-Dec-2018 17:17:08 > Task :classes
build 12-Dec-2018 17:17:08 > Task :jar
build 12-Dec-2018 17:17:08 > Task :assemble
build 12-Dec-2018 17:17:09 > Task :compileTestJava
build 12-Dec-2018 17:17:09 > Task :processTestResources
build 12-Dec-2018 17:17:09 > Task :testClasses
build 12-Dec-2018 17:17:11
build 12-Dec-2018 17:17:11 > Task :test
build 12-Dec-2018 17:17:11 Feature: Journal
build 12-Dec-2018 17:17:11 Couldn't create driver, retrying...
build 12-Dec-2018 17:17:12 Couldn't create driver, retrying...
build 12-Dec-2018 17:17:14 Couldn't create driver, retrying...
build 12-Dec-2018 17:17:16 Couldn't create driver, retrying...
build 12-Dec-2018 17:17:18 Couldn't create driver, retrying...
build 12-Dec-2018 17:17:20 Failure in before hook:Hooks.beforeScenario()
build 12-Dec-2018 17:17:20 Message: org.openqa.selenium.WebDriverException: It is impossible to create a new session because 'createSession' which takes HttpClient, InputStream and long was not found or it is not accessible
build 12-Dec-2018 17:17:20 Build info: version: '3.13.0', revision: '2f0d292', time: '2018-06-25T15:24:21.231Z'
build 12-Dec-2018 17:17:20 System info: host: 'c69e564deef1', ip: '10.0.21.13', os.name: 'Linux', os.arch: 'amd64', os.version: '3.10.0-862.3.2.el7.x86_64', java.version: '1.8.0_191'
build 12-Dec-2018 17:17:20 Driver info: driver.version: IOSDriver
build 12-Dec-2018 17:17:20 at io.appium.java_client.remote.AppiumCommandExecutor$1.createSession(AppiumCommandExecutor.java:195)
build 12-Dec-2018 17:17:20 at io.appium.java_client.remote.AppiumCommandExecutor.createSession(AppiumCommandExecutor.java:209)
build 12-Dec-2018 17:17:20 at io.appium.java_client.remote.AppiumCommandExecutor.execute(AppiumCommandExecutor.java:231)
build 12-Dec-2018 17:17:20 at org.openqa.selenium.remote.RemoteWebDriver.execute(RemoteWebDriver.java:548)
build 12-Dec-2018 17:17:20 at io.appium.java_client.DefaultGenericMobileDriver.execute(DefaultGenericMobileDriver.java:42)
build 12-Dec-2018 17:17:20 at io.appium.java_client.AppiumDriver.execute(AppiumDriver.java:1)
build 12-Dec-2018 17:17:20 at io.appium.java_client.ios.IOSDriver.execute(IOSDriver.java:1)
build 12-Dec-2018 17:17:20 at org.openqa.selenium.remote.RemoteWebDriver.startSession(RemoteWebDriver.java:212)
build 12-Dec-2018 17:17:20 at org.openqa.selenium.remote.RemoteWebDriver.<init>(RemoteWebDriver.java:130)
build 12-Dec-2018 17:17:20 at io.appium.java_client.DefaultGenericMobileDriver.<init>(DefaultGenericMobileDriver.java:38)
build 12-Dec-2018 17:17:20 at io.appium.java_client.AppiumDriver.<init>(AppiumDriver.java:84)
build 12-Dec-2018 17:17:20 at io.appium.java_client.AppiumDriver.<init>(AppiumDriver.java:94)
build 12-Dec-2018 17:17:20 at io.appium.java_client.ios.IOSDriver.<init>(IOSDriver.java:95)
build 12-Dec-2018 17:17:20 at cucumber.driver.Factory.createPlatformDriver(Factory.java:54)
build 12-Dec-2018 17:17:20 at cucumber.driver.Factory.createDriverWithLatestAppBuild(Factory.java:36)
build 12-Dec-2018 17:17:20 at cucumber.driver.Factory.createDriverWithApp(Factory.java:31)
build 12-Dec-2018 17:17:20 at cucumber.support.Hooks.beforeScenario(Hooks.java:55)
build 12-Dec-2018 17:17:20 at sun.reflect.NativeMethodAccessorImpl.invoke0(Native Method)
build 12-Dec-2018 17:17:20 at sun.reflect.NativeMethodAccessorImpl.invoke(NativeMethodAccessorImpl.java:62)
build 12-Dec-2018 17:17:20 at sun.reflect.DelegatingMethodAccessorImpl.invoke(DelegatingMethodAccessorImpl.java:43)
build 12-Dec-2018 17:17:20 at java.lang.reflect.Method.invoke(Method.java:498)
build 12-Dec-2018 17:17:20 at cucumber.runtime.Utils$1.call(Utils.java:40)
build 12-Dec-2018 17:17:20 at cucumber.runtime.Timeout.timeout(Timeout.java:16)
build 12-Dec-2018 17:17:20 at cucumber.runtime.Utils.invoke(Utils.java:34)
build 12-Dec-2018 17:17:20 at cucumber.runtime.java.JavaHookDefinition.execute(JavaHookDefinition.java:60)
build 12-Dec-2018 17:17:20 at cucumber.runtime.Runtime.runHookIfTagsMatch(Runtime.java:224)
build 12-Dec-2018 17:17:20 at cucumber.runtime.Runtime.runHooks(Runtime.java:212)
build 12-Dec-2018 17:17:20 at cucumber.runtime.Runtime.runBeforeHooks(Runtime.java:202)
build 12-Dec-2018 17:17:20 at cucumber.runtime.model.CucumberScenario.run(CucumberScenario.java:40)
build 12-Dec-2018 17:17:20 at cucumber.runtime.model.CucumberFeature.run(CucumberFeature.java:165)
build 12-Dec-2018 17:17:20 at cucumber.runtime.Runtime.run(Runtime.java:122)
build 12-Dec-2018 17:17:20 at cucumber.api.cli.Main.run(Main.java:36)
build 12-Dec-2018 17:17:20 at cucumber.api.cli.Main.main(Main.java:18)
build 12-Dec-2018 17:17:20 Caused by: java.lang.reflect.InvocationTargetException
build 12-Dec-2018 17:17:20 at sun.reflect.NativeMethodAccessorImpl.invoke0(Native Method)
build 12-Dec-2018 17:17:20 at sun.reflect.NativeMethodAccessorImpl.invoke(NativeMethodAccessorImpl.java:62)
build 12-Dec-2018 17:17:20 at sun.reflect.DelegatingMethodAccessorImpl.invoke(DelegatingMethodAccessorImpl.java:43)
build 12-Dec-2018 17:17:20 at java.lang.reflect.Method.invoke(Method.java:498)
build 12-Dec-2018 17:17:20 at io.appium.java_client.remote.AppiumCommandExecutor$1.createSession(AppiumCommandExecutor.java:185)
build 12-Dec-2018 17:17:20 ... 32 more
build 12-Dec-2018 17:17:20 Caused by: org.openqa.selenium.WebDriverException: Unable to parse remote response: <html>
build 12-Dec-2018 17:17:20 <head>
build 12-Dec-2018 17:17:20 <meta http-equiv="Content-Type" content="text/html;charset=utf-8"/>
build 12-Dec-2018 17:17:20 <title>Error 500 Server Error</title>
build 12-Dec-2018 17:17:20 </head>
build 12-Dec-2018 17:17:20 <body><h2>HTTP ERROR 500</h2>
build 12-Dec-2018 17:17:20 <p>Problem accessing /wd/hub/session. Reason:
build 12-Dec-2018 17:17:20 <pre> Server Error</pre></p><h3>Caused by:</h3><pre>java.io.IOException: org.openqa.grid.common.exception.GridException: Cannot extract a capabilities from the request: {
build 12-Dec-2018 17:17:20 &quot;desiredCapabilities&quot;: {
build 12-Dec-2018 17:17:20 &quot;app&quot;: &quot;\u002fUsers\u002fsvctest\u002fappium\u002fmobilev2app\u002fiOS_Automation_Build119\u002fOFWTapQA.ipa&quot;,
build 12-Dec-2018 17:17:20 &quot;showIOSLog&quot;: true,
build 12-Dec-2018 17:17:20 &quot;newCommandTimeout&quot;: 10000,
build 12-Dec-2018 17:17:20 &quot;platformVersion&quot;: &quot;12.1&quot;,
build 12-Dec-2018 17:17:20 &quot;xcodeOrgId&quot;: &quot;66Y9F4A25A&quot;,
build 12-Dec-2018 17:17:20 &quot;automationName&quot;: &quot;XCUITest&quot;,
build 12-Dec-2018 17:17:20 &quot;platformName&quot;: &quot;iOS&quot;,
build 12-Dec-2018 17:17:20 &quot;udid&quot;: &quot;48527f94911a9d6cd0cf1c98fc92061021b5f15c&quot;,
build 12-Dec-2018 17:17:20 &quot;deviceName&quot;: &quot;Gandalf iPad&quot;,
build 12-Dec-2018 17:17:20 &quot;platform&quot;: &quot;MAC&quot;,
build 12-Dec-2018 17:17:20 &quot;xcodeSigningId&quot;: &quot;iPhone Developer&quot;
build 12-Dec-2018 17:17:20 },
build 12-Dec-2018 17:17:20 &quot;capabilities&quot;: {
build 12-Dec-2018 17:17:20 &quot;alwaysMatch&quot;: {
build 12-Dec-2018 17:17:20 &quot;appium:app&quot;: &quot;\u002fUsers\u002fsvctest\u002fappium\u002fmobilev2app\u002fiOS_Automation_Build119\u002fOFWTapQA.ipa&quot;,
build 12-Dec-2018 17:17:20 &quot;appium:automationName&quot;: &quot;XCUITest&quot;,
build 12-Dec-2018 17:17:20 &quot;appium:deviceName&quot;: &quot;Gandalf iPad&quot;,
build 12-Dec-2018 17:17:20 &quot;appium:newCommandTimeout&quot;: 10000,
build 12-Dec-2018 17:17:20 &quot;platform&quot;: &quot;MAC&quot;,
build 12-Dec-2018 17:17:20 &quot;platformName&quot;: &quot;ios&quot;,
build 12-Dec-2018 17:17:20 &quot;appium:platformVersion&quot;: &quot;12.1&quot;,
build 12-Dec-2018 17:17:20 &quot;appium:showIOSLog&quot;: true,
build 12-Dec-2018 17:17:20 &quot;appium:udid&quot;: &quot;48527f94911a9d6cd0cf1c98fc92061021b5f15c&quot;,
build 12-Dec-2018 17:17:20 &quot;appium:xcodeOrgId&quot;: &quot;66Y9F4A25A&quot;,
build 12-Dec-2018 17:17:20 &quot;appium:xcodeSigningId&quot;: &quot;iPhone Developer&quot;
build 12-Dec-2018 17:17:20 },
build 12-Dec-2018 17:17:20 &quot;firstMatch&quot;: [
build 12-Dec-2018 17:17:20 {
build 12-Dec-2018 17:17:20 }
build 12-Dec-2018 17:17:20 ]
build 12-Dec-2018 17:17:20 }
build 12-Dec-2018 17:17:20 }
build 12-Dec-2018 17:17:20 at org.openqa.grid.web.servlet.DriverServlet.process(DriverServlet.java:137)
build 12-Dec-2018 17:17:20 at org.openqa.grid.web.servlet.DriverServlet.doPost(DriverServlet.java:70)
build 12-Dec-2018 17:17:20 at javax.servlet.http.HttpServlet.service(HttpServlet.java:707)
build 12-Dec-2018 17:17:20 at javax.servlet.http.HttpServlet.service(HttpServlet.java:790)
build 12-Dec-2018 17:17:20 at org.seleniumhq.jetty9.servlet.ServletHolder.handle(ServletHolder.java:860)
build 12-Dec-2018 17:17:20 at org.seleniumhq.jetty9.servlet.ServletHandler.doHandle(ServletHandler.java:535)
build 12-Dec-2018 17:17:20 at org.seleniumhq.jetty9.server.handler.ScopedHandler.handle(ScopedHandler.java:143)
build 12-Dec-2018 17:17:20 at org.seleniumhq.jetty9.security.SecurityHandler.handle(SecurityHandler.java:548)
build 12-Dec-2018 17:17:20 at org.seleniumhq.jetty9.server.handler.HandlerWrapper.handle(HandlerWrapper.java:132)
build 12-Dec-2018 17:17:20 at org.seleniumhq.jetty9.server.handler.ScopedHandler.nextHandle(ScopedHandler.java:190)
build 12-Dec-2018 17:17:20 at org.seleniumhq.jetty9.server.session.SessionHandler.doHandle(SessionHandler.java:1595)
build 12-Dec-2018 17:17:20 at org.seleniumhq.jetty9.server.handler.ScopedHandler.nextHandle(ScopedHandler.java:188)
build 12-Dec-2018 17:17:20 at org.seleniumhq.jetty9.server.handler.ContextHandler.doHandle(ContextHandler.java:1253)
build 12-Dec-2018 17:17:20 at org.seleniumhq.jetty9.server.handler.ScopedHandler.nextScope(ScopedHandler.java:168)
build 12-Dec-2018 17:17:20 at org.seleniumhq.jetty9.servlet.ServletHandler.doScope(ServletHandler.java:473)
build 12-Dec-2018 17:17:20 at org.seleniumhq.jetty9.server.session.SessionHandler.doScope(SessionHandler.java:1564)
build 12-Dec-2018 17:17:20 at org.seleniumhq.jetty9.server.handler.ScopedHandler.nextScope(ScopedHandler.java:166)
build 12-Dec-2018 17:17:20 at org.seleniumhq.jetty9.server.handler.ContextHandler.doScope(ContextHandler.java:1155)
build 12-Dec-2018 17:17:20 at org.seleniumhq.jetty9.server.handler.ScopedHandler.handle(ScopedHandler.java:141)
build 12-Dec-2018 17:17:20 at org.seleniumhq.jetty9.server.handler.HandlerWrapper.handle(HandlerWrapper.java:132)
build 12-Dec-2018 17:17:20 at org.seleniumhq.jetty9.server.Server.handle(Server.java:530)
build 12-Dec-2018 17:17:20 at org.seleniumhq.jetty9.server.HttpChannel.handle(HttpChannel.java:347)
build 12-Dec-2018 17:17:20 at org.seleniumhq.jetty9.server.HttpConnection.onFillable(HttpConnection.java:256)
build 12-Dec-2018 17:17:20 at org.seleniumhq.jetty9.io.AbstractConnection$ReadCallback.succeeded(AbstractConnection.java:279)
build 12-Dec-2018 17:17:20 at org.seleniumhq.jetty9.io.FillInterest.fillable(FillInterest.java:102)
build 12-Dec-2018 17:17:20 at org.seleniumhq.jetty9.io.ChannelEndPoint$2.run(ChannelEndPoint.java:124)
build 12-Dec-2018 17:17:20 at org.seleniumhq.jetty9.util.thread.strategy.EatWhatYouKill.doProduce(EatWhatYouKill.java:247)
build 12-Dec-2018 17:17:20 at org.seleniumhq.jetty9.util.thread.strategy.EatWhatYouKill.produce(EatWhatYouKill.java:140)
build 12-Dec-2018 17:17:20 at org.seleniumhq.jetty9.util.thread.strategy.EatWhatYouKill.run(EatWhatYouKill.java:131)
build 12-Dec-2018 17:17:20 at org.seleniumhq.jetty9.util.thread.ReservedThreadExecutor$ReservedThread.run(ReservedThreadExecutor.java:382)
build 12-Dec-2018 17:17:20 at org.seleniumhq.jetty9.util.thread.QueuedThreadPool.runJob(QueuedThreadPool.java:708)
build 12-Dec-2018 17:17:20 at org.seleniumhq.jetty9.util.thread.QueuedThreadPool$2.run(QueuedThreadPool.java:626)
build 12-Dec-2018 17:17:20 at java.lang.Thread.run(Thread.java:748)
build 12-Dec-2018 17:17:20 Caused by: org.openqa.grid.common.exception.GridException: Cannot extract a capabilities from the request: {
build 12-Dec-2018 17:17:20 &quot;desiredCapabilities&quot;: {
build 12-Dec-2018 17:17:20 &quot;app&quot;: &quot;\u002fUsers\u002fsvctest\u002fappium\u002fmobilev2app\u002fiOS_Automation_Build119\u002fOFWTapQA.ipa&quot;,
build 12-Dec-2018 17:17:20 &quot;showIOSLog&quot;: true,
build 12-Dec-2018 17:17:20 &quot;newCommandTimeout&quot;: 10000,
build 12-Dec-2018 17:17:20 &quot;platformVersion&quot;: &quot;12.1&quot;,
build 12-Dec-2018 17:17:20 &quot;xcodeOrgId&quot;: &quot;66Y9F4A25A&quot;,
build 12-Dec-2018 17:17:20 &quot;automationName&quot;: &quot;XCUITest&quot;,
build 12-Dec-2018 17:17:20 &quot;platformName&quot;: &quot;iOS&quot;,
build 12-Dec-2018 17:17:20 &quot;udid&quot;: &quot;48527f94911a9d6cd0cf1c98fc92061021b5f15c&quot;,
build 12-Dec-2018 17:17:20 &quot;deviceName&quot;: &quot;Gandalf iPad&quot;,
build 12-Dec-2018 17:17:20 &quot;platform&quot;: &quot;MAC&quot;,
build 12-Dec-2018 17:17:20 &quot;xcodeSigningId&quot;: &quot;iPhone Developer&quot;
build 12-Dec-2018 17:17:20 },
build 12-Dec-2018 17:17:20 &quot;capabilities&quot;: {
build 12-Dec-2018 17:17:20 &quot;alwaysMatch&quot;: {
build 12-Dec-2018 17:17:20 &quot;appium:app&quot;: &quot;\u002fUsers\u002fsvctest\u002fappium\u002fmobilev2app\u002fiOS_Automation_Build119\u002fOFWTapQA.ipa&quot;,
build 12-Dec-2018 17:17:20 &quot;appium:automationName&quot;: &quot;XCUITest&quot;,
build 12-Dec-2018 17:17:20 &quot;appium:deviceName&quot;: &quot;Gandalf iPad&quot;,
build 12-Dec-2018 17:17:20 &quot;appium:newCommandTimeout&quot;: 10000,
build 12-Dec-2018 17:17:20 &quot;platform&quot;: &quot;MAC&quot;,
build 12-Dec-2018 17:17:20 &quot;platformName&quot;: &quot;ios&quot;,
build 12-Dec-2018 17:17:20 &quot;appium:platformVersion&quot;: &quot;12.1&quot;,
build 12-Dec-2018 17:17:20 &quot;appium:showIOSLog&quot;: true,
build 12-Dec-2018 17:17:20 &quot;appium:udid&quot;: &quot;48527f94911a9d6cd0cf1c98fc92061021b5f15c&quot;,
build 12-Dec-2018 17:17:20 &quot;appium:xcodeOrgId&quot;: &quot;66Y9F4A25A&quot;,
build 12-Dec-2018 17:17:20 &quot;appium:xcodeSigningId&quot;: &quot;iPhone Developer&quot;
build 12-Dec-2018 17:17:20 },
build 12-Dec-2018 17:17:20 &quot;firstMatch&quot;: [
build 12-Dec-2018 17:17:20 {
build 12-Dec-2018 17:17:20 }
build 12-Dec-2018 17:17:20 ]
build 12-Dec-2018 17:17:20 }
build 12-Dec-2018 17:17:20 }
build 12-Dec-2018 17:17:20 at org.openqa.grid.web.servlet.handler.WebDriverRequest.extractDesiredCapability(WebDriverRequest.java:76)
build 12-Dec-2018 17:17:20 at org.openqa.grid.web.servlet.handler.SeleniumBasedRequest.&lt;init&gt;(SeleniumBasedRequest.java:102)
build 12-Dec-2018 17:17:20 at org.openqa.grid.web.servlet.handler.WebDriverRequest.&lt;init&gt;(WebDriverRequest.java:36)
build 12-Dec-2018 17:17:20 at org.openqa.grid.web.servlet.handler.WebDriverRequestFactory.createFromRequest(WebDriverRequestFactory.java:30)
build 12-Dec-2018 17:17:20 at org.openqa.grid.web.servlet.handler.SeleniumBasedRequest.createFromRequest(SeleniumBasedRequest.java:73)
build 12-Dec-2018 17:17:20 at org.openqa.grid.web.servlet.DriverServlet.process(DriverServlet.java:84)
build 12-Dec-2018 17:17:20 ... 32 more
build 12-Dec-2018 17:17:20 Caused by: java.lang.IllegalArgumentException: Illegal key values seen in w3c capabilities: [platform]
build 12-Dec-2018 17:17:20 at org.openqa.selenium.remote.NewSessionPayload.lambda$validate$5(NewSessionPayload.java:197)
build 12-Dec-2018 17:17:20 at java.util.stream.ReferencePipeline$11$1.accept(ReferencePipeline.java:372)
build 12-Dec-2018 17:17:20 at java.util.stream.ReferencePipeline$11$1.accept(ReferencePipeline.java:373)
build 12-Dec-2018 17:17:20 at java.util.stream.ReferencePipeline$3$1.accept(ReferencePipeline.java:193)
build 12-Dec-2018 17:17:20 at java.util.stream.ReferencePipeline$11$1.accept(ReferencePipeline.java:373)
build 12-Dec-2018 17:17:20 at java.util.ArrayList$ArrayListSpliterator.forEachRemaining(ArrayList.java:1382)
build 12-Dec-2018 17:17:20 at java.util.stream.AbstractPipeline.copyInto(AbstractPipeline.java:481)
build 12-Dec-2018 17:17:20 at java.util.stream.AbstractPipeline.wrapAndCopyInto(AbstractPipeline.java:471)
build 12-Dec-2018 17:17:20 at java.util.stream.ForEachOps$ForEachOp.evaluateSequential(ForEachOps.java:151)
build 12-Dec-2018 17:17:20 at java.util.stream.ForEachOps$ForEachOp$OfRef.evaluateSequential(ForEachOps.java:174)
build 12-Dec-2018 17:17:20 at java.util.stream.AbstractPipeline.evaluate(AbstractPipeline.java:234)
build 12-Dec-2018 17:17:20 at java.util.stream.ReferencePipeline.forEach(ReferencePipeline.java:418)
build 12-Dec-2018 17:17:20 at org.openqa.selenium.remote.NewSessionPayload.validate(NewSessionPayload.java:201)
build 12-Dec-2018 17:17:20 at org.openqa.selenium.remote.NewSessionPayload.&lt;init&gt;(NewSessionPayload.java:149)
build 12-Dec-2018 17:17:20 at org.openqa.selenium.remote.NewSessionPayload.create(NewSessionPayload.java:104)
build 12-Dec-2018 17:17:20 at org.openqa.grid.web.servlet.handler.WebDriverRequest.extractDesiredCapability(WebDriverRequest.java:66)
build 12-Dec-2018 17:17:20 ... 37 more
build 12-Dec-2018 17:17:20 </pre>
build 12-Dec-2018 17:17:20 <h3>Caused by:</h3><pre>org.openqa.grid.common.exception.GridException: Cannot extract a capabilities from the request: {
build 12-Dec-2018 17:17:20 &quot;desiredCapabilities&quot;: {
build 12-Dec-2018 17:17:20 &quot;app&quot;: &quot;\u002fUsers\u002fsvctest\u002fappium\u002fmobilev2app\u002fiOS_Automation_Build119\u002fOFWTapQA.ipa&quot;,
build 12-Dec-2018 17:17:20 &quot;showIOSLog&quot;: true,
build 12-Dec-2018 17:17:20 &quot;newCommandTimeout&quot;: 10000,
build 12-Dec-2018 17:17:20 &quot;platformVersion&quot;: &quot;12.1&quot;,
build 12-Dec-2018 17:17:20 &quot;xcodeOrgId&quot;: &quot;66Y9F4A25A&quot;,
build 12-Dec-2018 17:17:20 &quot;automationName&quot;: &quot;XCUITest&quot;,
build 12-Dec-2018 17:17:20 &quot;platformName&quot;: &quot;iOS&quot;,
build 12-Dec-2018 17:17:20 &quot;udid&quot;: &quot;48527f94911a9d6cd0cf1c98fc92061021b5f15c&quot;,
build 12-Dec-2018 17:17:20 &quot;deviceName&quot;: &quot;Gandalf iPad&quot;,
build 12-Dec-2018 17:17:20 &quot;platform&quot;: &quot;MAC&quot;,
build 12-Dec-2018 17:17:20 &quot;xcodeSigningId&quot;: &quot;iPhone Developer&quot;
build 12-Dec-2018 17:17:20 },
build 12-Dec-2018 17:17:20 &quot;capabilities&quot;: {
build 12-Dec-2018 17:17:20 &quot;alwaysMatch&quot;: {
build 12-Dec-2018 17:17:20 &quot;appium:app&quot;: &quot;\u002fUsers\u002fsvctest\u002fappium\u002fmobilev2app\u002fiOS_Automation_Build119\u002fOFWTapQA.ipa&quot;,
build 12-Dec-2018 17:17:20 &quot;appium:automationName&quot;: &quot;XCUITest&quot;,
build 12-Dec-2018 17:17:20 &quot;appium:deviceName&quot;: &quot;Gandalf iPad&quot;,
build 12-Dec-2018 17:17:20 &quot;appium:newCommandTimeout&quot;: 10000,
build 12-Dec-2018 17:17:20 &quot;platform&quot;: &quot;MAC&quot;,
build 12-Dec-2018 17:17:20 &quot;platformName&quot;: &quot;ios&quot;,
build 12-Dec-2018 17:17:20 &quot;appium:platformVersion&quot;: &quot;12.1&quot;,
build 12-Dec-2018 17:17:20 &quot;appium:showIOSLog&quot;: true,
build 12-Dec-2018 17:17:20 &quot;appium:udid&quot;: &quot;48527f94911a9d6cd0cf1c98fc92061021b5f15c&quot;,
build 12-Dec-2018 17:17:20 &quot;appium:xcodeOrgId&quot;: &quot;66Y9F4A25A&quot;,
build 12-Dec-2018 17:17:20 &quot;appium:xcodeSigningId&quot;: &quot;iPhone Developer&quot;
build 12-Dec-2018 17:17:20 },
build 12-Dec-2018 17:17:20 &quot;firstMatch&quot;: [
build 12-Dec-2018 17:17:20 {
build 12-Dec-2018 17:17:20 }
build 12-Dec-2018 17:17:20 ]
build 12-Dec-2018 17:17:20 }
build 12-Dec-2018 17:17:20 }
build 12-Dec-2018 17:17:20 at org.openqa.grid.web.servlet.handler.WebDriverRequest.extractDesiredCapability(WebDriverRequest.java:76)
build 12-Dec-2018 17:17:20 at org.openqa.grid.web.servlet.handler.SeleniumBasedRequest.&lt;init&gt;(SeleniumBasedRequest.java:102)
build 12-Dec-2018 17:17:20 at org.openqa.grid.web.servlet.handler.WebDriverRequest.&lt;init&gt;(WebDriverRequest.java:36)
build 12-Dec-2018 17:17:20 at org.openqa.grid.web.servlet.handler.WebDriverRequestFactory.createFromRequest(WebDriverRequestFactory.java:30)
build 12-Dec-2018 17:17:20 at org.openqa.grid.web.servlet.handler.SeleniumBasedRequest.createFromRequest(SeleniumBasedRequest.java:73)
build 12-Dec-2018 17:17:20 at org.openqa.grid.web.servlet.DriverServlet.process(DriverServlet.java:84)
build 12-Dec-2018 17:17:20 at org.openqa.grid.web.servlet.DriverServlet.doPost(DriverServlet.java:70)
build 12-Dec-2018 17:17:20 at javax.servlet.http.HttpServlet.service(HttpServlet.java:707)
build 12-Dec-2018 17:17:20 at javax.servlet.http.HttpServlet.service(HttpServlet.java:790)
build 12-Dec-2018 17:17:20 at org.seleniumhq.jetty9.servlet.ServletHolder.handle(ServletHolder.java:860)
build 12-Dec-2018 17:17:20 at org.seleniumhq.jetty9.servlet.ServletHandler.doHandle(ServletHandler.java:535)
build 12-Dec-2018 17:17:20 at org.seleniumhq.jetty9.server.handler.ScopedHandler.handle(ScopedHandler.java:143)
build 12-Dec-2018 17:17:20 at org.seleniumhq.jetty9.security.SecurityHandler.handle(SecurityHandler.java:548)
build 12-Dec-2018 17:17:20 at org.seleniumhq.jetty9.server.handler.HandlerWrapper.handle(HandlerWrapper.java:132)
build 12-Dec-2018 17:17:20 at org.seleniumhq.jetty9.server.handler.ScopedHandler.nextHandle(ScopedHandler.java:190)
build 12-Dec-2018 17:17:20 at org.seleniumhq.jetty9.server.session.SessionHandler.doHandle(SessionHandler.java:1595)
build 12-Dec-2018 17:17:20 at org.seleniumhq.jetty9.server.handler.ScopedHandler.nextHandle(ScopedHandler.java:188)
build 12-Dec-2018 17:17:20 at org.seleniumhq.jetty9.server.handler.ContextHandler.doHandle(ContextHandler.java:1253)
build 12-Dec-2018 17:17:20 at org.seleniumhq.jetty9.server.handler.ScopedHandler.nextScope(ScopedHandler.java:168)
build 12-Dec-2018 17:17:20 at org.seleniumhq.jetty9.servlet.ServletHandler.doScope(ServletHandler.java:473)
build 12-Dec-2018 17:17:20 at org.seleniumhq.jetty9.server.session.SessionHandler.doScope(SessionHandler.java:1564)
build 12-Dec-2018 17:17:20 at org.seleniumhq.jetty9.server.handler.ScopedHandler.nextScope(ScopedHandler.java:166)
build 12-Dec-2018 17:17:20 at org.seleniumhq.jetty9.server.handler.ContextHandler.doScope(ContextHandler.java:1155)
build 12-Dec-2018 17:17:20 at org.seleniumhq.jetty9.server.handler.ScopedHandler.handle(ScopedHandler.java:141)
build 12-Dec-2018 17:17:20 at org.seleniumhq.jetty9.server.handler.HandlerWrapper.handle(HandlerWrapper.java:132)
build 12-Dec-2018 17:17:20 at org.seleniumhq.jetty9.server.Server.handle(Server.java:530)
build 12-Dec-2018 17:17:20 at org.seleniumhq.jetty9.server.HttpChannel.handle(HttpChannel.java:347)
build 12-Dec-2018 17:17:20 at org.seleniumhq.jetty9.server.HttpConnection.onFillable(HttpConnection.java:256)
build 12-Dec-2018 17:17:20 at org.seleniumhq.jetty9.io.AbstractConnection$ReadCallback.succeeded(AbstractConnection.java:279)
build 12-Dec-2018 17:17:20 at org.seleniumhq.jetty9.io.FillInterest.fillable(FillInterest.java:102)
build 12-Dec-2018 17:17:20 at org.seleniumhq.jetty9.io.ChannelEndPoint$2.run(ChannelEndPoint.java:124)
build 12-Dec-2018 17:17:20 at org.seleniumhq.jetty9.util.thread.strategy.EatWhatYouKill.doProduce(EatWhatYouKill.java:247)
build 12-Dec-2018 17:17:20 at org.seleniumhq.jetty9.util.thread.strategy.EatWhatYouKill.produce(EatWhatYouKill.java:140)
build 12-Dec-2018 17:17:20 at org.seleniumhq.jetty9.util.thread.strategy.EatWhatYouKill.run(EatWhatYouKill.java:131)
build 12-Dec-2018 17:17:20 at org.seleniumhq.jetty9.util.thread.ReservedThreadExecutor$ReservedThread.run(ReservedThreadExecutor.java:382)
build 12-Dec-2018 17:17:20 at org.seleniumhq.jetty9.util.thread.QueuedThreadPool.runJob(QueuedThreadPool.java:708)
build 12-Dec-2018 17:17:20 at org.seleniumhq.jetty9.util.thread.QueuedThreadPool$2.run(QueuedThreadPool.java:626)
build 12-Dec-2018 17:17:20 at java.lang.Thread.run(Thread.java:748)
build 12-Dec-2018 17:17:20 Caused by: java.lang.IllegalArgumentException: Illegal key values seen in w3c capabilities: [platform]
build 12-Dec-2018 17:17:20 at org.openqa.selenium.remote.NewSessionPayload.lambda$validate$5(NewSessionPayload.java:197)
build 12-Dec-2018 17:17:20 at java.util.stream.ReferencePipeline$11$1.accept(ReferencePipeline.java:372)
build 12-Dec-2018 17:17:20 at java.util.stream.ReferencePipeline$11$1.accept(ReferencePipeline.java:373)
build 12-Dec-2018 17:17:20 at java.util.stream.ReferencePipeline$3$1.accept(ReferencePipeline.java:193)
build 12-Dec-2018 17:17:20 at java.util.stream.ReferencePipeline$11$1.accept(ReferencePipeline.java:373)
build 12-Dec-2018 17:17:20 at java.util.ArrayList$ArrayListSpliterator.forEachRemaining(ArrayList.java:1382)
build 12-Dec-2018 17:17:20 at java.util.stream.AbstractPipeline.copyInto(AbstractPipeline.java:481)
build 12-Dec-2018 17:17:20 at java.util.stream.AbstractPipeline.wrapAndCopyInto(AbstractPipeline.java:471)
build 12-Dec-2018 17:17:20 at java.util.stream.ForEachOps$ForEachOp.evaluateSequential(ForEachOps.java:151)
build 12-Dec-2018 17:17:20 at java.util.stream.ForEachOps$ForEachOp$OfRef.evaluateSequential(ForEachOps.java:174)
build 12-Dec-2018 17:17:20 at java.util.stream.AbstractPipeline.evaluate(AbstractPipeline.java:234)
build 12-Dec-2018 17:17:20 at java.util.stream.ReferencePipeline.forEach(ReferencePipeline.java:418)
build 12-Dec-2018 17:17:20 at org.openqa.selenium.remote.NewSessionPayload.validate(NewSessionPayload.java:201)
build 12-Dec-2018 17:17:20 at org.openqa.selenium.remote.NewSessionPayload.&lt;init&gt;(NewSessionPayload.java:149)
build 12-Dec-2018 17:17:20 at org.openqa.selenium.remote.NewSessionPayload.create(NewSessionPayload.java:104)
build 12-Dec-2018 17:17:20 at org.openqa.grid.web.servlet.handler.WebDriverRequest.extractDesiredCapability(WebDriverRequest.java:66)
build 12-Dec-2018 17:17:20 ... 37 more
build 12-Dec-2018 17:17:20 </pre>
build 12-Dec-2018 17:17:20 <h3>Caused by:</h3><pre>java.lang.IllegalArgumentException: Illegal key values seen in w3c capabilities: [platform]
build 12-Dec-2018 17:17:20 at org.openqa.selenium.remote.NewSessionPayload.lambda$validate$5(NewSessionPayload.java:197)
build 12-Dec-2018 17:17:20 at java.util.stream.ReferencePipeline$11$1.accept(ReferencePipeline.java:372)
build 12-Dec-2018 17:17:20 at java.util.stream.ReferencePipeline$11$1.accept(ReferencePipeline.java:373)
build 12-Dec-2018 17:17:20 at java.util.stream.ReferencePipeline$3$1.accept(ReferencePipeline.java:193)
build 12-Dec-2018 17:17:20 at java.util.stream.ReferencePipeline$11$1.accept(ReferencePipeline.java:373)
build 12-Dec-2018 17:17:20 at java.util.ArrayList$ArrayListSpliterator.forEachRemaining(ArrayList.java:1382)
build 12-Dec-2018 17:17:20 at java.util.stream.AbstractPipeline.copyInto(AbstractPipeline.java:481)
build 12-Dec-2018 17:17:20 at java.util.stream.AbstractPipeline.wrapAndCopyInto(AbstractPipeline.java:471)
build 12-Dec-2018 17:17:20 at java.util.stream.ForEachOps$ForEachOp.evaluateSequential(ForEachOps.java:151)
build 12-Dec-2018 17:17:20 at java.util.stream.ForEachOps$ForEachOp$OfRef.evaluateSequential(ForEachOps.java:174)
build 12-Dec-2018 17:17:20 at java.util.stream.AbstractPipeline.evaluate(AbstractPipeline.java:234)
build 12-Dec-2018 17:17:20 at java.util.stream.ReferencePipeline.forEach(ReferencePipeline.java:418)
build 12-Dec-2018 17:17:20 at org.openqa.selenium.remote.NewSessionPayload.validate(NewSessionPayload.java:201)
build 12-Dec-2018 17:17:20 at org.openqa.selenium.remote.NewSessionPayload.&lt;init&gt;(NewSessionPayload.java:149)
build 12-Dec-2018 17:17:20 at org.openqa.selenium.remote.NewSessionPayload.create(NewSessionPayload.java:104)
build 12-Dec-2018 17:17:20 at org.openqa.grid.web.servlet.handler.WebDriverRequest.extractDesiredCapability(WebDriverRequest.java:66)
build 12-Dec-2018 17:17:20 at org.openqa.grid.web.servlet.handler.SeleniumBasedRequest.&lt;init&gt;(SeleniumBasedRequest.java:102)
build 12-Dec-2018 17:17:20 at org.openqa.grid.web.servlet.handler.WebDriverRequest.&lt;init&gt;(WebDriverRequest.java:36)
build 12-Dec-2018 17:17:20 at org.openqa.grid.web.servlet.handler.WebDriverRequestFactory.createFromRequest(WebDriverRequestFactory.java:30)
build 12-Dec-2018 17:17:20 at org.openqa.grid.web.servlet.handler.SeleniumBasedRequest.createFromRequest(SeleniumBasedRequest.java:73)
build 12-Dec-2018 17:17:20 at org.openqa.grid.web.servlet.DriverServlet.process(DriverServlet.java:84)
build 12-Dec-2018 17:17:20 at org.openqa.grid.web.servlet.DriverServlet.doPost(DriverServlet.java:70)
build 12-Dec-2018 17:17:20 at javax.servlet.http.HttpServlet.service(HttpServlet.java:707)
build 12-Dec-2018 17:17:20 at javax.servlet.http.HttpServlet.service(HttpServlet.java:790)
build 12-Dec-2018 17:17:20 at org.seleniumhq.jetty9.servlet.ServletHolder.handle(ServletHolder.java:860)
build 12-Dec-2018 17:17:20 at org.seleniumhq.jetty9.servlet.ServletHandler.doHandle(ServletHandler.java:535)
build 12-Dec-2018 17:17:20 at org.seleniumhq.jetty9.server.handler.ScopedHandler.handle(ScopedHandler.java:143)
build 12-Dec-2018 17:17:20 at org.seleniumhq.jetty9.security.SecurityHandler.handle(SecurityHandler.java:548)
build 12-Dec-2018 17:17:20 at org.seleniumhq.jetty9.server.handler.HandlerWrapper.handle(HandlerWrapper.java:132)
build 12-Dec-2018 17:17:20 at org.seleniumhq.jetty9.server.handler.ScopedHandler.nextHandle(ScopedHandler.java:190)
build 12-Dec-2018 17:17:20 at org.seleniumhq.jetty9.server.session.SessionHandler.doHandle(SessionHandler.java:1595)
build 12-Dec-2018 17:17:20 at org.seleniumhq.jetty9.server.handler.ScopedHandler.nextHandle(ScopedHandler.java:188)
build 12-Dec-2018 17:17:20 at org.seleniumhq.jetty9.server.handler.ContextHandler.doHandle(ContextHandler.java:1253)
build 12-Dec-2018 17:17:20 at org.seleniumhq.jetty9.server.handler.ScopedHandler.nextScope(ScopedHandler.java:168)
build 12-Dec-2018 17:17:20 at org.seleniumhq.jetty9.servlet.ServletHandler.doScope(ServletHandler.java:473)
build 12-Dec-2018 17:17:20 at org.seleniumhq.jetty9.server.session.SessionHandler.doScope(SessionHandler.java:1564)
build 12-Dec-2018 17:17:20 at org.seleniumhq.jetty9.server.handler.ScopedHandler.nextScope(ScopedHandler.java:166)
build 12-Dec-2018 17:17:20 at org.seleniumhq.jetty9.server.handler.ContextHandler.doScope(ContextHandler.java:1155)
build 12-Dec-2018 17:17:20 at org.seleniumhq.jetty9.server.handler.ScopedHandler.handle(ScopedHandler.java:141)
build 12-Dec-2018 17:17:20 at org.seleniumhq.jetty9.server.handler.HandlerWrapper.handle(HandlerWrapper.java:132)
build 12-Dec-2018 17:17:20 at org.seleniumhq.jetty9.server.Server.handle(Server.java:530)
build 12-Dec-2018 17:17:20 at org.seleniumhq.jetty9.server.HttpChannel.handle(HttpChannel.java:347)
build 12-Dec-2018 17:17:20 at org.seleniumhq.jetty9.server.HttpConnection.onFillable(HttpConnection.java:256)
build 12-Dec-2018 17:17:20 at org.seleniumhq.jetty9.io.AbstractConnection$ReadCallback.succeeded(AbstractConnection.java:279)
build 12-Dec-2018 17:17:20 at org.seleniumhq.jetty9.io.FillInterest.fillable(FillInterest.java:102)
build 12-Dec-2018 17:17:20 at org.seleniumhq.jetty9.io.ChannelEndPoint$2.run(ChannelEndPoint.java:124)
build 12-Dec-2018 17:17:20 at org.seleniumhq.jetty9.util.thread.strategy.EatWhatYouKill.doProduce(EatWhatYouKill.java:247)
build 12-Dec-2018 17:17:20 at org.seleniumhq.jetty9.util.thread.strategy.EatWhatYouKill.produce(EatWhatYouKill.java:140)
build 12-Dec-2018 17:17:20 at org.seleniumhq.jetty9.util.thread.strategy.EatWhatYouKill.run(EatWhatYouKill.java:131)
build 12-Dec-2018 17:17:20 at org.seleniumhq.jetty9.util.thread.ReservedThreadExecutor$ReservedThread.run(ReservedThreadExecutor.java:382)
build 12-Dec-2018 17:17:20 at org.seleniumhq.jetty9.util.thread.QueuedThreadPool.runJob(QueuedThreadPool.java:708)
build 12-Dec-2018 17:17:20 at org.seleniumhq.jetty9.util.thread.QueuedThreadPool$2.run(QueuedThreadPool.java:626)
build 12-Dec-2018 17:17:20 at java.lang.Thread.run(Thread.java:748)
build 12-Dec-2018 17:17:20 </pre>
build 12-Dec-2018 17:17:20 <hr><a href="http://eclipse.org/jetty">Powered by Jetty:// 9.4.7.v20170914</a><hr/>
build 12-Dec-2018 17:17:20
build 12-Dec-2018 17:17:20 </body>
build 12-Dec-2018 17:17:20 </html>
build 12-Dec-2018 17:17:20
build 12-Dec-2018 17:17:20 Build info: version: '3.13.0', revision: '2f0d292', time: '2018-06-25T15:24:21.231Z'
build 12-Dec-2018 17:17:20 System info: host: 'c69e564deef1', ip: '10.0.21.13', os.name: 'Linux', os.arch: 'amd64', os.version: '3.10.0-862.3.2.el7.x86_64', java.version: '1.8.0_191'
build 12-Dec-2018 17:17:20 Driver info: driver.version: IOSDriver
build 12-Dec-2018 17:17:20 at org.openqa.selenium.remote.ProtocolHandshake.createSession(ProtocolHandshake.java:111)
build 12-Dec-2018 17:17:20 ... 37 more
build 12-Dec-2018 17:17:20
build 12-Dec-2018 17:17:20 org.openqa.selenium.WebDriverException: It is impossible to create a new session because 'createSession' which takes HttpClient, InputStream and long was not found or it is not accessible
build 12-Dec-2018 17:17:20 Build info: version: '3.13.0', revision: '2f0d292', time: '2018-06-25T15:24:21.231Z'
build 12-Dec-2018 17:17:20 System info: host: 'c69e564deef1', ip: '10.0.21.13', os.name: 'Linux', os.arch: 'amd64', os.version: '3.10.0-862.3.2.el7.x86_64', java.version: '1.8.0_191'
build 12-Dec-2018 17:17:20 Driver info: driver.version: IOSDriver
build 12-Dec-2018 17:17:20 at io.appium.java_client.remote.AppiumCommandExecutor$1.createSession(AppiumCommandExecutor.java:195)
build 12-Dec-2018 17:17:20 at io.appium.java_client.remote.AppiumCommandExecutor.createSession(AppiumCommandExecutor.java:209)
build 12-Dec-2018 17:17:20 at io.appium.java_client.remote.AppiumCommandExecutor.execute(AppiumCommandExecutor.java:231)
build 12-Dec-2018 17:17:20 at org.openqa.selenium.remote.RemoteWebDriver.execute(RemoteWebDriver.java:548)
build 12-Dec-2018 17:17:20 at io.appium.java_client.DefaultGenericMobileDriver.execute(DefaultGenericMobileDriver.java:42)
build 12-Dec-2018 17:17:20 at io.appium.java_client.AppiumDriver.execute(AppiumDriver.java:1)
build 12-Dec-2018 17:17:20 at io.appium.java_client.ios.IOSDriver.execute(IOSDriver.java:1)
build 12-Dec-2018 17:17:20 at org.openqa.selenium.remote.RemoteWebDriver.startSession(RemoteWebDriver.java:212)
build 12-Dec-2018 17:17:20 at org.openqa.selenium.remote.RemoteWebDriver.<init>(RemoteWebDriver.java:130)
build 12-Dec-2018 17:17:20 at io.appium.java_client.DefaultGenericMobileDriver.<init>(DefaultGenericMobileDriver.java:38)
build 12-Dec-2018 17:17:20 at io.appium.java_client.AppiumDriver.<init>(AppiumDriver.java:84)
build 12-Dec-2018 17:17:20 at io.appium.java_client.AppiumDriver.<init>(AppiumDriver.java:94)
build 12-Dec-2018 17:17:20 at io.appium.java_client.ios.IOSDriver.<init>(IOSDriver.java:95)
build 12-Dec-2018 17:17:20 at cucumber.driver.Factory.createPlatformDriver(Factory.java:54)
build 12-Dec-2018 17:17:20 at cucumber.driver.Factory.createDriverWithLatestAppBuild(Factory.java:36)
build 12-Dec-2018 17:17:20 at cucumber.driver.Factory.createDriverWithApp(Factory.java:31)
build 12-Dec-2018 17:17:20 at cucumber.support.Hooks.beforeScenario(Hooks.java:55)
build 12-Dec-2018 17:17:20 at sun.reflect.NativeMethodAccessorImpl.invoke0(Native Method)
build 12-Dec-2018 17:17:20 at sun.reflect.NativeMethodAccessorImpl.invoke(NativeMethodAccessorImpl.java:62)
build 12-Dec-2018 17:17:20 at sun.reflect.DelegatingMethodAccessorImpl.invoke(DelegatingMethodAccessorImpl.java:43)
build 12-Dec-2018 17:17:20 at java.lang.reflect.Method.invoke(Method.java:498)
build 12-Dec-2018 17:17:20 at cucumber.runtime.Utils$1.call(Utils.java:40)
build 12-Dec-2018 17:17:20 at cucumber.runtime.Timeout.timeout(Timeout.java:16)
build 12-Dec-2018 17:17:20 at cucumber.runtime.Utils.invoke(Utils.java:34)
build 12-Dec-2018 17:17:20 at cucumber.runtime.java.JavaHookDefinition.execute(JavaHookDefinition.java:60)
build 12-Dec-2018 17:17:20 at cucumber.runtime.Runtime.runHookIfTagsMatch(Runtime.java:224)
build 12-Dec-2018 17:17:20 at cucumber.runtime.Runtime.runHooks(Runtime.java:212)
build 12-Dec-2018 17:17:20 at cucumber.runtime.Runtime.runBeforeHooks(Runtime.java:202)
build 12-Dec-2018 17:17:20 at cucumber.runtime.model.CucumberScenario.run(CucumberScenario.java:40)
build 12-Dec-2018 17:17:20 at cucumber.runtime.model.CucumberFeature.run(CucumberFeature.java:165)
build 12-Dec-2018 17:17:20 at cucumber.runtime.Runtime.run(Runtime.java:122)
build 12-Dec-2018 17:17:20 at cucumber.api.cli.Main.run(Main.java:36)
build 12-Dec-2018 17:17:20 at cucumber.api.cli.Main.main(Main.java:18)
build 12-Dec-2018 17:17:20 Caused by: java.lang.reflect.InvocationTargetException
build 12-Dec-2018 17:17:20 at sun.reflect.NativeMethodAccessorImpl.invoke0(Native Method)
build 12-Dec-2018 17:17:20 at sun.reflect.NativeMethodAccessorImpl.invoke(NativeMethodAccessorImpl.java:62)
build 12-Dec-2018 17:17:20 at sun.reflect.DelegatingMethodAccessorImpl.invoke(DelegatingMethodAccessorImpl.java:43)
build 12-Dec-2018 17:17:20 at java.lang.reflect.Method.invoke(Method.java:498)
build 12-Dec-2018 17:17:20 at io.appium.java_client.remote.AppiumCommandExecutor$1.createSession(AppiumCommandExecutor.java:185)
build 12-Dec-2018 17:17:20 ... 32 more
build 12-Dec-2018 17:17:20 Caused by: org.openqa.selenium.WebDriverException: Unable to parse remote response: <html>
build 12-Dec-2018 17:17:20 <head>
build 12-Dec-2018 17:17:20 <meta http-equiv="Content-Type" content="text/html;charset=utf-8"/>
build 12-Dec-2018 17:17:20 <title>Error 500 Server Error</title>
build 12-Dec-2018 17:17:20 </head>
build 12-Dec-2018 17:17:20 <body><h2>HTTP ERROR 500</h2>
build 12-Dec-2018 17:17:20 <p>Problem accessing /wd/hub/session. Reason:
build 12-Dec-2018 17:17:20 <pre> Server Error</pre></p><h3>Caused by:</h3><pre>java.io.IOException: org.openqa.grid.common.exception.GridException: Cannot extract a capabilities from the request: {
build 12-Dec-2018 17:17:20 &quot;desiredCapabilities&quot;: {
build 12-Dec-2018 17:17:20 &quot;app&quot;: &quot;\u002fUsers\u002fsvctest\u002fappium\u002fmobilev2app\u002fiOS_Automation_Build119\u002fOFWTapQA.ipa&quot;,
build 12-Dec-2018 17:17:20 &quot;showIOSLog&quot;: true,
build 12-Dec-2018 17:17:20 &quot;newCommandTimeout&quot;: 10000,
build 12-Dec-2018 17:17:20 &quot;platformVersion&quot;: &quot;12.1&quot;,
build 12-Dec-2018 17:17:20 &quot;xcodeOrgId&quot;: &quot;66Y9F4A25A&quot;,
build 12-Dec-2018 17:17:20 &quot;automationName&quot;: &quot;XCUITest&quot;,
build 12-Dec-2018 17:17:20 &quot;platformName&quot;: &quot;iOS&quot;,
build 12-Dec-2018 17:17:20 &quot;udid&quot;: &quot;48527f94911a9d6cd0cf1c98fc92061021b5f15c&quot;,
build 12-Dec-2018 17:17:20 &quot;deviceName&quot;: &quot;Gandalf iPad&quot;,
build 12-Dec-2018 17:17:20 &quot;platform&quot;: &quot;MAC&quot;,
build 12-Dec-2018 17:17:20 &quot;xcodeSigningId&quot;: &quot;iPhone Developer&quot;
build 12-Dec-2018 17:17:20 },
build 12-Dec-2018 17:17:20 &quot;capabilities&quot;: {
build 12-Dec-2018 17:17:20 &quot;alwaysMatch&quot;: {
build 12-Dec-2018 17:17:20 &quot;appium:app&quot;: &quot;\u002fUsers\u002fsvctest\u002fappium\u002fmobilev2app\u002fiOS_Automation_Build119\u002fOFWTapQA.ipa&quot;,
build 12-Dec-2018 17:17:20 &quot;appium:automationName&quot;: &quot;XCUITest&quot;,
build 12-Dec-2018 17:17:20 &quot;appium:deviceName&quot;: &quot;Gandalf iPad&quot;,
build 12-Dec-2018 17:17:20 &quot;appium:newCommandTimeout&quot;: 10000,
build 12-Dec-2018 17:17:20 &quot;platform&quot;: &quot;MAC&quot;,
build 12-Dec-2018 17:17:20 &quot;platformName&quot;: &quot;ios&quot;,
build 12-Dec-2018 17:17:20 &quot;appium:platformVersion&quot;: &quot;12.1&quot;,
build 12-Dec-2018 17:17:20 &quot;appium:showIOSLog&quot;: true,
build 12-Dec-2018 17:17:20 &quot;appium:udid&quot;: &quot;48527f94911a9d6cd0cf1c98fc92061021b5f15c&quot;,
build 12-Dec-2018 17:17:20 &quot;appium:xcodeOrgId&quot;: &quot;66Y9F4A25A&quot;,
build 12-Dec-2018 17:17:20 &quot;appium:xcodeSigningId&quot;: &quot;iPhone Developer&quot;
build 12-Dec-2018 17:17:20 },
build 12-Dec-2018 17:17:20 &quot;firstMatch&quot;: [
build 12-Dec-2018 17:17:20 {
build 12-Dec-2018 17:17:20 }
build 12-Dec-2018 17:17:20 ]
build 12-Dec-2018 17:17:20 }
build 12-Dec-2018 17:17:20 }
build 12-Dec-2018 17:17:20 at org.openqa.grid.web.servlet.DriverServlet.process(DriverServlet.java:137)
build 12-Dec-2018 17:17:20 at org.openqa.grid.web.servlet.DriverServlet.doPost(DriverServlet.java:70)
build 12-Dec-2018 17:17:20 at javax.servlet.http.HttpServlet.service(HttpServlet.java:707)
build 12-Dec-2018 17:17:20 at javax.servlet.http.HttpServlet.service(HttpServlet.java:790)
build 12-Dec-2018 17:17:20 at org.seleniumhq.jetty9.servlet.ServletHolder.handle(ServletHolder.java:860)
build 12-Dec-2018 17:17:20 at org.seleniumhq.jetty9.servlet.ServletHandler.doHandle(ServletHandler.java:535)
build 12-Dec-2018 17:17:20 at org.seleniumhq.jetty9.server.handler.ScopedHandler.handle(ScopedHandler.java:143)
build 12-Dec-2018 17:17:20 at org.seleniumhq.jetty9.security.SecurityHandler.handle(SecurityHandler.java:548)
build 12-Dec-2018 17:17:20 at org.seleniumhq.jetty9.server.handler.HandlerWrapper.handle(HandlerWrapper.java:132)
build 12-Dec-2018 17:17:20 at org.seleniumhq.jetty9.server.handler.ScopedHandler.nextHandle(ScopedHandler.java:190)
build 12-Dec-2018 17:17:20 at org.seleniumhq.jetty9.server.session.SessionHandler.doHandle(SessionHandler.java:1595)
build 12-Dec-2018 17:17:20 at org.seleniumhq.jetty9.server.handler.ScopedHandler.nextHandle(ScopedHandler.java:188)
build 12-Dec-2018 17:17:20 at org.seleniumhq.jetty9.server.handler.ContextHandler.doHandle(ContextHandler.java:1253)
build 12-Dec-2018 17:17:20 at org.seleniumhq.jetty9.server.handler.ScopedHandler.nextScope(ScopedHandler.java:168)
build 12-Dec-2018 17:17:20 at org.seleniumhq.jetty9.servlet.ServletHandler.doScope(ServletHandler.java:473)
build 12-Dec-2018 17:17:20 at org.seleniumhq.jetty9.server.session.SessionHandler.doScope(SessionHandler.java:1564)
build 12-Dec-2018 17:17:20 at org.seleniumhq.jetty9.server.handler.ScopedHandler.nextScope(ScopedHandler.java:166)
build 12-Dec-2018 17:17:20 at org.seleniumhq.jetty9.server.handler.ContextHandler.doScope(ContextHandler.java:1155)
build 12-Dec-2018 17:17:20 at org.seleniumhq.jetty9.server.handler.ScopedHandler.handle(ScopedHandler.java:141)
build 12-Dec-2018 17:17:20 at org.seleniumhq.jetty9.server.handler.HandlerWrapper.handle(HandlerWrapper.java:132)
build 12-Dec-2018 17:17:20 at org.seleniumhq.jetty9.server.Server.handle(Server.java:530)
build 12-Dec-2018 17:17:20 at org.seleniumhq.jetty9.server.HttpChannel.handle(HttpChannel.java:347)
build 12-Dec-2018 17:17:20 at org.seleniumhq.jetty9.server.HttpConnection.onFillable(HttpConnection.java:256)
build 12-Dec-2018 17:17:20 at org.seleniumhq.jetty9.io.AbstractConnection$ReadCallback.succeeded(AbstractConnection.java:279)
build 12-Dec-2018 17:17:20 at org.seleniumhq.jetty9.io.FillInterest.fillable(FillInterest.java:102)
build 12-Dec-2018 17:17:20 at org.seleniumhq.jetty9.io.ChannelEndPoint$2.run(ChannelEndPoint.java:124)
build 12-Dec-2018 17:17:20 at org.seleniumhq.jetty9.util.thread.strategy.EatWhatYouKill.doProduce(EatWhatYouKill.java:247)
build 12-Dec-2018 17:17:20 at org.seleniumhq.jetty9.util.thread.strategy.EatWhatYouKill.produce(EatWhatYouKill.java:140)
build 12-Dec-2018 17:17:20 at org.seleniumhq.jetty9.util.thread.strategy.EatWhatYouKill.run(EatWhatYouKill.java:131)
build 12-Dec-2018 17:17:20 at org.seleniumhq.jetty9.util.thread.ReservedThreadExecutor$ReservedThread.run(ReservedThreadExecutor.java:382)
build 12-Dec-2018 17:17:20 at org.seleniumhq.jetty9.util.thread.QueuedThreadPool.runJob(QueuedThreadPool.java:708)
build 12-Dec-2018 17:17:20 at org.seleniumhq.jetty9.util.thread.QueuedThreadPool$2.run(QueuedThreadPool.java:626)
build 12-Dec-2018 17:17:20 at java.lang.Thread.run(Thread.java:748)
build 12-Dec-2018 17:17:20 Caused by: org.openqa.grid.common.exception.GridException: Cannot extract a capabilities from the request: {
build 12-Dec-2018 17:17:20 &quot;desiredCapabilities&quot;: {
build 12-Dec-2018 17:17:20 &quot;app&quot;: &quot;\u002fUsers\u002fsvctest\u002fappium\u002fmobilev2app\u002fiOS_Automation_Build119\u002fOFWTapQA.ipa&quot;,
build 12-Dec-2018 17:17:20 &quot;showIOSLog&quot;: true,
build 12-Dec-2018 17:17:20 &quot;newCommandTimeout&quot;: 10000,
build 12-Dec-2018 17:17:20 &quot;platformVersion&quot;: &quot;12.1&quot;,
build 12-Dec-2018 17:17:20 &quot;xcodeOrgId&quot;: &quot;66Y9F4A25A&quot;,
build 12-Dec-2018 17:17:20 &quot;automationName&quot;: &quot;XCUITest&quot;,
build 12-Dec-2018 17:17:20 &quot;platformName&quot;: &quot;iOS&quot;,
build 12-Dec-2018 17:17:20 &quot;udid&quot;: &quot;48527f94911a9d6cd0cf1c98fc92061021b5f15c&quot;,
build 12-Dec-2018 17:17:20 &quot;deviceName&quot;: &quot;Gandalf iPad&quot;,
build 12-Dec-2018 17:17:20 &quot;platform&quot;: &quot;MAC&quot;,
build 12-Dec-2018 17:17:20 &quot;xcodeSigningId&quot;: &quot;iPhone Developer&quot;
build 12-Dec-2018 17:17:20 },
build 12-Dec-2018 17:17:20 &quot;capabilities&quot;: {
build 12-Dec-2018 17:17:20 &quot;alwaysMatch&quot;: {
build 12-Dec-2018 17:17:20 &quot;appium:app&quot;: &quot;\u002fUsers\u002fsvctest\u002fappium\u002fmobilev2app\u002fiOS_Automation_Build119\u002fOFWTapQA.ipa&quot;,
build 12-Dec-2018 17:17:20 &quot;appium:automationName&quot;: &quot;XCUITest&quot;,
build 12-Dec-2018 17:17:20 &quot;appium:deviceName&quot;: &quot;Gandalf iPad&quot;,
build 12-Dec-2018 17:17:20 &quot;appium:newCommandTimeout&quot;: 10000,
build 12-Dec-2018 17:17:20 &quot;platform&quot;: &quot;MAC&quot;,
build 12-Dec-2018 17:17:20 &quot;platformName&quot;: &quot;ios&quot;,
build 12-Dec-2018 17:17:20 &quot;appium:platformVersion&quot;: &quot;12.1&quot;,
build 12-Dec-2018 17:17:20 &quot;appium:showIOSLog&quot;: true,
build 12-Dec-2018 17:17:20 &quot;appium:udid&quot;: &quot;48527f94911a9d6cd0cf1c98fc92061021b5f15c&quot;,
build 12-Dec-2018 17:17:20 &quot;appium:xcodeOrgId&quot;: &quot;66Y9F4A25A&quot;,
build 12-Dec-2018 17:17:20 &quot;appium:xcodeSigningId&quot;: &quot;iPhone Developer&quot;
build 12-Dec-2018 17:17:20 },
build 12-Dec-2018 17:17:20 &quot;firstMatch&quot;: [
build 12-Dec-2018 17:17:20 {
build 12-Dec-2018 17:17:20 }
build 12-Dec-2018 17:17:20 ]
build 12-Dec-2018 17:17:20 }
build 12-Dec-2018 17:17:20 }
build 12-Dec-2018 17:17:20 at org.openqa.grid.web.servlet.handler.WebDriverRequest.extractDesiredCapability(WebDriverRequest.java:76)
build 12-Dec-2018 17:17:20 at org.openqa.grid.web.servlet.handler.SeleniumBasedRequest.&lt;init&gt;(SeleniumBasedRequest.java:102)
build 12-Dec-2018 17:17:20 at org.openqa.grid.web.servlet.handler.WebDriverRequest.&lt;init&gt;(WebDriverRequest.java:36)
build 12-Dec-2018 17:17:20 at org.openqa.grid.web.servlet.handler.WebDriverRequestFactory.createFromRequest(WebDriverRequestFactory.java:30)
build 12-Dec-2018 17:17:20 at org.openqa.grid.web.servlet.handler.SeleniumBasedRequest.createFromRequest(SeleniumBasedRequest.java:73)
build 12-Dec-2018 17:17:20 at org.openqa.grid.web.servlet.DriverServlet.process(DriverServlet.java:84)
build 12-Dec-2018 17:17:20 ... 32 more
build 12-Dec-2018 17:17:20 Caused by: java.lang.IllegalArgumentException: Illegal key values seen in w3c capabilities: [platform]
build 12-Dec-2018 17:17:20 at org.openqa.selenium.remote.NewSessionPayload.lambda$validate$5(NewSessionPayload.java:197)
build 12-Dec-2018 17:17:20 at java.util.stream.ReferencePipeline$11$1.accept(ReferencePipeline.java:372)
build 12-Dec-2018 17:17:20 at java.util.stream.ReferencePipeline$11$1.accept(ReferencePipeline.java:373)
build 12-Dec-2018 17:17:20 at java.util.stream.ReferencePipeline$3$1.accept(ReferencePipeline.java:193)
build 12-Dec-2018 17:17:20 at java.util.stream.ReferencePipeline$11$1.accept(ReferencePipeline.java:373)
build 12-Dec-2018 17:17:20 at java.util.ArrayList$ArrayListSpliterator.forEachRemaining(ArrayList.java:1382)
build 12-Dec-2018 17:17:20 at java.util.stream.AbstractPipeline.copyInto(AbstractPipeline.java:481)
build 12-Dec-2018 17:17:20 at java.util.stream.AbstractPipeline.wrapAndCopyInto(AbstractPipeline.java:471)
build 12-Dec-2018 17:17:20 at java.util.stream.ForEachOps$ForEachOp.evaluateSequential(ForEachOps.java:151)
build 12-Dec-2018 17:17:20 at java.util.stream.ForEachOps$ForEachOp$OfRef.evaluateSequential(ForEachOps.java:174)
build 12-Dec-2018 17:17:20 at java.util.stream.AbstractPipeline.evaluate(AbstractPipeline.java:234)
build 12-Dec-2018 17:17:20 at java.util.stream.ReferencePipeline.forEach(ReferencePipeline.java:418)
build 12-Dec-2018 17:17:20 at org.openqa.selenium.remote.NewSessionPayload.validate(NewSessionPayload.java:201)
build 12-Dec-2018 17:17:20 at org.openqa.selenium.remote.NewSessionPayload.&lt;init&gt;(NewSessionPayload.java:149)
build 12-Dec-2018 17:17:20 at org.openqa.selenium.remote.NewSessionPayload.create(NewSessionPayload.java:104)
build 12-Dec-2018 17:17:20 at org.openqa.grid.web.servlet.handler.WebDriverRequest.extractDesiredCapability(WebDriverRequest.java:66)
build 12-Dec-2018 17:17:20 ... 37 more
build 12-Dec-2018 17:17:20 </pre>
build 12-Dec-2018 17:17:20 <h3>Caused by:</h3><pre>org.openqa.grid.common.exception.GridException: Cannot extract a capabilities from the request: {
build 12-Dec-2018 17:17:20 &quot;desiredCapabilities&quot;: {
build 12-Dec-2018 17:17:20 &quot;app&quot;: &quot;\u002fUsers\u002fsvctest\u002fappium\u002fmobilev2app\u002fiOS_Automation_Build119\u002fOFWTapQA.ipa&quot;,
build 12-Dec-2018 17:17:20 &quot;showIOSLog&quot;: true,
build 12-Dec-2018 17:17:20 &quot;newCommandTimeout&quot;: 10000,
build 12-Dec-2018 17:17:20 &quot;platformVersion&quot;: &quot;12.1&quot;,
build 12-Dec-2018 17:17:20 &quot;xcodeOrgId&quot;: &quot;66Y9F4A25A&quot;,
build 12-Dec-2018 17:17:20 &quot;automationName&quot;: &quot;XCUITest&quot;,
build 12-Dec-2018 17:17:20 &quot;platformName&quot;: &quot;iOS&quot;,
build 12-Dec-2018 17:17:20 &quot;udid&quot;: &quot;48527f94911a9d6cd0cf1c98fc92061021b5f15c&quot;,
build 12-Dec-2018 17:17:20 &quot;deviceName&quot;: &quot;Gandalf iPad&quot;,
build 12-Dec-2018 17:17:20 &quot;platform&quot;: &quot;MAC&quot;,
build 12-Dec-2018 17:17:20 &quot;xcodeSigningId&quot;: &quot;iPhone Developer&quot;
build 12-Dec-2018 17:17:20 },
build 12-Dec-2018 17:17:20 &quot;capabilities&quot;: {
build 12-Dec-2018 17:17:20 &quot;alwaysMatch&quot;: {
build 12-Dec-2018 17:17:20 &quot;appium:app&quot;: &quot;\u002fUsers\u002fsvctest\u002fappium\u002fmobilev2app\u002fiOS_Automation_Build119\u002fOFWTapQA.ipa&quot;,
build 12-Dec-2018 17:17:20 &quot;appium:automationName&quot;: &quot;XCUITest&quot;,
build 12-Dec-2018 17:17:20 &quot;appium:deviceName&quot;: &quot;Gandalf iPad&quot;,
build 12-Dec-2018 17:17:20 &quot;appium:newCommandTimeout&quot;: 10000,
build 12-Dec-2018 17:17:20 &quot;platform&quot;: &quot;MAC&quot;,
build 12-Dec-2018 17:17:20 &quot;platformName&quot;: &quot;ios&quot;,
build 12-Dec-2018 17:17:20 &quot;appium:platformVersion&quot;: &quot;12.1&quot;,
build 12-Dec-2018 17:17:20 &quot;appium:showIOSLog&quot;: true,
build 12-Dec-2018 17:17:20 &quot;appium:udid&quot;: &quot;48527f94911a9d6cd0cf1c98fc92061021b5f15c&quot;,
build 12-Dec-2018 17:17:20 &quot;appium:xcodeOrgId&quot;: &quot;66Y9F4A25A&quot;,
build 12-Dec-2018 17:17:20 &quot;appium:xcodeSigningId&quot;: &quot;iPhone Developer&quot;
build 12-Dec-2018 17:17:20 },
build 12-Dec-2018 17:17:20 &quot;firstMatch&quot;: [
build 12-Dec-2018 17:17:20 {
build 12-Dec-2018 17:17:20 }
build 12-Dec-2018 17:17:20 ]
build 12-Dec-2018 17:17:20 }
build 12-Dec-2018 17:17:20 }
build 12-Dec-2018 17:17:20 at org.openqa.grid.web.servlet.handler.WebDriverRequest.extractDesiredCapability(WebDriverRequest.java:76)
build 12-Dec-2018 17:17:20 at org.openqa.grid.web.servlet.handler.SeleniumBasedRequest.&lt;init&gt;(SeleniumBasedRequest.java:102)
build 12-Dec-2018 17:17:20 at org.openqa.grid.web.servlet.handler.WebDriverRequest.&lt;init&gt;(WebDriverRequest.java:36)
build 12-Dec-2018 17:17:20 at org.openqa.grid.web.servlet.handler.WebDriverRequestFactory.createFromRequest(WebDriverRequestFactory.java:30)
build 12-Dec-2018 17:17:20 at org.openqa.grid.web.servlet.handler.SeleniumBasedRequest.createFromRequest(SeleniumBasedRequest.java:73)
build 12-Dec-2018 17:17:20 at org.openqa.grid.web.servlet.DriverServlet.process(DriverServlet.java:84)
build 12-Dec-2018 17:17:20 at org.openqa.grid.web.servlet.DriverServlet.doPost(DriverServlet.java:70)
build 12-Dec-2018 17:17:20 at javax.servlet.http.HttpServlet.service(HttpServlet.java:707)
build 12-Dec-2018 17:17:20 at javax.servlet.http.HttpServlet.service(HttpServlet.java:790)
build 12-Dec-2018 17:17:20 at org.seleniumhq.jetty9.servlet.ServletHolder.handle(ServletHolder.java:860)
build 12-Dec-2018 17:17:20 at org.seleniumhq.jetty9.servlet.ServletHandler.doHandle(ServletHandler.java:535)
build 12-Dec-2018 17:17:20 at org.seleniumhq.jetty9.server.handler.ScopedHandler.handle(ScopedHandler.java:143)
build 12-Dec-2018 17:17:20 at org.seleniumhq.jetty9.security.SecurityHandler.handle(SecurityHandler.java:548)
build 12-Dec-2018 17:17:20 at org.seleniumhq.jetty9.server.handler.HandlerWrapper.handle(HandlerWrapper.java:132)
build 12-Dec-2018 17:17:20 at org.seleniumhq.jetty9.server.handler.ScopedHandler.nextHandle(ScopedHandler.java:190)
build 12-Dec-2018 17:17:20 at org.seleniumhq.jetty9.server.session.SessionHandler.doHandle(SessionHandler.java:1595)
build 12-Dec-2018 17:17:20 at org.seleniumhq.jetty9.server.handler.ScopedHandler.nextHandle(ScopedHandler.java:188)
build 12-Dec-2018 17:17:20 at org.seleniumhq.jetty9.server.handler.ContextHandler.doHandle(ContextHandler.java:1253)
build 12-Dec-2018 17:17:20 at org.seleniumhq.jetty9.server.handler.ScopedHandler.nextScope(ScopedHandler.java:168)
build 12-Dec-2018 17:17:20 at org.seleniumhq.jetty9.servlet.ServletHandler.doScope(ServletHandler.java:473)
build 12-Dec-2018 17:17:20 at org.seleniumhq.jetty9.server.session.SessionHandler.doScope(SessionHandler.java:1564)
build 12-Dec-2018 17:17:20 at org.seleniumhq.jetty9.server.handler.ScopedHandler.nextScope(ScopedHandler.java:166)
build 12-Dec-2018 17:17:20 at org.seleniumhq.jetty9.server.handler.ContextHandler.doScope(ContextHandler.java:1155)
build 12-Dec-2018 17:17:20 at org.seleniumhq.jetty9.server.handler.ScopedHandler.handle(ScopedHandler.java:141)
build 12-Dec-2018 17:17:20 at org.seleniumhq.jetty9.server.handler.HandlerWrapper.handle(HandlerWrapper.java:132)
build 12-Dec-2018 17:17:20 at org.seleniumhq.jetty9.server.Server.handle(Server.java:530)
build 12-Dec-2018 17:17:20 at org.seleniumhq.jetty9.server.HttpChannel.handle(HttpChannel.java:347)
build 12-Dec-2018 17:17:20 at org.seleniumhq.jetty9.server.HttpConnection.onFillable(HttpConnection.java:256)
build 12-Dec-2018 17:17:20 at org.seleniumhq.jetty9.io.AbstractConnection$ReadCallback.succeeded(AbstractConnection.java:279)
build 12-Dec-2018 17:17:20 at org.seleniumhq.jetty9.io.FillInterest.fillable(FillInterest.java:102)
build 12-Dec-2018 17:17:20 at org.seleniumhq.jetty9.io.ChannelEndPoint$2.run(ChannelEndPoint.java:124)
build 12-Dec-2018 17:17:20 at org.seleniumhq.jetty9.util.thread.strategy.EatWhatYouKill.doProduce(EatWhatYouKill.java:247)
build 12-Dec-2018 17:17:20 at org.seleniumhq.jetty9.util.thread.strategy.EatWhatYouKill.produce(EatWhatYouKill.java:140)
build 12-Dec-2018 17:17:20 at org.seleniumhq.jetty9.util.thread.strategy.EatWhatYouKill.run(EatWhatYouKill.java:131)
build 12-Dec-2018 17:17:20 at org.seleniumhq.jetty9.util.thread.ReservedThreadExecutor$ReservedThread.run(ReservedThreadExecutor.java:382)
build 12-Dec-2018 17:17:20 at org.seleniumhq.jetty9.util.thread.QueuedThreadPool.runJob(QueuedThreadPool.java:708)
build 12-Dec-2018 17:17:20 at org.seleniumhq.jetty9.util.thread.QueuedThreadPool$2.run(QueuedThreadPool.java:626)
build 12-Dec-2018 17:17:20 at java.lang.Thread.run(Thread.java:748)
build 12-Dec-2018 17:17:20 Caused by: java.lang.IllegalArgumentException: Illegal key values seen in w3c capabilities: [platform]
build 12-Dec-2018 17:17:20 at org.openqa.selenium.remote.NewSessionPayload.lambda$validate$5(NewSessionPayload.java:197)
build 12-Dec-2018 17:17:20 at java.util.stream.ReferencePipeline$11$1.accept(ReferencePipeline.java:372)
build 12-Dec-2018 17:17:20 at java.util.stream.ReferencePipeline$11$1.accept(ReferencePipeline.java:373)
build 12-Dec-2018 17:17:20 at java.util.stream.ReferencePipeline$3$1.accept(ReferencePipeline.java:193)
build 12-Dec-2018 17:17:20 at java.util.stream.ReferencePipeline$11$1.accept(ReferencePipeline.java:373)
build 12-Dec-2018 17:17:20 at java.util.ArrayList$ArrayListSpliterator.forEachRemaining(ArrayList.java:1382)
build 12-Dec-2018 17:17:20 at java.util.stream.AbstractPipeline.copyInto(AbstractPipeline.java:481)
build 12-Dec-2018 17:17:20 at java.util.stream.AbstractPipeline.wrapAndCopyInto(AbstractPipeline.java:471)
build 12-Dec-2018 17:17:20 at java.util.stream.ForEachOps$ForEachOp.evaluateSequential(ForEachOps.java:151)
build 12-Dec-2018 17:17:20 at java.util.stream.ForEachOps$ForEachOp$OfRef.evaluateSequential(ForEachOps.java:174)
build 12-Dec-2018 17:17:20 at java.util.stream.AbstractPipeline.evaluate(AbstractPipeline.java:234)
build 12-Dec-2018 17:17:20 at java.util.stream.ReferencePipeline.forEach(ReferencePipeline.java:418)
build 12-Dec-2018 17:17:20 at org.openqa.selenium.remote.NewSessionPayload.validate(NewSessionPayload.java:201)
build 12-Dec-2018 17:17:20 at org.openqa.selenium.remote.NewSessionPayload.&lt;init&gt;(NewSessionPayload.java:149)
build 12-Dec-2018 17:17:20 at org.openqa.selenium.remote.NewSessionPayload.create(NewSessionPayload.java:104)
build 12-Dec-2018 17:17:20 at org.openqa.grid.web.servlet.handler.WebDriverRequest.extractDesiredCapability(WebDriverRequest.java:66)
build 12-Dec-2018 17:17:20 ... 37 more
build 12-Dec-2018 17:17:20 </pre>
build 12-Dec-2018 17:17:20 <h3>Caused by:</h3><pre>java.lang.IllegalArgumentException: Illegal key values seen in w3c capabilities: [platform]
build 12-Dec-2018 17:17:20 at org.openqa.selenium.remote.NewSessionPayload.lambda$validate$5(NewSessionPayload.java:197)
build 12-Dec-2018 17:17:20 at java.util.stream.ReferencePipeline$11$1.accept(ReferencePipeline.java:372)
build 12-Dec-2018 17:17:20 at java.util.stream.ReferencePipeline$11$1.accept(ReferencePipeline.java:373)
build 12-Dec-2018 17:17:20 at java.util.stream.ReferencePipeline$3$1.accept(ReferencePipeline.java:193)
build 12-Dec-2018 17:17:20 at java.util.stream.ReferencePipeline$11$1.accept(ReferencePipeline.java:373)
build 12-Dec-2018 17:17:20 at java.util.ArrayList$ArrayListSpliterator.forEachRemaining(ArrayList.java:1382)
build 12-Dec-2018 17:17:20 at java.util.stream.AbstractPipeline.copyInto(AbstractPipeline.java:481)
build 12-Dec-2018 17:17:20 at java.util.stream.AbstractPipeline.wrapAndCopyInto(AbstractPipeline.java:471)
build 12-Dec-2018 17:17:20 at java.util.stream.ForEachOps$ForEachOp.evaluateSequential(ForEachOps.java:151)
build 12-Dec-2018 17:17:20 at java.util.stream.ForEachOps$ForEachOp$OfRef.evaluateSequential(ForEachOps.java:174)
build 12-Dec-2018 17:17:20 at java.util.stream.AbstractPipeline.evaluate(AbstractPipeline.java:234)
build 12-Dec-2018 17:17:20 at java.util.stream.ReferencePipeline.forEach(ReferencePipeline.java:418)
build 12-Dec-2018 17:17:20 at org.openqa.selenium.remote.NewSessionPayload.validate(NewSessionPayload.java:201)
build 12-Dec-2018 17:17:20 at org.openqa.selenium.remote.NewSessionPayload.&lt;init&gt;(NewSessionPayload.java:149)
build 12-Dec-2018 17:17:20 at org.openqa.selenium.remote.NewSessionPayload.create(NewSessionPayload.java:104)
build 12-Dec-2018 17:17:20 at org.openqa.grid.web.servlet.handler.WebDriverRequest.extractDesiredCapability(WebDriverRequest.java:66)
build 12-Dec-2018 17:17:20 at org.openqa.grid.web.servlet.handler.SeleniumBasedRequest.&lt;init&gt;(SeleniumBasedRequest.java:102)
build 12-Dec-2018 17:17:20 at org.openqa.grid.web.servlet.handler.WebDriverRequest.&lt;init&gt;(WebDriverRequest.java:36)
build 12-Dec-2018 17:17:20 at org.openqa.grid.web.servlet.handler.WebDriverRequestFactory.createFromRequest(WebDriverRequestFactory.java:30)
build 12-Dec-2018 17:17:20 at org.openqa.grid.web.servlet.handler.SeleniumBasedRequest.createFromRequest(SeleniumBasedRequest.java:73)
build 12-Dec-2018 17:17:20 at org.openqa.grid.web.servlet.DriverServlet.process(DriverServlet.java:84)
build 12-Dec-2018 17:17:20 at org.openqa.grid.web.servlet.DriverServlet.doPost(DriverServlet.java:70)
build 12-Dec-2018 17:17:20 at javax.servlet.http.HttpServlet.service(HttpServlet.java:707)
build 12-Dec-2018 17:17:20 at javax.servlet.http.HttpServlet.service(HttpServlet.java:790)
build 12-Dec-2018 17:17:20 at org.seleniumhq.jetty9.servlet.ServletHolder.handle(ServletHolder.java:860)
build 12-Dec-2018 17:17:20 at org.seleniumhq.jetty9.servlet.ServletHandler.doHandle(ServletHandler.java:535)
build 12-Dec-2018 17:17:20 at org.seleniumhq.jetty9.server.handler.ScopedHandler.handle(ScopedHandler.java:143)
build 12-Dec-2018 17:17:20 at org.seleniumhq.jetty9.security.SecurityHandler.handle(SecurityHandler.java:548)
build 12-Dec-2018 17:17:20 at org.seleniumhq.jetty9.server.handler.HandlerWrapper.handle(HandlerWrapper.java:132)
build 12-Dec-2018 17:17:20 at org.seleniumhq.jetty9.server.handler.ScopedHandler.nextHandle(ScopedHandler.java:190)
build 12-Dec-2018 17:17:20 at org.seleniumhq.jetty9.server.session.SessionHandler.doHandle(SessionHandler.java:1595)
build 12-Dec-2018 17:17:20 at org.seleniumhq.jetty9.server.handler.ScopedHandler.nextHandle(ScopedHandler.java:188)
build 12-Dec-2018 17:17:20 at org.seleniumhq.jetty9.server.handler.ContextHandler.doHandle(ContextHandler.java:1253)
build 12-Dec-2018 17:17:20 at org.seleniumhq.jetty9.server.handler.ScopedHandler.nextScope(ScopedHandler.java:168)
build 12-Dec-2018 17:17:20 at org.seleniumhq.jetty9.servlet.ServletHandler.doScope(ServletHandler.java:473)
build 12-Dec-2018 17:17:20 at org.seleniumhq.jetty9.server.session.SessionHandler.doScope(SessionHandler.java:1564)
build 12-Dec-2018 17:17:20 at org.seleniumhq.jetty9.server.handler.ScopedHandler.nextScope(ScopedHandler.java:166)
build 12-Dec-2018 17:17:20 at org.seleniumhq.jetty9.server.handler.ContextHandler.doScope(ContextHandler.java:1155)
build 12-Dec-2018 17:17:20 at org.seleniumhq.jetty9.server.handler.ScopedHandler.handle(ScopedHandler.java:141)
build 12-Dec-2018 17:17:20 at org.seleniumhq.jetty9.server.handler.HandlerWrapper.handle(HandlerWrapper.java:132)
build 12-Dec-2018 17:17:20 at org.seleniumhq.jetty9.server.Server.handle(Server.java:530)
build 12-Dec-2018 17:17:20 at org.seleniumhq.jetty9.server.HttpChannel.handle(HttpChannel.java:347)
build 12-Dec-2018 17:17:20 at org.seleniumhq.jetty9.server.HttpConnection.onFillable(HttpConnection.java:256)
build 12-Dec-2018 17:17:20 at org.seleniumhq.jetty9.io.AbstractConnection$ReadCallback.succeeded(AbstractConnection.java:279)
build 12-Dec-2018 17:17:20 at org.seleniumhq.jetty9.io.FillInterest.fillable(FillInterest.java:102)
build 12-Dec-2018 17:17:20 at org.seleniumhq.jetty9.io.ChannelEndPoint$2.run(ChannelEndPoint.java:124)
build 12-Dec-2018 17:17:20 at org.seleniumhq.jetty9.util.thread.strategy.EatWhatYouKill.doProduce(EatWhatYouKill.java:247)
build 12-Dec-2018 17:17:20 at org.seleniumhq.jetty9.util.thread.strategy.EatWhatYouKill.produce(EatWhatYouKill.java:140)
build 12-Dec-2018 17:17:20 at org.seleniumhq.jetty9.util.thread.strategy.EatWhatYouKill.run(EatWhatYouKill.java:131)
build 12-Dec-2018 17:17:20 at org.seleniumhq.jetty9.util.thread.ReservedThreadExecutor$ReservedThread.run(ReservedThreadExecutor.java:382)
build 12-Dec-2018 17:17:20 at org.seleniumhq.jetty9.util.thread.QueuedThreadPool.runJob(QueuedThreadPool.java:708)
build 12-Dec-2018 17:17:20 at org.seleniumhq.jetty9.util.thread.QueuedThreadPool$2.run(QueuedThreadPool.java:626)
build 12-Dec-2018 17:17:20 at java.lang.Thread.run(Thread.java:748)
build 12-Dec-2018 17:17:20 </pre>
build 12-Dec-2018 17:17:20 <hr><a href="http://eclipse.org/jetty">Powered by Jetty:// 9.4.7.v20170914</a><hr/>
build 12-Dec-2018 17:17:20
build 12-Dec-2018 17:17:20 </body>
build 12-Dec-2018 17:17:20 </html>
build 12-Dec-2018 17:17:20
build 12-Dec-2018 17:17:20 Build info: version: '3.13.0', revision: '2f0d292', time: '2018-06-25T15:24:21.231Z'
build 12-Dec-2018 17:17:20 System info: host: 'c69e564deef1', ip: '10.0.21.13', os.name: 'Linux', os.arch: 'amd64', os.version: '3.10.0-862.3.2.el7.x86_64', java.version: '1.8.0_191'
build 12-Dec-2018 17:17:20 Driver info: driver.version: IOSDriver
build 12-Dec-2018 17:17:20 at org.openqa.selenium.remote.ProtocolHandshake.createSession(ProtocolHandshake.java:111)
build 12-Dec-2018 17:17:20 ... 37 more
build 12-Dec-2018 17:17:20
build 12-Dec-2018 17:17:20
build 12-Dec-2018 17:17:20 #######################
build 12-Dec-2018 17:17:20 ## Last Viewed Tests ##
build 12-Dec-2018 17:17:20 #######################
build 12-Dec-2018 17:17:20 @87888 @Android @iOS @appiumTest
build 12-Dec-2018 17:17:20 Scenario: Last Viewed - last viewed module displays # features/Journal.feature:7
build 12-Dec-2018 17:17:20 Given the app has started # LoginSteps.theAppHasStarted()
build 12-Dec-2018 17:17:20 When the User logs in # LoginSteps.theUserLogsIn()
build 12-Dec-2018 17:17:20 And navigates to Journal # JournalSteps.navigatesToJournal()
build 12-Dec-2018 17:17:20 And taps "Last Viewed" on Journal Screen # JournalSteps.tapsOnOnJournalScreen(String)
build 12-Dec-2018 17:17:20 Then observes "Last Viewed Names" displays the current user # JournalSteps.observesDisplaysTheCurrentUser(String)
build 12-Dec-2018 17:17:21
build 12-Dec-2018 17:17:21 Failed scenarios:
build 12-Dec-2018 17:17:21 features/Journal.feature:7 # Scenario: Last Viewed - last viewed module displays
build 12-Dec-2018 17:17:21
build 12-Dec-2018 17:17:21 1 Scenarios (1 failed)
build 12-Dec-2018 17:17:21 5 Steps (5 skipped)
build 12-Dec-2018 17:17:21 0m10.779s
build 12-Dec-2018 17:17:21
build 12-Dec-2018 17:17:21 org.openqa.selenium.WebDriverException: It is impossible to create a new session because 'createSession' which takes HttpClient, InputStream and long was not found or it is not accessible
build 12-Dec-2018 17:17:21 Build info: version: '3.13.0', revision: '2f0d292', time: '2018-06-25T15:24:21.231Z'
build 12-Dec-2018 17:17:21 System info: host: 'c69e564deef1', ip: '10.0.21.13', os.name: 'Linux', os.arch: 'amd64', os.version: '3.10.0-862.3.2.el7.x86_64', java.version: '1.8.0_191'
build 12-Dec-2018 17:17:21 Driver info: driver.version: IOSDriver
build 12-Dec-2018 17:17:21 at io.appium.java_client.remote.AppiumCommandExecutor$1.createSession(AppiumCommandExecutor.java:195)
build 12-Dec-2018 17:17:21 at io.appium.java_client.remote.AppiumCommandExecutor.createSession(AppiumCommandExecutor.java:209)
build 12-Dec-2018 17:17:21 at io.appium.java_client.remote.AppiumCommandExecutor.execute(AppiumCommandExecutor.java:231)
build 12-Dec-2018 17:17:21 at org.openqa.selenium.remote.RemoteWebDriver.execute(RemoteWebDriver.java:548)
build 12-Dec-2018 17:17:21 at io.appium.java_client.DefaultGenericMobileDriver.execute(DefaultGenericMobileDriver.java:42)
build 12-Dec-2018 17:17:21 at io.appium.java_client.AppiumDriver.execute(AppiumDriver.java:1)
build 12-Dec-2018 17:17:21 at io.appium.java_client.ios.IOSDriver.execute(IOSDriver.java:1)
build 12-Dec-2018 17:17:21 at org.openqa.selenium.remote.RemoteWebDriver.startSession(RemoteWebDriver.java:212)
build 12-Dec-2018 17:17:21 at org.openqa.selenium.remote.RemoteWebDriver.<init>(RemoteWebDriver.java:130)
build 12-Dec-2018 17:17:21 at io.appium.java_client.DefaultGenericMobileDriver.<init>(DefaultGenericMobileDriver.java:38)
build 12-Dec-2018 17:17:21 at io.appium.java_client.AppiumDriver.<init>(AppiumDriver.java:84)
build 12-Dec-2018 17:17:21 at io.appium.java_client.AppiumDriver.<init>(AppiumDriver.java:94)
build 12-Dec-2018 17:17:21 at io.appium.java_client.ios.IOSDriver.<init>(IOSDriver.java:95)
build 12-Dec-2018 17:17:21 at cucumber.driver.Factory.createPlatformDriver(Factory.java:54)
build 12-Dec-2018 17:17:21 at cucumber.driver.Factory.createDriverWithLatestAppBuild(Factory.java:36)
build 12-Dec-2018 17:17:21 at cucumber.driver.Factory.createDriverWithApp(Factory.java:31)
build 12-Dec-2018 17:17:21 at cucumber.support.Hooks.beforeScenario(Hooks.java:55)
build 12-Dec-2018 17:17:21 at sun.reflect.NativeMethodAccessorImpl.invoke0(Native Method)
build 12-Dec-2018 17:17:21 at sun.reflect.NativeMethodAccessorImpl.invoke(NativeMethodAccessorImpl.java:62)
build 12-Dec-2018 17:17:21 at sun.reflect.DelegatingMethodAccessorImpl.invoke(DelegatingMethodAccessorImpl.java:43)
build 12-Dec-2018 17:17:21 at java.lang.reflect.Method.invoke(Method.java:498)
build 12-Dec-2018 17:17:21 at cucumber.runtime.Utils$1.call(Utils.java:40)
build 12-Dec-2018 17:17:21 at cucumber.runtime.Timeout.timeout(Timeout.java:16)
build 12-Dec-2018 17:17:21 at cucumber.runtime.Utils.invoke(Utils.java:34)
build 12-Dec-2018 17:17:21 at cucumber.runtime.java.JavaHookDefinition.execute(JavaHookDefinition.java:60)
build 12-Dec-2018 17:17:21 at cucumber.runtime.Runtime.runHookIfTagsMatch(Runtime.java:224)
build 12-Dec-2018 17:17:21 at cucumber.runtime.Runtime.runHooks(Runtime.java:212)
build 12-Dec-2018 17:17:21 at cucumber.runtime.Runtime.runBeforeHooks(Runtime.java:202)
build 12-Dec-2018 17:17:21 at cucumber.runtime.model.CucumberScenario.run(CucumberScenario.java:40)
build 12-Dec-2018 17:17:21 at cucumber.runtime.model.CucumberFeature.run(CucumberFeature.java:165)
build 12-Dec-2018 17:17:21 at cucumber.runtime.Runtime.run(Runtime.java:122)
build 12-Dec-2018 17:17:21 at cucumber.api.cli.Main.run(Main.java:36)
build 12-Dec-2018 17:17:21 at cucumber.api.cli.Main.main(Main.java:18)
build 12-Dec-2018 17:17:21 Caused by: java.lang.reflect.InvocationTargetException
build 12-Dec-2018 17:17:21 at sun.reflect.NativeMethodAccessorImpl.invoke0(Native Method)
build 12-Dec-2018 17:17:21 at sun.reflect.NativeMethodAccessorImpl.invoke(NativeMethodAccessorImpl.java:62)
build 12-Dec-2018 17:17:21 at sun.reflect.DelegatingMethodAccessorImpl.invoke(DelegatingMethodAccessorImpl.java:43)
build 12-Dec-2018 17:17:21 at java.lang.reflect.Method.invoke(Method.java:498)
build 12-Dec-2018 17:17:21 at io.appium.java_client.remote.AppiumCommandExecutor$1.createSession(AppiumCommandExecutor.java:185)
build 12-Dec-2018 17:17:21 ... 32 more
build 12-Dec-2018 17:17:21 Caused by: org.openqa.selenium.WebDriverException: Unable to parse remote response: <html>
build 12-Dec-2018 17:17:21 <head>
build 12-Dec-2018 17:17:21 <meta http-equiv="Content-Type" content="text/html;charset=utf-8"/>
build 12-Dec-2018 17:17:21 <title>Error 500 Server Error</title>
build 12-Dec-2018 17:17:21 </head>
build 12-Dec-2018 17:17:21 <body><h2>HTTP ERROR 500</h2>
build 12-Dec-2018 17:17:21 <p>Problem accessing /wd/hub/session. Reason:
build 12-Dec-2018 17:17:21 <pre> Server Error</pre></p><h3>Caused by:</h3><pre>java.io.IOException: org.openqa.grid.common.exception.GridException: Cannot extract a capabilities from the request: {
build 12-Dec-2018 17:17:21 &quot;desiredCapabilities&quot;: {
build 12-Dec-2018 17:17:21 &quot;app&quot;: &quot;\u002fUsers\u002fsvctest\u002fappium\u002fmobilev2app\u002fiOS_Automation_Build119\u002fOFWTapQA.ipa&quot;,
build 12-Dec-2018 17:17:21 &quot;showIOSLog&quot;: true,
build 12-Dec-2018 17:17:21 &quot;newCommandTimeout&quot;: 10000,
build 12-Dec-2018 17:17:21 &quot;platformVersion&quot;: &quot;12.1&quot;,
build 12-Dec-2018 17:17:21 &quot;xcodeOrgId&quot;: &quot;66Y9F4A25A&quot;,
build 12-Dec-2018 17:17:21 &quot;automationName&quot;: &quot;XCUITest&quot;,
build 12-Dec-2018 17:17:21 &quot;platformName&quot;: &quot;iOS&quot;,
build 12-Dec-2018 17:17:21 &quot;udid&quot;: &quot;48527f94911a9d6cd0cf1c98fc92061021b5f15c&quot;,
build 12-Dec-2018 17:17:21 &quot;deviceName&quot;: &quot;Gandalf iPad&quot;,
build 12-Dec-2018 17:17:21 &quot;platform&quot;: &quot;MAC&quot;,
build 12-Dec-2018 17:17:21 &quot;xcodeSigningId&quot;: &quot;iPhone Developer&quot;
build 12-Dec-2018 17:17:21 },
build 12-Dec-2018 17:17:21 &quot;capabilities&quot;: {
build 12-Dec-2018 17:17:21 &quot;alwaysMatch&quot;: {
build 12-Dec-2018 17:17:21 &quot;appium:app&quot;: &quot;\u002fUsers\u002fsvctest\u002fappium\u002fmobilev2app\u002fiOS_Automation_Build119\u002fOFWTapQA.ipa&quot;,
build 12-Dec-2018 17:17:21 &quot;appium:automationName&quot;: &quot;XCUITest&quot;,
build 12-Dec-2018 17:17:21 &quot;appium:deviceName&quot;: &quot;Gandalf iPad&quot;,
build 12-Dec-2018 17:17:21 &quot;appium:newCommandTimeout&quot;: 10000,
build 12-Dec-2018 17:17:21 &quot;platform&quot;: &quot;MAC&quot;,
build 12-Dec-2018 17:17:21 &quot;platformName&quot;: &quot;ios&quot;,
build 12-Dec-2018 17:17:21 &quot;appium:platformVersion&quot;: &quot;12.1&quot;,
build 12-Dec-2018 17:17:21 &quot;appium:showIOSLog&quot;: true,
build 12-Dec-2018 17:17:21 &quot;appium:udid&quot;: &quot;48527f94911a9d6cd0cf1c98fc92061021b5f15c&quot;,
build 12-Dec-2018 17:17:21 &quot;appium:xcodeOrgId&quot;: &quot;66Y9F4A25A&quot;,
build 12-Dec-2018 17:17:21 &quot;appium:xcodeSigningId&quot;: &quot;iPhone Developer&quot;
build 12-Dec-2018 17:17:21 },
build 12-Dec-2018 17:17:21 &quot;firstMatch&quot;: [
build 12-Dec-2018 17:17:21 {
build 12-Dec-2018 17:17:21 }
build 12-Dec-2018 17:17:21 ]
build 12-Dec-2018 17:17:21 }
build 12-Dec-2018 17:17:21 }
build 12-Dec-2018 17:17:21 at org.openqa.grid.web.servlet.DriverServlet.process(DriverServlet.java:137)
build 12-Dec-2018 17:17:21 at org.openqa.grid.web.servlet.DriverServlet.doPost(DriverServlet.java:70)
build 12-Dec-2018 17:17:21 at javax.servlet.http.HttpServlet.service(HttpServlet.java:707)
build 12-Dec-2018 17:17:21 at javax.servlet.http.HttpServlet.service(HttpServlet.java:790)
build 12-Dec-2018 17:17:21 at org.seleniumhq.jetty9.servlet.ServletHolder.handle(ServletHolder.java:860)
build 12-Dec-2018 17:17:21 at org.seleniumhq.jetty9.servlet.ServletHandler.doHandle(ServletHandler.java:535)
build 12-Dec-2018 17:17:21 at org.seleniumhq.jetty9.server.handler.ScopedHandler.handle(ScopedHandler.java:143)
build 12-Dec-2018 17:17:21 at org.seleniumhq.jetty9.security.SecurityHandler.handle(SecurityHandler.java:548)
build 12-Dec-2018 17:17:21 at org.seleniumhq.jetty9.server.handler.HandlerWrapper.handle(HandlerWrapper.java:132)
build 12-Dec-2018 17:17:21 at org.seleniumhq.jetty9.server.handler.ScopedHandler.nextHandle(ScopedHandler.java:190)
build 12-Dec-2018 17:17:21 at org.seleniumhq.jetty9.server.session.SessionHandler.doHandle(SessionHandler.java:1595)
build 12-Dec-2018 17:17:21 at org.seleniumhq.jetty9.server.handler.ScopedHandler.nextHandle(ScopedHandler.java:188)
build 12-Dec-2018 17:17:21 at org.seleniumhq.jetty9.server.handler.ContextHandler.doHandle(ContextHandler.java:1253)
build 12-Dec-2018 17:17:21 at org.seleniumhq.jetty9.server.handler.ScopedHandler.nextScope(ScopedHandler.java:168)
build 12-Dec-2018 17:17:21 at org.seleniumhq.jetty9.servlet.ServletHandler.doScope(ServletHandler.java:473)
build 12-Dec-2018 17:17:21 at org.seleniumhq.jetty9.server.session.SessionHandler.doScope(SessionHandler.java:1564)
build 12-Dec-2018 17:17:21 at org.seleniumhq.jetty9.server.handler.ScopedHandler.nextScope(ScopedHandler.java:166)
build 12-Dec-2018 17:17:21 at org.seleniumhq.jetty9.server.handler.ContextHandler.doScope(ContextHandler.java:1155)
build 12-Dec-2018 17:17:21 at org.seleniumhq.jetty9.server.handler.ScopedHandler.handle(ScopedHandler.java:141)
build 12-Dec-2018 17:17:21 at org.seleniumhq.jetty9.server.handler.HandlerWrapper.handle(HandlerWrapper.java:132)
build 12-Dec-2018 17:17:21 at org.seleniumhq.jetty9.server.Server.handle(Server.java:530)
build 12-Dec-2018 17:17:21 at org.seleniumhq.jetty9.server.HttpChannel.handle(HttpChannel.java:347)
build 12-Dec-2018 17:17:21 at org.seleniumhq.jetty9.server.HttpConnection.onFillable(HttpConnection.java:256)
build 12-Dec-2018 17:17:21 at org.seleniumhq.jetty9.io.AbstractConnection$ReadCallback.succeeded(AbstractConnection.java:279)
build 12-Dec-2018 17:17:21 at org.seleniumhq.jetty9.io.FillInterest.fillable(FillInterest.java:102)
build 12-Dec-2018 17:17:21 at org.seleniumhq.jetty9.io.ChannelEndPoint$2.run(ChannelEndPoint.java:124)
build 12-Dec-2018 17:17:21 at org.seleniumhq.jetty9.util.thread.strategy.EatWhatYouKill.doProduce(EatWhatYouKill.java:247)
build 12-Dec-2018 17:17:21 at org.seleniumhq.jetty9.util.thread.strategy.EatWhatYouKill.produce(EatWhatYouKill.java:140)
build 12-Dec-2018 17:17:21 at org.seleniumhq.jetty9.util.thread.strategy.EatWhatYouKill.run(EatWhatYouKill.java:131)
build 12-Dec-2018 17:17:21 at org.seleniumhq.jetty9.util.thread.ReservedThreadExecutor$ReservedThread.run(ReservedThreadExecutor.java:382)
build 12-Dec-2018 17:17:21 at org.seleniumhq.jetty9.util.thread.QueuedThreadPool.runJob(QueuedThreadPool.java:708)
build 12-Dec-2018 17:17:21 at org.seleniumhq.jetty9.util.thread.QueuedThreadPool$2.run(QueuedThreadPool.java:626)
build 12-Dec-2018 17:17:21 at java.lang.Thread.run(Thread.java:748)
build 12-Dec-2018 17:17:21 Caused by: org.openqa.grid.common.exception.GridException: Cannot extract a capabilities from the request: {
build 12-Dec-2018 17:17:21 &quot;desiredCapabilities&quot;: {
build 12-Dec-2018 17:17:21 &quot;app&quot;: &quot;\u002fUsers\u002fsvctest\u002fappium\u002fmobilev2app\u002fiOS_Automation_Build119\u002fOFWTapQA.ipa&quot;,
build 12-Dec-2018 17:17:21 &quot;showIOSLog&quot;: true,
build 12-Dec-2018 17:17:21 &quot;newCommandTimeout&quot;: 10000,
build 12-Dec-2018 17:17:21 &quot;platformVersion&quot;: &quot;12.1&quot;,
build 12-Dec-2018 17:17:21 &quot;xcodeOrgId&quot;: &quot;66Y9F4A25A&quot;,
build 12-Dec-2018 17:17:21 &quot;automationName&quot;: &quot;XCUITest&quot;,
build 12-Dec-2018 17:17:21 &quot;platformName&quot;: &quot;iOS&quot;,
build 12-Dec-2018 17:17:21 &quot;udid&quot;: &quot;48527f94911a9d6cd0cf1c98fc92061021b5f15c&quot;,
build 12-Dec-2018 17:17:21 &quot;deviceName&quot;: &quot;Gandalf iPad&quot;,
build 12-Dec-2018 17:17:21 &quot;platform&quot;: &quot;MAC&quot;,
build 12-Dec-2018 17:17:21 &quot;xcodeSigningId&quot;: &quot;iPhone Developer&quot;
build 12-Dec-2018 17:17:21 },
build 12-Dec-2018 17:17:21 &quot;capabilities&quot;: {
build 12-Dec-2018 17:17:21 &quot;alwaysMatch&quot;: {
build 12-Dec-2018 17:17:21 &quot;appium:app&quot;: &quot;\u002fUsers\u002fsvctest\u002fappium\u002fmobilev2app\u002fiOS_Automation_Build119\u002fOFWTapQA.ipa&quot;,
build 12-Dec-2018 17:17:21 &quot;appium:automationName&quot;: &quot;XCUITest&quot;,
build 12-Dec-2018 17:17:21 &quot;appium:deviceName&quot;: &quot;Gandalf iPad&quot;,
build 12-Dec-2018 17:17:21 &quot;appium:newCommandTimeout&quot;: 10000,
build 12-Dec-2018 17:17:21 &quot;platform&quot;: &quot;MAC&quot;,
build 12-Dec-2018 17:17:21 &quot;platformName&quot;: &quot;ios&quot;,
build 12-Dec-2018 17:17:21 &quot;appium:platformVersion&quot;: &quot;12.1&quot;,
build 12-Dec-2018 17:17:21 &quot;appium:showIOSLog&quot;: true,
build 12-Dec-2018 17:17:21 &quot;appium:udid&quot;: &quot;48527f94911a9d6cd0cf1c98fc92061021b5f15c&quot;,
build 12-Dec-2018 17:17:21 &quot;appium:xcodeOrgId&quot;: &quot;66Y9F4A25A&quot;,
build 12-Dec-2018 17:17:21 &quot;appium:xcodeSigningId&quot;: &quot;iPhone Developer&quot;
build 12-Dec-2018 17:17:21 },
build 12-Dec-2018 17:17:21 &quot;firstMatch&quot;: [
build 12-Dec-2018 17:17:21 {
build 12-Dec-2018 17:17:21 }
build 12-Dec-2018 17:17:21 ]
build 12-Dec-2018 17:17:21 }
build 12-Dec-2018 17:17:21 }
build 12-Dec-2018 17:17:21 at org.openqa.grid.web.servlet.handler.WebDriverRequest.extractDesiredCapability(WebDriverRequest.java:76)
build 12-Dec-2018 17:17:21 at org.openqa.grid.web.servlet.handler.SeleniumBasedRequest.&lt;init&gt;(SeleniumBasedRequest.java:102)
build 12-Dec-2018 17:17:21 at org.openqa.grid.web.servlet.handler.WebDriverRequest.&lt;init&gt;(WebDriverRequest.java:36)
build 12-Dec-2018 17:17:21 at org.openqa.grid.web.servlet.handler.WebDriverRequestFactory.createFromRequest(WebDriverRequestFactory.java:30)
build 12-Dec-2018 17:17:21 at org.openqa.grid.web.servlet.handler.SeleniumBasedRequest.createFromRequest(SeleniumBasedRequest.java:73)
build 12-Dec-2018 17:17:21 at org.openqa.grid.web.servlet.DriverServlet.process(DriverServlet.java:84)
build 12-Dec-2018 17:17:21 ... 32 more
build 12-Dec-2018 17:17:21 Caused by: java.lang.IllegalArgumentException: Illegal key values seen in w3c capabilities: [platform]
build 12-Dec-2018 17:17:21 at org.openqa.selenium.remote.NewSessionPayload.lambda$validate$5(NewSessionPayload.java:197)
build 12-Dec-2018 17:17:21 at java.util.stream.ReferencePipeline$11$1.accept(ReferencePipeline.java:372)
build 12-Dec-2018 17:17:21 at java.util.stream.ReferencePipeline$11$1.accept(ReferencePipeline.java:373)
build 12-Dec-2018 17:17:21 at java.util.stream.ReferencePipeline$3$1.accept(ReferencePipeline.java:193)
build 12-Dec-2018 17:17:21 at java.util.stream.ReferencePipeline$11$1.accept(ReferencePipeline.java:373)
build 12-Dec-2018 17:17:21 at java.util.ArrayList$ArrayListSpliterator.forEachRemaining(ArrayList.java:1382)
build 12-Dec-2018 17:17:21 at java.util.stream.AbstractPipeline.copyInto(AbstractPipeline.java:481)
build 12-Dec-2018 17:17:21 at java.util.stream.AbstractPipeline.wrapAndCopyInto(AbstractPipeline.java:471)
build 12-Dec-2018 17:17:21 at java.util.stream.ForEachOps$ForEachOp.evaluateSequential(ForEachOps.java:151)
build 12-Dec-2018 17:17:21 at java.util.stream.ForEachOps$ForEachOp$OfRef.evaluateSequential(ForEachOps.java:174)
build 12-Dec-2018 17:17:21 at java.util.stream.AbstractPipeline.evaluate(AbstractPipeline.java:234)
build 12-Dec-2018 17:17:21 at java.util.stream.ReferencePipeline.forEach(ReferencePipeline.java:418)
build 12-Dec-2018 17:17:21 at org.openqa.selenium.remote.NewSessionPayload.validate(NewSessionPayload.java:201)
build 12-Dec-2018 17:17:21 at org.openqa.selenium.remote.NewSessionPayload.&lt;init&gt;(NewSessionPayload.java:149)
build 12-Dec-2018 17:17:21 at org.openqa.selenium.remote.NewSessionPayload.create(NewSessionPayload.java:104)
build 12-Dec-2018 17:17:21 at org.openqa.grid.web.servlet.handler.WebDriverRequest.extractDesiredCapability(WebDriverRequest.java:66)
build 12-Dec-2018 17:17:21 ... 37 more
build 12-Dec-2018 17:17:21 </pre>
build 12-Dec-2018 17:17:21 <h3>Caused by:</h3><pre>org.openqa.grid.common.exception.GridException: Cannot extract a capabilities from the request: {
build 12-Dec-2018 17:17:21 &quot;desiredCapabilities&quot;: {
build 12-Dec-2018 17:17:21 &quot;app&quot;: &quot;\u002fUsers\u002fsvctest\u002fappium\u002fmobilev2app\u002fiOS_Automation_Build119\u002fOFWTapQA.ipa&quot;,
build 12-Dec-2018 17:17:21 &quot;showIOSLog&quot;: true,
build 12-Dec-2018 17:17:21 &quot;newCommandTimeout&quot;: 10000,
build 12-Dec-2018 17:17:21 &quot;platformVersion&quot;: &quot;12.1&quot;,
build 12-Dec-2018 17:17:21 &quot;xcodeOrgId&quot;: &quot;66Y9F4A25A&quot;,
build 12-Dec-2018 17:17:21 &quot;automationName&quot;: &quot;XCUITest&quot;,
build 12-Dec-2018 17:17:21 &quot;platformName&quot;: &quot;iOS&quot;,
build 12-Dec-2018 17:17:21 &quot;udid&quot;: &quot;48527f94911a9d6cd0cf1c98fc92061021b5f15c&quot;,
build 12-Dec-2018 17:17:21 &quot;deviceName&quot;: &quot;Gandalf iPad&quot;,
build 12-Dec-2018 17:17:21 &quot;platform&quot;: &quot;MAC&quot;,
build 12-Dec-2018 17:17:21 &quot;xcodeSigningId&quot;: &quot;iPhone Developer&quot;
build 12-Dec-2018 17:17:21 },
build 12-Dec-2018 17:17:21 &quot;capabilities&quot;: {
build 12-Dec-2018 17:17:21 &quot;alwaysMatch&quot;: {
build 12-Dec-2018 17:17:21 &quot;appium:app&quot;: &quot;\u002fUsers\u002fsvctest\u002fappium\u002fmobilev2app\u002fiOS_Automation_Build119\u002fOFWTapQA.ipa&quot;,
build 12-Dec-2018 17:17:21 &quot;appium:automationName&quot;: &quot;XCUITest&quot;,
build 12-Dec-2018 17:17:21 &quot;appium:deviceName&quot;: &quot;Gandalf iPad&quot;,
build 12-Dec-2018 17:17:21 &quot;appium:newCommandTimeout&quot;: 10000,
build 12-Dec-2018 17:17:21 &quot;platform&quot;: &quot;MAC&quot;,
build 12-Dec-2018 17:17:21 &quot;platformName&quot;: &quot;ios&quot;,
build 12-Dec-2018 17:17:21 &quot;appium:platformVersion&quot;: &quot;12.1&quot;,
build 12-Dec-2018 17:17:21 &quot;appium:showIOSLog&quot;: true,
build 12-Dec-2018 17:17:21 &quot;appium:udid&quot;: &quot;48527f94911a9d6cd0cf1c98fc92061021b5f15c&quot;,
build 12-Dec-2018 17:17:21 &quot;appium:xcodeOrgId&quot;: &quot;66Y9F4A25A&quot;,
build 12-Dec-2018 17:17:21 &quot;appium:xcodeSigningId&quot;: &quot;iPhone Developer&quot;
build 12-Dec-2018 17:17:21 },
build 12-Dec-2018 17:17:21 &quot;firstMatch&quot;: [
build 12-Dec-2018 17:17:21 {
build 12-Dec-2018 17:17:21 }
build 12-Dec-2018 17:17:21 ]
build 12-Dec-2018 17:17:21 }
build 12-Dec-2018 17:17:21 }
build 12-Dec-2018 17:17:21 at org.openqa.grid.web.servlet.handler.WebDriverRequest.extractDesiredCapability(WebDriverRequest.java:76)
build 12-Dec-2018 17:17:21 at org.openqa.grid.web.servlet.handler.SeleniumBasedRequest.&lt;init&gt;(SeleniumBasedRequest.java:102)
build 12-Dec-2018 17:17:21 at org.openqa.grid.web.servlet.handler.WebDriverRequest.&lt;init&gt;(WebDriverRequest.java:36)
build 12-Dec-2018 17:17:21 at org.openqa.grid.web.servlet.handler.WebDriverRequestFactory.createFromRequest(WebDriverRequestFactory.java:30)
build 12-Dec-2018 17:17:21 at org.openqa.grid.web.servlet.handler.SeleniumBasedRequest.createFromRequest(SeleniumBasedRequest.java:73)
build 12-Dec-2018 17:17:21 at org.openqa.grid.web.servlet.DriverServlet.process(DriverServlet.java:84)
build 12-Dec-2018 17:17:21 at org.openqa.grid.web.servlet.DriverServlet.doPost(DriverServlet.java:70)
build 12-Dec-2018 17:17:21 at javax.servlet.http.HttpServlet.service(HttpServlet.java:707)
build 12-Dec-2018 17:17:21 at javax.servlet.http.HttpServlet.service(HttpServlet.java:790)
build 12-Dec-2018 17:17:21 at org.seleniumhq.jetty9.servlet.ServletHolder.handle(ServletHolder.java:860)
build 12-Dec-2018 17:17:21 at org.seleniumhq.jetty9.servlet.ServletHandler.doHandle(ServletHandler.java:535)
build 12-Dec-2018 17:17:21 at org.seleniumhq.jetty9.server.handler.ScopedHandler.handle(ScopedHandler.java:143)
build 12-Dec-2018 17:17:21 at org.seleniumhq.jetty9.security.SecurityHandler.handle(SecurityHandler.java:548)
build 12-Dec-2018 17:17:21 at org.seleniumhq.jetty9.server.handler.HandlerWrapper.handle(HandlerWrapper.java:132)
build 12-Dec-2018 17:17:21 at org.seleniumhq.jetty9.server.handler.ScopedHandler.nextHandle(ScopedHandler.java:190)
build 12-Dec-2018 17:17:21 at org.seleniumhq.jetty9.server.session.SessionHandler.doHandle(SessionHandler.java:1595)
build 12-Dec-2018 17:17:21 at org.seleniumhq.jetty9.server.handler.ScopedHandler.nextHandle(ScopedHandler.java:188)
build 12-Dec-2018 17:17:21 at org.seleniumhq.jetty9.server.handler.ContextHandler.doHandle(ContextHandler.java:1253)
build 12-Dec-2018 17:17:21 at org.seleniumhq.jetty9.server.handler.ScopedHandler.nextScope(ScopedHandler.java:168)
build 12-Dec-2018 17:17:21 at org.seleniumhq.jetty9.servlet.ServletHandler.doScope(ServletHandler.java:473)
build 12-Dec-2018 17:17:21 at org.seleniumhq.jetty9.server.session.SessionHandler.doScope(SessionHandler.java:1564)
build 12-Dec-2018 17:17:21 at org.seleniumhq.jetty9.server.handler.ScopedHandler.nextScope(ScopedHandler.java:166)
build 12-Dec-2018 17:17:21 at org.seleniumhq.jetty9.server.handler.ContextHandler.doScope(ContextHandler.java:1155)
build 12-Dec-2018 17:17:21 at org.seleniumhq.jetty9.server.handler.ScopedHandler.handle(ScopedHandler.java:141)
build 12-Dec-2018 17:17:21 at org.seleniumhq.jetty9.server.handler.HandlerWrapper.handle(HandlerWrapper.java:132)
build 12-Dec-2018 17:17:21 at org.seleniumhq.jetty9.server.Server.handle(Server.java:530)
build 12-Dec-2018 17:17:21 at org.seleniumhq.jetty9.server.HttpChannel.handle(HttpChannel.java:347)
build 12-Dec-2018 17:17:21 at org.seleniumhq.jetty9.server.HttpConnection.onFillable(HttpConnection.java:256)
build 12-Dec-2018 17:17:21 at org.seleniumhq.jetty9.io.AbstractConnection$ReadCallback.succeeded(AbstractConnection.java:279)
build 12-Dec-2018 17:17:21 at org.seleniumhq.jetty9.io.FillInterest.fillable(FillInterest.java:102)
build 12-Dec-2018 17:17:21 at org.seleniumhq.jetty9.io.ChannelEndPoint$2.run(ChannelEndPoint.java:124)
build 12-Dec-2018 17:17:21 at org.seleniumhq.jetty9.util.thread.strategy.EatWhatYouKill.doProduce(EatWhatYouKill.java:247)
build 12-Dec-2018 17:17:21 at org.seleniumhq.jetty9.util.thread.strategy.EatWhatYouKill.produce(EatWhatYouKill.java:140)
build 12-Dec-2018 17:17:21 at org.seleniumhq.jetty9.util.thread.strategy.EatWhatYouKill.run(EatWhatYouKill.java:131)
build 12-Dec-2018 17:17:21 at org.seleniumhq.jetty9.util.thread.ReservedThreadExecutor$ReservedThread.run(ReservedThreadExecutor.java:382)
build 12-Dec-2018 17:17:21 at org.seleniumhq.jetty9.util.thread.QueuedThreadPool.runJob(QueuedThreadPool.java:708)
build 12-Dec-2018 17:17:21 at org.seleniumhq.jetty9.util.thread.QueuedThreadPool$2.run(QueuedThreadPool.java:626)
build 12-Dec-2018 17:17:21 at java.lang.Thread.run(Thread.java:748)
build 12-Dec-2018 17:17:21 Caused by: java.lang.IllegalArgumentException: Illegal key values seen in w3c capabilities: [platform]
build 12-Dec-2018 17:17:21 at org.openqa.selenium.remote.NewSessionPayload.lambda$validate$5(NewSessionPayload.java:197)
build 12-Dec-2018 17:17:21 at java.util.stream.ReferencePipeline$11$1.accept(ReferencePipeline.java:372)
build 12-Dec-2018 17:17:21 at java.util.stream.ReferencePipeline$11$1.accept(ReferencePipeline.java:373)
build 12-Dec-2018 17:17:21 at java.util.stream.ReferencePipeline$3$1.accept(ReferencePipeline.java:193)
build 12-Dec-2018 17:17:21 at java.util.stream.ReferencePipeline$11$1.accept(ReferencePipeline.java:373)
build 12-Dec-2018 17:17:21 at java.util.ArrayList$ArrayListSpliterator.forEachRemaining(ArrayList.java:1382)
build 12-Dec-2018 17:17:21 at java.util.stream.AbstractPipeline.copyInto(AbstractPipeline.java:481)
build 12-Dec-2018 17:17:21 at java.util.stream.AbstractPipeline.wrapAndCopyInto(AbstractPipeline.java:471)
build 12-Dec-2018 17:17:21 at java.util.stream.ForEachOps$ForEachOp.evaluateSequential(ForEachOps.java:151)
build 12-Dec-2018 17:17:21 at java.util.stream.ForEachOps$ForEachOp$OfRef.evaluateSequential(ForEachOps.java:174)
build 12-Dec-2018 17:17:21 at java.util.stream.AbstractPipeline.evaluate(AbstractPipeline.java:234)
build 12-Dec-2018 17:17:21 at java.util.stream.ReferencePipeline.forEach(ReferencePipeline.java:418)
build 12-Dec-2018 17:17:21 at org.openqa.selenium.remote.NewSessionPayload.validate(NewSessionPayload.java:201)
build 12-Dec-2018 17:17:21 at org.openqa.selenium.remote.NewSessionPayload.&lt;init&gt;(NewSessionPayload.java:149)
build 12-Dec-2018 17:17:21 at org.openqa.selenium.remote.NewSessionPayload.create(NewSessionPayload.java:104)
build 12-Dec-2018 17:17:21 at org.openqa.grid.web.servlet.handler.WebDriverRequest.extractDesiredCapability(WebDriverRequest.java:66)
build 12-Dec-2018 17:17:21 ... 37 more
build 12-Dec-2018 17:17:21 </pre>
build 12-Dec-2018 17:17:21 <h3>Caused by:</h3><pre>java.lang.IllegalArgumentException: Illegal key values seen in w3c capabilities: [platform]
build 12-Dec-2018 17:17:21 at org.openqa.selenium.remote.NewSessionPayload.lambda$validate$5(NewSessionPayload.java:197)
build 12-Dec-2018 17:17:21 at java.util.stream.ReferencePipeline$11$1.accept(ReferencePipeline.java:372)
build 12-Dec-2018 17:17:21 at java.util.stream.ReferencePipeline$11$1.accept(ReferencePipeline.java:373)
build 12-Dec-2018 17:17:21 at java.util.stream.ReferencePipeline$3$1.accept(ReferencePipeline.java:193)
build 12-Dec-2018 17:17:21 at java.util.stream.ReferencePipeline$11$1.accept(ReferencePipeline.java:373)
build 12-Dec-2018 17:17:21 at java.util.ArrayList$ArrayListSpliterator.forEachRemaining(ArrayList.java:1382)
build 12-Dec-2018 17:17:21 at java.util.stream.AbstractPipeline.copyInto(AbstractPipeline.java:481)
build 12-Dec-2018 17:17:21 at java.util.stream.AbstractPipeline.wrapAndCopyInto(AbstractPipeline.java:471)
build 12-Dec-2018 17:17:21 at java.util.stream.ForEachOps$ForEachOp.evaluateSequential(ForEachOps.java:151)
build 12-Dec-2018 17:17:21 at java.util.stream.ForEachOps$ForEachOp$OfRef.evaluateSequential(ForEachOps.java:174)
build 12-Dec-2018 17:17:21 at java.util.stream.AbstractPipeline.evaluate(AbstractPipeline.java:234)
build 12-Dec-2018 17:17:21 at java.util.stream.ReferencePipeline.forEach(ReferencePipeline.java:418)
build 12-Dec-2018 17:17:21 at org.openqa.selenium.remote.NewSessionPayload.validate(NewSessionPayload.java:201)
build 12-Dec-2018 17:17:21 at org.openqa.selenium.remote.NewSessionPayload.&lt;init&gt;(NewSessionPayload.java:149)
build 12-Dec-2018 17:17:21 at org.openqa.selenium.remote.NewSessionPayload.create(NewSessionPayload.java:104)
build 12-Dec-2018 17:17:21 at org.openqa.grid.web.servlet.handler.WebDriverRequest.extractDesiredCapability(WebDriverRequest.java:66)
build 12-Dec-2018 17:17:21 at org.openqa.grid.web.servlet.handler.SeleniumBasedRequest.&lt;init&gt;(SeleniumBasedRequest.java:102)
build 12-Dec-2018 17:17:21 at org.openqa.grid.web.servlet.handler.WebDriverRequest.&lt;init&gt;(WebDriverRequest.java:36)
build 12-Dec-2018 17:17:21 at org.openqa.grid.web.servlet.handler.WebDriverRequestFactory.createFromRequest(WebDriverRequestFactory.java:30)
build 12-Dec-2018 17:17:21 at org.openqa.grid.web.servlet.handler.SeleniumBasedRequest.createFromRequest(SeleniumBasedRequest.java:73)
build 12-Dec-2018 17:17:21 at org.openqa.grid.web.servlet.DriverServlet.process(DriverServlet.java:84)
build 12-Dec-2018 17:17:21 at org.openqa.grid.web.servlet.DriverServlet.doPost(DriverServlet.java:70)
build 12-Dec-2018 17:17:21 at javax.servlet.http.HttpServlet.service(HttpServlet.java:707)
build 12-Dec-2018 17:17:21 at javax.servlet.http.HttpServlet.service(HttpServlet.java:790)
build 12-Dec-2018 17:17:21 at org.seleniumhq.jetty9.servlet.ServletHolder.handle(ServletHolder.java:860)
build 12-Dec-2018 17:17:21 at org.seleniumhq.jetty9.servlet.ServletHandler.doHandle(ServletHandler.java:535)
build 12-Dec-2018 17:17:21 at org.seleniumhq.jetty9.server.handler.ScopedHandler.handle(ScopedHandler.java:143)
build 12-Dec-2018 17:17:21 at org.seleniumhq.jetty9.security.SecurityHandler.handle(SecurityHandler.java:548)
build 12-Dec-2018 17:17:21 at org.seleniumhq.jetty9.server.handler.HandlerWrapper.handle(HandlerWrapper.java:132)
build 12-Dec-2018 17:17:21 at org.seleniumhq.jetty9.server.handler.ScopedHandler.nextHandle(ScopedHandler.java:190)
build 12-Dec-2018 17:17:21 at org.seleniumhq.jetty9.server.session.SessionHandler.doHandle(SessionHandler.java:1595)
build 12-Dec-2018 17:17:21 at org.seleniumhq.jetty9.server.handler.ScopedHandler.nextHandle(ScopedHandler.java:188)
build 12-Dec-2018 17:17:21 at org.seleniumhq.jetty9.server.handler.ContextHandler.doHandle(ContextHandler.java:1253)
build 12-Dec-2018 17:17:21 at org.seleniumhq.jetty9.server.handler.ScopedHandler.nextScope(ScopedHandler.java:168)
build 12-Dec-2018 17:17:21 at org.seleniumhq.jetty9.servlet.ServletHandler.doScope(ServletHandler.java:473)
build 12-Dec-2018 17:17:21 at org.seleniumhq.jetty9.server.session.SessionHandler.doScope(SessionHandler.java:1564)
build 12-Dec-2018 17:17:21 at org.seleniumhq.jetty9.server.handler.ScopedHandler.nextScope(ScopedHandler.java:166)
build 12-Dec-2018 17:17:21 at org.seleniumhq.jetty9.server.handler.ContextHandler.doScope(ContextHandler.java:1155)
build 12-Dec-2018 17:17:21 at org.seleniumhq.jetty9.server.handler.ScopedHandler.handle(ScopedHandler.java:141)
build 12-Dec-2018 17:17:21 at org.seleniumhq.jetty9.server.handler.HandlerWrapper.handle(HandlerWrapper.java:132)
build 12-Dec-2018 17:17:21 at org.seleniumhq.jetty9.server.Server.handle(Server.java:530)
build 12-Dec-2018 17:17:21 at org.seleniumhq.jetty9.server.HttpChannel.handle(HttpChannel.java:347)
build 12-Dec-2018 17:17:21 at org.seleniumhq.jetty9.server.HttpConnection.onFillable(HttpConnection.java:256)
build 12-Dec-2018 17:17:21 at org.seleniumhq.jetty9.io.AbstractConnection$ReadCallback.succeeded(AbstractConnection.java:279)
build 12-Dec-2018 17:17:21 at org.seleniumhq.jetty9.io.FillInterest.fillable(FillInterest.java:102)
build 12-Dec-2018 17:17:21 at org.seleniumhq.jetty9.io.ChannelEndPoint$2.run(ChannelEndPoint.java:124)
build 12-Dec-2018 17:17:21 at org.seleniumhq.jetty9.util.thread.strategy.EatWhatYouKill.doProduce(EatWhatYouKill.java:247)
build 12-Dec-2018 17:17:21 at org.seleniumhq.jetty9.util.thread.strategy.EatWhatYouKill.produce(EatWhatYouKill.java:140)
build 12-Dec-2018 17:17:21 at org.seleniumhq.jetty9.util.thread.strategy.EatWhatYouKill.run(EatWhatYouKill.java:131)
build 12-Dec-2018 17:17:21 at org.seleniumhq.jetty9.util.thread.ReservedThreadExecutor$ReservedThread.run(ReservedThreadExecutor.java:382)
build 12-Dec-2018 17:17:21 at org.seleniumhq.jetty9.util.thread.QueuedThreadPool.runJob(QueuedThreadPool.java:708)
build 12-Dec-2018 17:17:21 at org.seleniumhq.jetty9.util.thread.QueuedThreadPool$2.run(QueuedThreadPool.java:626)
build 12-Dec-2018 17:17:21 at java.lang.Thread.run(Thread.java:748)
build 12-Dec-2018 17:17:21 </pre>
build 12-Dec-2018 17:17:21 <hr><a href="http://eclipse.org/jetty">Powered by Jetty:// 9.4.7.v20170914</a><hr/>
build 12-Dec-2018 17:17:21
build 12-Dec-2018 17:17:21 </body>
build 12-Dec-2018 17:17:21 </html>
build 12-Dec-2018 17:17:21
build 12-Dec-2018 17:17:21 Build info: version: '3.13.0', revision: '2f0d292', time: '2018-06-25T15:24:21.231Z'
build 12-Dec-2018 17:17:21 System info: host: 'c69e564deef1', ip: '10.0.21.13', os.name: 'Linux', os.arch: 'amd64', os.version: '3.10.0-862.3.2.el7.x86_64', java.version: '1.8.0_191'
build 12-Dec-2018 17:17:21 Driver info: driver.version: IOSDriver
build 12-Dec-2018 17:17:21 at org.openqa.selenium.remote.ProtocolHandshake.createSession(ProtocolHandshake.java:111)
build 12-Dec-2018 17:17:21 ... 37 more
build 12-Dec-2018 17:17:21
build 12-Dec-2018 17:17:21
build 12-Dec-2018 17:17:21 > Task :test FAILED
error 12-Dec-2018 17:17:21
error 12-Dec-2018 17:17:21 FAILURE: Build failed with an exception.
error 12-Dec-2018 17:17:21
error 12-Dec-2018 17:17:21 * Where:
error 12-Dec-2018 17:17:21 Build file '/root/bamboo-agent-home/xml-data/build-dir/AT-MTV179-GANN/build.gradle' line: 32
error 12-Dec-2018 17:17:21
error 12-Dec-2018 17:17:21 * What went wrong:
error 12-Dec-2018 17:17:21 Execution failed for task ':test'.
error 12-Dec-2018 17:17:21 > Process 'command '/usr/lib/jvm/java-8-oracle/bin/java'' finished with non-zero exit value 1
error 12-Dec-2018 17:17:21
error 12-Dec-2018 17:17:21 * Try:
error 12-Dec-2018 17:17:21 Run with --stacktrace option to get the stack trace. Run with --info or --debug option to get more log output. Run with --scan to get full insights.
error 12-Dec-2018 17:17:21
error 12-Dec-2018 17:17:21 * Get more help at https://help.gradle.org
error 12-Dec-2018 17:17:21
error 12-Dec-2018 17:17:21 BUILD FAILED in 17s
build 12-Dec-2018 17:17:21 6 actionable tasks: 5 executed, 1 up-to-date
simple 12-Dec-2018 17:17:21 Finished task 'Run Tests' with result: Success
command 12-Dec-2018 17:17:21 Substituting variable: ${bamboo.portal} with QA iOS Mobilev2
command 12-Dec-2018 17:17:21 Substituting variable: ${bamboo.jira.username} with qaimac
command 12-Dec-2018 17:17:21 Substituting password variable: ${bamboo.jira.password}
simple 12-Dec-2018 17:17:21 Starting task 'Upload Execution Results to Jira' of type 'com.atlassian.bamboo.plugins.scripttask:task.builder.script'
command 12-Dec-2018 17:17:21 Beginning to execute external process for build 'Automation Tests - QA - Parent Portal iOS Tests CI - newAppiumTry - Gandalf #25 (AT-MTV179-GANN-25)'\n ... running command line: \n/bin/sh /root/bamboo-agent-home/temp/AT-MTV179-GANN-25-ScriptBuildTask-4725597705541771759.sh\n ... in: /root/bamboo-agent-home/xml-data/build-dir/AT-MTV179-GANN\n ... using extra environment variables: \nbamboo_planRepository_1_branch=newAppiumTry\nbamboo_planRepository_2_branch=master\nbamboo_build_commandline_com_atlassian_bamboo_plugins_scripttask_task_builder_script_10=/bin/sh /root/bamboo-agent-home/temp/AT-MTV179-GANN-25-ScriptBuildTask-6646451731049296705.sh\nbamboo_planRepository_1_branchDisplayName=newAppiumTry\nbamboo_repository_revision_number=e5c9ab2ff369341c3155cccdbce5ee5b49b66d28\nbamboo_jira_password=********\nbamboo_buildKey=AT-MTV179-GANN\nbamboo_devices_gandalf_udid=48527f94911a9d6cd0cf1c98fc92061021b5f15c\nbamboo_repository_56787397_git_branch=newAppiumTry\nbamboo_appium_temp=/tmp/appium\nbamboo_planRepository_2_branchDisplayName=master\nbamboo_shortJobName=Gandalf\nbamboo_buildResultsUrl=https://bamboo.avirat.net/browse/AT-MTV179-GANN-25\nbamboo_planRepository_repositoryUrl=ssh://git@bitbucket.avirat.net:7999/ofw/ofw-mobilev2-qa.git\nbamboo_agentId=57114846\nbamboo_devices_radagast_name=radagastiphone7\nbamboo_capability_phase=func\nbamboo_planRepository_revision=e5c9ab2ff369341c3155cccdbce5ee5b49b66d28\nbamboo_appium_logs=/Users/svctest/appium/logs\nbamboo_portal=QA iOS Mobilev2\nbamboo_devices_radagast_port=4742\nbamboo_capability_env=func\nbamboo_planRepository_previousRevision=78802119837004c1dd6b47def00d2ce40ada778c\nbamboo_repository_branch_name=newAppiumTry\nbamboo_grid_host=qa-docker02.avirat.net\nbamboo_capability_remote_agent=True\nbamboo_repository_56787397_branch_name=newAppiumTry\nbamboo_cucumber_options=--monochrome --plugin pretty --plugin junit:target/test-report.xml --plugin html:target/cucumber-report/cucumber.html --plugin json:target/cucumber-report/cucumber.json --tags ~@ignore --tags @appiumTest\nbamboo_repository_51150856_git_username=\nbamboo_repository_56787397_name=Mobilev2-qa\nbamboo_dependenciesDisabled=false\nbamboo_capability_build_agent=true\nbamboo_repository_56787397_previous_revision_number=78802119837004c1dd6b47def00d2ce40ada778c\nbamboo_planRepository_branch=newAppiumTry\nbamboo_devices_merlin_port=4740\nbamboo_devices_saruman_udid=699d7b2b6003d9920dbb6cae7e4317de26b796b4\nbamboo_planRepository_1_type=bbserver\nbamboo_planRepository_branchName=newAppiumTry\nbamboo_devices_merlin_name=merliniphone6s\nbamboo_repository_56787397_git_username=\nbamboo_capability_system_builderivy_Ivy=/usr/share/ant\nbamboo_capability_system_jdk_JDK=/usr/lib/jvm/java-8-oracle\nbamboo_COMPOSE_HTTP_TIMEOUT=300\nbamboo_capability_system_builder_gradle_Gradle=/usr/share/gradle\nbamboo_planRepository_1_username=\nbamboo_planRepository_type=bbserver\nbamboo_ManualBuildTriggerReason_userName=cyoung\nbamboo_planRepository_2_branchName=master\nbamboo_capability_system_builder_node_Node_js=/usr/bin/node\nbamboo_dockerProject=qa-mobile-grid\nbamboo_capability_docker_compose_version=1.16.1\nbamboo_capability_system_builder_ant_Ant=/usr/share/ant\nbamboo_capability_system_builder_mvn3_Maven_3=/usr/share/maven\nbamboo_planKey=AT-MTV179\nbamboo_planRepository_username=\nbamboo_repository_51150856_branch_name=master\nbamboo_ios_app_path=/Users/svctest/appium/mobilev2app/iOS_Automation_Build119/OFWTapQA.ipa\nbamboo_repository_51150856_previous_revision_number=9d316208bb231ad73ef762a3e9191203438aed30\nbamboo_planRepository_1_branchName=newAppiumTry\nbamboo_capability_system_builder_maven_Artifactory_Maven_3=/usr/share/maven\nbamboo_resultsUrl=https://bamboo.avirat.net/browse/AT-MTV179-GANN-25\nbamboo_build_working_directory=/root/bamboo-agent-home/xml-data/build-dir/AT-MTV179-GANN\nbamboo_planRepository_1_name=Mobilev2-qa\nbamboo_capability_system_builder_command_Docker_Compose=/usr/local/bin/docker-compose\nbamboo_jira_username=qaimac\nbamboo_shortPlanName=newAppiumTry\nbamboo_planRepository_2_username=\nbamboo_planRepository_name=Mobilev2-qa\nbamboo_buildNumber=25\nbamboo_repository_51150856_git_branch=master\nbamboo_testuser=svctest\nbamboo_planName=Automation Tests - QA - Parent Portal iOS Tests CI - newAppiumTry\nbamboo_docker_service_name=mobilev2iOSGrid\nbamboo_build_commandline_com_atlassian_bamboo_plugins_scripttask_task_builder_script_6=/bin/sh /root/bamboo-agent-home/temp/AT-MTV179-GANN-25-ScriptBuildTask-5810066920641574999.sh\nbamboo_shortPlanKey=MTV179\nbamboo_repository_56787397_git_repositoryUrl=ssh://git@bitbucket.avirat.net:7999/ofw/ofw-mobilev2-qa.git\nbamboo_shortJobKey=GANN\nbamboo_planRepository_2_name=ofw-zephyr-qa\nbamboo_repository_51150856_revision_number=9d316208bb231ad73ef762a3e9191203438aed30\nbamboo_buildTimeStamp=2018-12-12T17:16:57.843Z\nbamboo_repository_previous_revision_number=78802119837004c1dd6b47def00d2ce40ada778c\nbamboo_capability_system_builder_mvn2_Maven_2=/usr/share/maven2\nbamboo_devices_radagast_udid=88153e130154876994e7e3e5b3049a512e1d419f\nbamboo_repository_git_branch=newAppiumTry\nbamboo_buildResultKey=AT-MTV179-GANN-25\nbamboo_appium_binary=./node_modules/appium/build/lib/main.js\nbamboo_buildPlanName=Automation Tests - QA - Parent Portal iOS Tests CI - newAppiumTry - Gandalf\nbamboo_appium_nodeConfig=./nodes\nbamboo_capability_docker_version=17.06.2-ce\nbamboo_planRepository_1_revision=e5c9ab2ff369341c3155cccdbce5ee5b49b66d28\nbamboo_capability_system_hg_executable=/usr/bin/hg\nbamboo_repository_name=ofw-zephyr-qa\nbamboo_planRepository_2_previousRevision=9d316208bb231ad73ef762a3e9191203438aed30\nbamboo_repository_51150856_git_repositoryUrl=ssh://git@bitbucket.avirat.net:7999/ofw/ofw-zephyr-qa.git\nbamboo_appium_path=/Users/svctest/appium\nbamboo_devices_merlin_udid=7acdca75f205d22e2d6eb3194a9b5def4966b529\nbamboo_buildFailed=false\nbamboo_capability_system_jdk_JDK_1_8_0_191=/usr/lib/jvm/java-8-oracle\nbamboo_capability_system_docker_executable=/usr/bin/docker\nbamboo_grid_url=http://qa-docker02.avirat.net:4450/wd/hub\nbamboo_agentWorkingDirectory=/root/bamboo-agent-home/xml-data/build-dir\nbamboo_planRepository_2_revision=9d316208bb231ad73ef762a3e9191203438aed30\nbamboo_capability_system_git_executable=/usr/bin/git\nbamboo_repository_git_username=\nbamboo_planRepository_1_previousRevision=78802119837004c1dd6b47def00d2ce40ada778c\nbamboo_planRepository_branchDisplayName=newAppiumTry\nbamboo_repository_51150856_name=ofw-zephyr-qa\nbamboo_planRepository_2_type=bbserver\nbamboo_appium_node=10.57.85.10\nbamboo_plan_storageTag=plan-56592529\nbamboo_planRepository_2_repositoryUrl=ssh://git@bitbucket.avirat.net:7999/ofw/ofw-zephyr-qa.git\nbamboo_repository_git_repositoryUrl=ssh://git@bitbucket.avirat.net:7999/ofw/ofw-mobilev2-qa.git\nbamboo_working_directory=/root/bamboo-agent-home/xml-data/build-dir/AT-MTV179-GANN\nbamboo_devices_saruman_port=4743\nbamboo_planRepository_1_repositoryUrl=ssh://git@bitbucket.avirat.net:7999/ofw/ofw-mobilev2-qa.git\nbamboo_repository_56787397_revision_number=e5c9ab2ff369341c3155cccdbce5ee5b49b66d28\nbamboo_devices_gandalf_name=gandalfipad\nbamboo_capability_system_jdk_JDK_1_8=/usr/lib/jvm/java-8-oracle\nbamboo_capability_system_jdk_JDK_1_7=/usr/lib/jvm/java-7-openjdk-amd64\nbamboo_devices_gandalf_port=4741\nbamboo_devices_saruman_name=sarumanipadmini4\n
build 12-Dec-2018 17:17:21 Initialized native services in: /root/.gradle/native
build 12-Dec-2018 17:17:22 Connected to daemon DaemonInfo{pid=28808, address=[775dc1c2-1eb0-4e90-bc3c-38dde92b59b1 port:43367, addresses:[/127.0.0.1]], state=Idle, lastBusy=1544634989683, context=DefaultDaemonContext[uid=3ced5856-a81c-4056-9d38-e6f0664af347,javaHome=/usr/lib/jvm/java-8-oracle,daemonRegistryDir=/root/.gradle/daemon,pid=28808,idleTimeout=10800000,daemonOpts=-XX:MaxPermSize=256m,-XX:+HeapDumpOnOutOfMemoryError,-Xmx1024m,-Dfile.encoding=US-ASCII,-Duser.country=US,-Duser.language=en,-Duser.variant]}. Dispatching request Build{id=bb52c715-7ecd-4023-8059-428a5a0fd0b5.1, currentDir=/root/bamboo-agent-home/xml-data/build-dir/AT-MTV179-GANN/ofw-zephyr-qa}.
build 12-Dec-2018 17:17:22 Received result org.gradle.launcher.daemon.protocol.BuildStarted@2421cc4 from daemon DaemonInfo{pid=28808, address=[775dc1c2-1eb0-4e90-bc3c-38dde92b59b1 port:43367, addresses:[/127.0.0.1]], state=Idle, lastBusy=1544634989683, context=DefaultDaemonContext[uid=3ced5856-a81c-4056-9d38-e6f0664af347,javaHome=/usr/lib/jvm/java-8-oracle,daemonRegistryDir=/root/.gradle/daemon,pid=28808,idleTimeout=10800000,daemonOpts=-XX:MaxPermSize=256m,-XX:+HeapDumpOnOutOfMemoryError,-Xmx1024m,-Dfile.encoding=US-ASCII,-Duser.country=US,-Duser.language=en,-Duser.variant]} (build should be starting).
build 12-Dec-2018 17:17:22 The client will now receive all logging from the daemon (pid: 28808). The daemon log file: /root/.gradle/daemon/3.5-rc-2/daemon-28808.out.log
build 12-Dec-2018 17:17:22 Starting 5th build in daemon [uptime: 1 hrs 11 mins 5.095 secs, performance: 100%, no major garbage collections]
build 12-Dec-2018 17:17:22 Executing build with daemon context: DefaultDaemonContext[uid=3ced5856-a81c-4056-9d38-e6f0664af347,javaHome=/usr/lib/jvm/java-8-oracle,daemonRegistryDir=/root/.gradle/daemon,pid=28808,idleTimeout=10800000,daemonOpts=-XX:MaxPermSize=256m,-XX:+HeapDumpOnOutOfMemoryError,-Xmx1024m,-Dfile.encoding=US-ASCII,-Duser.country=US,-Duser.language=en,-Duser.variant]
build 12-Dec-2018 17:17:22 Creating new cache for plugin-use-metadata, path /root/.gradle/caches/3.5-rc-2/plugin-resolution/plugin-use-metadata.bin, access org.gradle.cache.internal.DefaultCacheAccess@17ece2b0
build 12-Dec-2018 17:17:22 Creating new cache for client-status, path /root/.gradle/caches/3.5-rc-2/plugin-resolution/client-status.bin, access org.gradle.cache.internal.DefaultCacheAccess@17ece2b0
build 12-Dec-2018 17:17:22 Starting Build
build 12-Dec-2018 17:17:22 Settings evaluated using settings file '/root/bamboo-agent-home/xml-data/build-dir/AT-MTV179-GANN/ofw-zephyr-qa/settings.gradle'.
build 12-Dec-2018 17:17:22 Projects loaded. Root project using build file '/root/bamboo-agent-home/xml-data/build-dir/AT-MTV179-GANN/ofw-zephyr-qa/build.gradle'.
build 12-Dec-2018 17:17:22 Included projects: [root project 'ZephyrUpdater']
build 12-Dec-2018 17:17:22 Evaluating root project 'ZephyrUpdater' using build file '/root/bamboo-agent-home/xml-data/build-dir/AT-MTV179-GANN/ofw-zephyr-qa/build.gradle'.
build 12-Dec-2018 17:17:22 Using 12 worker leases.
build 12-Dec-2018 17:17:22 Creating new cache for fileHashes, path /root/bamboo-agent-home/xml-data/build-dir/AT-MTV179-GANN/ofw-zephyr-qa/.gradle/3.5-rc-2/taskHistory/fileHashes.bin, access org.gradle.cache.internal.DefaultCacheAccess@17e04021
build 12-Dec-2018 17:17:22 All projects evaluated.
build 12-Dec-2018 17:17:22 Selected primary task 'clean' from project :
build 12-Dec-2018 17:17:22 Selected primary task 'test' from project :
build 12-Dec-2018 17:17:22 Creating new cache for annotation-processors, path /root/bamboo-agent-home/xml-data/build-dir/AT-MTV179-GANN/ofw-zephyr-qa/.gradle/3.5-rc-2/fileContent/annotation-processors.bin, access org.gradle.cache.internal.DefaultCacheAccess@3da78747
build 12-Dec-2018 17:17:22 Tasks to be executed: [task ':clean', task ':compileJava', task ':processResources', task ':classes', task ':compileTestJava', task ':processTestResources', task ':testClasses', task ':test']
build 12-Dec-2018 17:17:22 Creating new cache for jvmClassSignatures, path /root/bamboo-agent-home/xml-data/build-dir/AT-MTV179-GANN/ofw-zephyr-qa/.gradle/3.5-rc-2/taskHistory/jvmClassSignatures.bin, access org.gradle.cache.internal.DefaultCacheAccess@17e04021
build 12-Dec-2018 17:17:22 Creating new cache for fileSnapshots, path /root/bamboo-agent-home/xml-data/build-dir/AT-MTV179-GANN/ofw-zephyr-qa/.gradle/3.5-rc-2/taskHistory/fileSnapshots.bin, access org.gradle.cache.internal.DefaultCacheAccess@17e04021
build 12-Dec-2018 17:17:22 Creating new cache for taskHistory, path /root/bamboo-agent-home/xml-data/build-dir/AT-MTV179-GANN/ofw-zephyr-qa/.gradle/3.5-rc-2/taskHistory/taskHistory.bin, access org.gradle.cache.internal.DefaultCacheAccess@17e04021
build 12-Dec-2018 17:17:22 :clean (Thread[Daemon worker Thread 4,5,main]) started.
build 12-Dec-2018 17:17:22 :clean
build 12-Dec-2018 17:17:22 Putting task artifact state for task ':clean' into context took 0.0 secs.
build 12-Dec-2018 17:17:22 Executing task ':clean' (up-to-date check took 0.0 secs) due to:
build 12-Dec-2018 17:17:22 Task has not declared any outputs.
build 12-Dec-2018 17:17:22 :clean UP-TO-DATE
build 12-Dec-2018 17:17:22 :clean (Thread[Daemon worker Thread 4,5,main]) completed. Took 0.001 secs.
build 12-Dec-2018 17:17:22 :compileJava (Thread[Daemon worker Thread 4,5,main]) started.
build 12-Dec-2018 17:17:22 :compileJava
build 12-Dec-2018 17:17:22 Putting task artifact state for task ':compileJava' into context took 0.002 secs.
build 12-Dec-2018 17:17:22 Task :compileJava class loader hash: 30c2a81bd6e2d5925528e170cc328c90
build 12-Dec-2018 17:17:22 Task :compileJava actions class loader hashes: [7c8fa27d1d194f040370d9584b8177bc, 30c2a81bd6e2d5925528e170cc328c90]
build 12-Dec-2018 17:17:22 Creating new cache for metadata-2.23/module-metadata, path /root/.gradle/caches/modules-2/metadata-2.23/module-metadata.bin, access org.gradle.cache.internal.DefaultCacheAccess@48e241d5
build 12-Dec-2018 17:17:22 Creating new cache for metadata-2.23/artifact-at-repository, path /root/.gradle/caches/modules-2/metadata-2.23/artifact-at-repository.bin, access org.gradle.cache.internal.DefaultCacheAccess@48e241d5
build 12-Dec-2018 17:17:22 Executing task ':compileJava' (up-to-date check took 0.23 secs) due to:
build 12-Dec-2018 17:17:22 No history is available.
build 12-Dec-2018 17:17:22 All input files are considered out-of-date for incremental task ':compileJava'.
build 12-Dec-2018 17:17:22 Compiling with JDK Java compiler API.
build 12-Dec-2018 17:17:22 :compileJava (Thread[Daemon worker Thread 4,5,main]) completed. Took 0.357 secs.
build 12-Dec-2018 17:17:22 :processResources (Thread[Daemon worker Thread 4,5,main]) started.
build 12-Dec-2018 17:17:22 :processResources
build 12-Dec-2018 17:17:22 Putting task artifact state for task ':processResources' into context took 0.004 secs.
build 12-Dec-2018 17:17:22 file or directory '/root/bamboo-agent-home/xml-data/build-dir/AT-MTV179-GANN/ofw-zephyr-qa/src/main/resources', not found
build 12-Dec-2018 17:17:22 Skipping task ':processResources' as it has no source files and no previous output files.
build 12-Dec-2018 17:17:22 :processResources NO-SOURCE
build 12-Dec-2018 17:17:22 :processResources (Thread[Daemon worker Thread 4,5,main]) completed. Took 0.005 secs.
build 12-Dec-2018 17:17:22 :classes (Thread[Daemon worker Thread 4,5,main]) started.
build 12-Dec-2018 17:17:22 :classes
build 12-Dec-2018 17:17:22 Skipping task ':classes' as it has no actions.
build 12-Dec-2018 17:17:22 :classes (Thread[Daemon worker Thread 4,5,main]) completed. Took 0.0 secs.
build 12-Dec-2018 17:17:22 :compileTestJava (Thread[Daemon worker Thread 4,5,main]) started.
build 12-Dec-2018 17:17:22 :compileTestJava
build 12-Dec-2018 17:17:22 Putting task artifact state for task ':compileTestJava' into context took 0.0 secs.
build 12-Dec-2018 17:17:22 file or directory '/root/bamboo-agent-home/xml-data/build-dir/AT-MTV179-GANN/ofw-zephyr-qa/src/test/java', not found
build 12-Dec-2018 17:17:22 Task :compileTestJava class loader hash: 30c2a81bd6e2d5925528e170cc328c90
build 12-Dec-2018 17:17:22 Task :compileTestJava actions class loader hashes: [7c8fa27d1d194f040370d9584b8177bc, 30c2a81bd6e2d5925528e170cc328c90]
build 12-Dec-2018 17:17:22 file or directory '/root/bamboo-agent-home/xml-data/build-dir/AT-MTV179-GANN/ofw-zephyr-qa/src/test/java', not found
build 12-Dec-2018 17:17:22 Executing task ':compileTestJava' (up-to-date check took 0.025 secs) due to:
build 12-Dec-2018 17:17:22 No history is available.
build 12-Dec-2018 17:17:22 All input files are considered out-of-date for incremental task ':compileTestJava'.
build 12-Dec-2018 17:17:22 file or directory '/root/bamboo-agent-home/xml-data/build-dir/AT-MTV179-GANN/ofw-zephyr-qa/src/test/java', not found
build 12-Dec-2018 17:17:22 Compiling with JDK Java compiler API.
build 12-Dec-2018 17:17:22 :compileTestJava (Thread[Daemon worker Thread 4,5,main]) completed. Took 0.146 secs.
build 12-Dec-2018 17:17:22 :processTestResources (Thread[Daemon worker Thread 4,5,main]) started.
build 12-Dec-2018 17:17:22 :processTestResources
build 12-Dec-2018 17:17:22 Putting task artifact state for task ':processTestResources' into context took 0.003 secs.
build 12-Dec-2018 17:17:22 file or directory '/root/bamboo-agent-home/xml-data/build-dir/AT-MTV179-GANN/ofw-zephyr-qa/src/test/resources', not found
build 12-Dec-2018 17:17:22 file or directory '/root/bamboo-agent-home/xml-data/build-dir/AT-MTV179-GANN/ofw-zephyr-qa/src/main/resources', not found
build 12-Dec-2018 17:17:22 Skipping task ':processTestResources' as it has no source files and no previous output files.
build 12-Dec-2018 17:17:22 :processTestResources NO-SOURCE
build 12-Dec-2018 17:17:22 :processTestResources (Thread[Daemon worker Thread 4,5,main]) completed. Took 0.004 secs.
build 12-Dec-2018 17:17:22 :testClasses (Thread[Daemon worker Thread 4,5,main]) started.
build 12-Dec-2018 17:17:22 :testClasses
build 12-Dec-2018 17:17:22 Skipping task ':testClasses' as it has no actions.
build 12-Dec-2018 17:17:22 :testClasses (Thread[Daemon worker Thread 4,5,main]) completed. Took 0.0 secs.
build 12-Dec-2018 17:17:22 :test (Thread[Daemon worker Thread 4,5,main]) started.
build 12-Dec-2018 17:17:22 :test
build 12-Dec-2018 17:17:22 Putting task artifact state for task ':test' into context took 0.0 secs.
build 12-Dec-2018 17:17:22 Task :test class loader hash: 30c2a81bd6e2d5925528e170cc328c90
build 12-Dec-2018 17:17:22 Task :test actions class loader hashes: [7c8fa27d1d194f040370d9584b8177bc, 30c2a81bd6e2d5925528e170cc328c90]
build 12-Dec-2018 17:17:22 Executing task ':test' (up-to-date check took 0.005 secs) due to:
build 12-Dec-2018 17:17:22 No history is available.
build 12-Dec-2018 17:17:22 Starting process 'Gradle Test Executor 1'. Working directory: /root/bamboo-agent-home/xml-data/build-dir/AT-MTV179-GANN/ofw-zephyr-qa Command: /usr/lib/jvm/java-8-oracle/bin/java -Dawt.toolkit=sun.awt.X11.XToolkit -DcucumberReportLocation=../target/cucumber-report/cucumber.json -Ddevice=iPad -Dfile.encoding.pkg=sun.io -Dfile.separator=/ -Djava.awt.graphicsenv=sun.awt.X11GraphicsEnvironment -Djava.awt.printerjob=sun.print.PSPrinterJob -Djava.class.path=/root/.gradle/wrapper/dists/gradle-3.5-rc-2-bin/7ktl4k9rdug30mawecgppf5ms/gradle-3.5-rc-2/lib/gradle-launcher-3.5.jar -Djava.class.version=52.0 -Djava.endorsed.dirs=/usr/lib/jvm/java-8-oracle/jre/lib/endorsed -Djava.ext.dirs=/usr/lib/jvm/java-8-oracle/jre/lib/ext:/usr/java/packages/lib/ext -Djava.home=/usr/lib/jvm/java-8-oracle/jre -Djava.library.path=/usr/java/packages/lib/amd64:/usr/lib64:/lib64:/lib:/usr/lib -Djava.runtime.name=Java(TM) SE Runtime Environment -Djava.runtime.version=1.8.0_191-b12 -Djava.security.manager=worker.org.gradle.process.internal.worker.child.BootstrapSecurityManager -Djava.specification.name=Java Platform API Specification -Djava.specification.vendor=Oracle Corporation -Djava.specification.version=1.8 -Djava.vendor=Oracle Corporation -Djava.vendor.url=http://java.oracle.com/ -Djava.vendor.url.bug=http://bugreport.sun.com/bugreport/ -Djava.version=1.8.0_191 -Djava.vm.info=mixed mode -Djava.vm.name=Java HotSpot(TM) 64-Bit Server VM -Djava.vm.specification.name=Java Virtual Machine Specification -Djava.vm.specification.vendor=Oracle Corporation -Djava.vm.specification.version=1.8 -Djava.vm.vendor=Oracle Corporation -Djava.vm.version=25.191-b12 -Dlibrary.jansi.path=/root/.gradle/native/jansi/1.14/linux64 -Dline.separator=
build 12-Dec-2018 17:17:22 -Dorg.gradle.appname=gradlew -Dos.arch=amd64 -Dos.name=Linux -Dos.version=3.10.0-862.3.2.el7.x86_64 -Dpassword=******** -Dpath.separator=: -Dportal=QA iOS Mobilev2 -Dsun.arch.data.model=64 -Dsun.boot.class.path=/usr/lib/jvm/java-8-oracle/jre/lib/resources.jar:/usr/lib/jvm/java-8-oracle/jre/lib/rt.jar:/usr/lib/jvm/java-8-oracle/jre/lib/sunrsasign.jar:/usr/lib/jvm/java-8-oracle/jre/lib/jsse.jar:/usr/lib/jvm/java-8-oracle/jre/lib/jce.jar:/usr/lib/jvm/java-8-oracle/jre/lib/charsets.jar:/usr/lib/jvm/java-8-oracle/jre/lib/jfr.jar:/usr/lib/jvm/java-8-oracle/jre/classes -Dsun.boot.library.path=/usr/lib/jvm/java-8-oracle/jre/lib/amd64 -Dsun.cpu.endian=little -Dsun.cpu.isalist -Dsun.io.unicode.encoding=UnicodeLittle -Dsun.java.command=org.gradle.launcher.daemon.bootstrap.GradleDaemon 3.5-rc-2 -Dsun.java.launcher=SUN_STANDARD -Dsun.jnu.encoding=ANSI_X3.4-1968 -Dsun.management.compiler=HotSpot 64-Bit Tiered Compilers -Dsun.os.patch.level=unknown -Duser.dir=/root/bamboo-agent-home/xml-data/build-dir/AT-MTV179-GANN/ofw-zephyr-qa -Duser.home=/root -Duser.name=root -Duser.timezone=Etc/UTC -Dusername=qaimac -Dfile.encoding=ANSI_X3.4-1968 -Djava.io.tmpdir=/tmp -Duser.country=US -Duser.language=en -Duser.variant -ea -cp /root/.gradle/caches/3.5-rc-2/workerMain/gradle-worker.jar worker.org.gradle.process.internal.worker.GradleWorkerMain 'Gradle Test Executor 1'
build 12-Dec-2018 17:17:22 Successfully started process 'Gradle Test Executor 1'
build 12-Dec-2018 17:17:23 Initialized native services in: /root/.gradle/native
build 12-Dec-2018 17:17:23 Gradle Test Executor 1 started executing tests.
build 12-Dec-2018 17:17:27 Gradle Test Executor 1 finished executing tests.
build 12-Dec-2018 17:17:27 Finished generating test XML results (0.001 secs) into: /root/bamboo-agent-home/xml-data/build-dir/AT-MTV179-GANN/ofw-zephyr-qa/build/test-results/test
build 12-Dec-2018 17:17:27 Generating HTML test report...
build 12-Dec-2018 17:17:27 Finished generating test html results (0.004 secs) into: /root/bamboo-agent-home/xml-data/build-dir/AT-MTV179-GANN/ofw-zephyr-qa/build/reports/tests/test
build 12-Dec-2018 17:17:27 :test (Thread[Daemon worker Thread 4,5,main]) completed. Took 5.065 secs.
build 12-Dec-2018 17:17:27
build 12-Dec-2018 17:17:27 BUILD SUCCESSFUL
build 12-Dec-2018 17:17:27
build 12-Dec-2018 17:17:27 Total time: 6.532 secs
build 12-Dec-2018 17:17:27 Stopped 0 worker daemon(s).
build 12-Dec-2018 17:17:27 Received result Success[value=null] from daemon DaemonInfo{pid=28808, address=[775dc1c2-1eb0-4e90-bc3c-38dde92b59b1 port:43367, addresses:[/127.0.0.1]], state=Idle, lastBusy=1544634989683, context=DefaultDaemonContext[uid=3ced5856-a81c-4056-9d38-e6f0664af347,javaHome=/usr/lib/jvm/java-8-oracle,daemonRegistryDir=/root/.gradle/daemon,pid=28808,idleTimeout=10800000,daemonOpts=-XX:MaxPermSize=256m,-XX:+HeapDumpOnOutOfMemoryError,-Xmx1024m,-Dfile.encoding=US-ASCII,-Duser.country=US,-Duser.language=en,-Duser.variant]} (build should be done).
simple 12-Dec-2018 17:17:28 Finished task 'Upload Execution Results to Jira' with result: Success
simple 12-Dec-2018 17:17:28 Starting task 'Cucumber Results Parser' of type 'com.mdb.plugins.cucumberforbamboo:CucumberTask'
simple 12-Dec-2018 17:17:28 Parsing Cucumber results...
simple 12-Dec-2018 17:17:28 Searching JSON results in folder: /root/bamboo-agent-home/xml-data/build-dir/AT-MTV179-GANN/target
simple 12-Dec-2018 17:17:28 Getting files in /root/bamboo-agent-home/xml-data/build-dir/AT-MTV179-GANN/target including those in subdirectories
simple 12-Dec-2018 17:17:28 file: /root/bamboo-agent-home/xml-data/build-dir/AT-MTV179-GANN/target/cucumber-report/cucumber.json
simple 12-Dec-2018 17:17:28 Total 1 files found.
simple 12-Dec-2018 17:17:28 Cucumber JSON result file found cucumber.json
simple 12-Dec-2018 17:17:28 Compatible results /root/bamboo-agent-home/xml-data/build-dir/AT-MTV179-GANN/cucumber.json-junit.xml generated for cucumber.json
simple 12-Dec-2018 17:17:28 Build is configured to ignore outdated files.
simple 12-Dec-2018 17:17:28 Parsing test results under /root/bamboo-agent-home/xml-data/build-dir/AT-MTV179-GANN...
simple 12-Dec-2018 17:17:28 Test results created in bamboo for Cucumber test results
simple 12-Dec-2018 17:17:28 Storing files to Bamboo server...
simple 12-Dec-2018 17:17:28 Getting files in /root/bamboo-agent-home/xml-data/build-dir/AT-MTV179-GANN including those in subdirectories
simple 12-Dec-2018 17:17:28 file: /root/bamboo-agent-home/xml-data/build-dir/AT-MTV179-GANN/ofw-zephyr-qa/build/reports/tests/test/index.html
simple 12-Dec-2018 17:17:28 file: /root/bamboo-agent-home/xml-data/build-dir/AT-MTV179-GANN/ofw-zephyr-qa/build/reports/tests/test/packages/runner.html
simple 12-Dec-2018 17:17:28 file: /root/bamboo-agent-home/xml-data/build-dir/AT-MTV179-GANN/ofw-zephyr-qa/build/reports/tests/test/classes/runner.runner.html
simple 12-Dec-2018 17:17:28 file: /root/bamboo-agent-home/xml-data/build-dir/AT-MTV179-GANN/build/reports/tests/test/index.html
simple 12-Dec-2018 17:17:28 file: /root/bamboo-agent-home/xml-data/build-dir/AT-MTV179-GANN/target/cucumber-report/cucumber.html/index.html
simple 12-Dec-2018 17:17:28 file: /root/bamboo-agent-home/xml-data/build-dir/AT-MTV179-GANN/cucumber-cucumber.html
simple 12-Dec-2018 17:17:28 Found /root/bamboo-agent-home/xml-data/build-dir/AT-MTV179-GANN/cucumber-cucumber.html
simple 12-Dec-2018 17:17:28 Finished task 'Cucumber Results Parser' with result: Success
command 12-Dec-2018 17:17:28 Substituting variable: ${bamboo.appium.path} with /Users/svctest/appium
command 12-Dec-2018 17:17:28 Substituting variable: ${bamboo.devices.gandalf.name} with gandalfipad
command 12-Dec-2018 17:17:28 Substituting variable: ${bamboo.devices.gandalf.name} with gandalfipad
command 12-Dec-2018 17:17:28 Substituting variable: ${bamboo.devices.gandalf.udid} with 48527f94911a9d6cd0cf1c98fc92061021b5f15c
command 12-Dec-2018 17:17:28 Substituting variable: ${bamboo.testuser} with svctest
simple 12-Dec-2018 17:17:28 Starting task 'Stop appium and restart device' of type 'com.atlassian.bamboo.plugins.bamboo-scp-plugin:sshtask'
simple 12-Dec-2018 17:17:28 Connecting to qa01.avirat.net on port: 22
simple 12-Dec-2018 17:17:28 Executing [
simple 12-Dec-2018 17:17:28 PATH=$PATH:/usr/local/bin
simple 12-Dec-2018 17:17:28 cd /Users/svctest/appium
simple 12-Dec-2018 17:17:28 if ps -ax | grep '[a]ppium/gandalfipad'; then pkill -SIGKILL -f [a]ppium/gandalfipad; fi
simple 12-Dec-2018 17:17:28 echo 'Appium stopped...'
simple 12-Dec-2018 17:17:28 bash ./scripts/restartDevice.sh 48527f94911a9d6cd0cf1c98fc92061021b5f15c
simple 12-Dec-2018 17:17:28 ]
build 12-Dec-2018 17:17:28 29227 ?? 0:02.94 node ./node_modules/appium/build/lib/main.js -p 4741 --tmp /tmp/appium/gandalfipad --nodeconfig ./nodes/gandalfipad.json
build 12-Dec-2018 17:17:28 Appium stopped...
build 12-Dec-2018 17:17:28 ERROR: Could not connect to lockdownd, error code -21
build 12-Dec-2018 17:17:36 Device found.
simple 12-Dec-2018 17:17:36 [
simple 12-Dec-2018 17:17:36 PATH=$PATH:/usr/local/bin
simple 12-Dec-2018 17:17:36 cd /Users/svctest/appium
simple 12-Dec-2018 17:17:36 if ps -ax | grep '[a]ppium/gandalfipad'; then pkill -SIGKILL -f [a]ppium/gandalfipad; fi
simple 12-Dec-2018 17:17:36 echo 'Appium stopped...'
simple 12-Dec-2018 17:17:36 bash ./scripts/restartDevice.sh 48527f94911a9d6cd0cf1c98fc92061021b5f15c
simple 12-Dec-2018 17:17:36 ] has finished.
simple 12-Dec-2018 17:17:36 Result: exit code = 0
simple 12-Dec-2018 17:17:36 Finished task 'Stop appium and restart device' with result: Success
simple 12-Dec-2018 17:17:36 Running post build plugin 'Docker Container Cleanup'
simple 12-Dec-2018 17:17:36 Running post build plugin 'NCover Results Collector'
simple 12-Dec-2018 17:17:36 Running post build plugin 'Cucumber Artifact Copier'
error 12-Dec-2018 17:17:36 Failed to execute plugin 'Cucumber Artifact Copier' with error: com.atlassian.bamboo.v2.build.BuildContext.getRuntimeTaskContext()Lcom/atlassian/bamboo/task/RuntimeTaskContext;
simple 12-Dec-2018 17:17:36 Running post build plugin 'Artifactory Release Management Staging'
simple 12-Dec-2018 17:17:36 Running post build plugin 'Artifactory Build Info Copier'
simple 12-Dec-2018 17:17:36 Running post build plugin 'Artifactory Gradle Properties Info Copier'
simple 12-Dec-2018 17:17:36 Running post build plugin 'Clover Results Collector'
simple 12-Dec-2018 17:17:36 Running post build plugin 'npm Cache Cleanup'
simple 12-Dec-2018 17:17:36 Running post build plugin 'Artifact Copier'
simple 12-Dec-2018 17:17:36 Publishing an artifact: Scenario Level Report
simple 12-Dec-2018 17:17:36 Finished publishing of artifact Job artifact: [Scenario Level Report], pattern: [target/cucumber-report/cucumber.html/**] in 13.27 ms
simple 12-Dec-2018 17:17:36 Successfully removed working directory at '/root/bamboo-agent-home/xml-data/build-dir/AT-MTV179-GANN'
simple 12-Dec-2018 17:17:36 Finalising the build...
simple 12-Dec-2018 17:17:36 Stopping timer.
simple 12-Dec-2018 17:17:36 Build AT-MTV179-GANN-25 completed.
simple 12-Dec-2018 17:17:36 Running on server: post build plugin 'NCover Results Collector'
simple 12-Dec-2018 17:17:36 Running on server: post build plugin 'Build Hanging Detection Configuration'
simple 12-Dec-2018 17:17:36 Running on server: post build plugin 'Cucumber JIRA updater'
simple 12-Dec-2018 17:17:36 Bamboo URL is: https://bamboo.avirat.net
simple 12-Dec-2018 17:17:36 Total issues created:0
simple 12-Dec-2018 17:17:36 Running on server: post build plugin 'BDD Report Processor'
simple 12-Dec-2018 17:17:36 Running on server: post build plugin 'Clover Delta Calculator'
simple 12-Dec-2018 17:17:37 Running on server: post build plugin 'Maven Dependencies Postprocessor'
simple 12-Dec-2018 17:17:37 All post build plugins have finished
simple 12-Dec-2018 17:17:37 Generating build results summary...
simple 12-Dec-2018 17:17:37 Saving build results to disk...
simple 12-Dec-2018 17:17:37 Logging substituted variables...
simple 12-Dec-2018 17:17:37 Indexing build results...
simple 12-Dec-2018 17:17:37 Finished building AT-MTV179-GANN-25.
Sign up for free to join this conversation on GitHub. Already have an account? Sign in to comment