Skip to content

Instantly share code, notes, and snippets.

Embed
What would you like to do?
2021-06-21T07:07:36.9276270Z [DEBUG] 07:07:36.676 Detection of duplications for /__w/1/source/app-info-service-app/src/main/java/com/comp/myvb/tis/model/rna/ChangelogEntity.java
2021-06-21T07:07:36.9276863Z [INFO] 07:07:36.679 LTP Executor LTP calculation finished (done) | time=420ms
2021-06-21T07:07:36.9277498Z [DEBUG] 07:07:36.687 SCM revision ID '1bdf3d6b6e20327ebc7504549159047aa9298014'
2021-06-21T07:07:36.9277934Z [INFO] 07:07:36.695 Load New Code definition
2021-06-21T07:22:36.7104206Z [INFO] ------------------------------------------------------------------------
2021-06-21T07:22:36.7105032Z [INFO] Reactor Summary for app-info-service 20210621.1-1bdf3d6b:
2021-06-21T07:22:36.7105491Z [INFO]
2021-06-21T07:22:36.7110770Z [INFO] app-info-commons .................................. SUCCESS [ 11.246 s]
2021-06-21T07:22:36.7115690Z [INFO] app-info-service .................................. FAILURE [19:59 min]
2021-06-21T07:22:36.7120381Z [INFO] app-info-service-api .............................. SUCCESS [ 16.274 s]
2021-06-21T07:22:36.7125385Z [INFO] app-info-framework ................................ SUCCESS [ 18.308 s]
2021-06-21T07:22:36.7146353Z [INFO] app-info-service-websocket-client ................. SUCCESS [ 5.322 s]
2021-06-21T07:22:36.7147243Z [INFO] app-info-service-ui ............................... SUCCESS [01:05 min]
2021-06-21T07:22:36.7148012Z [INFO] app-info-service-app .............................. SUCCESS [04:48 min]
2021-06-21T07:22:36.7149051Z [INFO] app-info-service-testlib .......................... SUCCESS [ 7.345 s]
2021-06-21T07:22:36.7149737Z [INFO] ------------------------------------------------------------------------
2021-06-21T07:22:36.7150184Z [INFO] BUILD FAILURE
2021-06-21T07:22:36.7150781Z [INFO] ------------------------------------------------------------------------
2021-06-21T07:22:36.7181433Z [INFO] Total time: 26:57 min
2021-06-21T07:22:36.7182329Z [INFO] Finished at: 2021-06-21T07:22:36Z
2021-06-21T07:22:36.7183028Z [INFO] ------------------------------------------------------------------------
2021-06-21T07:22:36.7221421Z [ERROR] Failed to execute goal org.sonarsource.scanner.maven:sonar-maven-plugin:3.6.1.1688:sonar (default-cli) on project app-info-service: Fail to request url: https://atep.comp.com/sonar/api/new_code_periods/show.protobuf?project=TIS&branch=master: timeout: Socket closed -> [Help 1]
2021-06-21T07:22:36.7223292Z org.apache.maven.lifecycle.LifecycleExecutionException: Failed to execute goal org.sonarsource.scanner.maven:sonar-maven-plugin:3.6.1.1688:sonar (default-cli) on project app-info-service: Fail to request url: https://atep.comp.com/sonar/api/new_code_periods/show.protobuf?project=TIS&branch=master
2021-06-21T07:22:36.7224361Z at org.apache.maven.lifecycle.internal.MojoExecutor.execute (MojoExecutor.java:215)
2021-06-21T07:22:36.7225008Z at org.apache.maven.lifecycle.internal.MojoExecutor.execute (MojoExecutor.java:156)
2021-06-21T07:22:36.7225633Z at org.apache.maven.lifecycle.internal.MojoExecutor.execute (MojoExecutor.java:148)
2021-06-21T07:22:36.7226321Z at org.apache.maven.lifecycle.internal.LifecycleModuleBuilder.buildProject (LifecycleModuleBuilder.java:117)
2021-06-21T07:22:36.7229173Z at org.apache.maven.lifecycle.internal.LifecycleModuleBuilder.buildProject (LifecycleModuleBuilder.java:81)
2021-06-21T07:22:36.7229987Z at org.apache.maven.lifecycle.internal.builder.singlethreaded.SingleThreadedBuilder.build (SingleThreadedBuilder.java:56)
2021-06-21T07:22:36.7230710Z at org.apache.maven.lifecycle.internal.LifecycleStarter.execute (LifecycleStarter.java:128)
2021-06-21T07:22:36.7231324Z at org.apache.maven.DefaultMaven.doExecute (DefaultMaven.java:305)
2021-06-21T07:22:36.7231879Z at org.apache.maven.DefaultMaven.doExecute (DefaultMaven.java:192)
2021-06-21T07:22:36.7232426Z at org.apache.maven.DefaultMaven.execute (DefaultMaven.java:105)
2021-06-21T07:22:36.7232974Z at org.apache.maven.cli.MavenCli.execute (MavenCli.java:957)
2021-06-21T07:22:36.7233508Z at org.apache.maven.cli.MavenCli.doMain (MavenCli.java:289)
2021-06-21T07:22:36.7234047Z at org.apache.maven.cli.MavenCli.main (MavenCli.java:193)
2021-06-21T07:22:36.7234551Z at sun.reflect.NativeMethodAccessorImpl.invoke0 (Native Method)
2021-06-21T07:22:36.7235114Z at sun.reflect.NativeMethodAccessorImpl.invoke (NativeMethodAccessorImpl.java:62)
2021-06-21T07:22:36.7243264Z at sun.reflect.DelegatingMethodAccessorImpl.invoke (DelegatingMethodAccessorImpl.java:43)
2021-06-21T07:22:36.7244108Z at java.lang.reflect.Method.invoke (Method.java:498)
2021-06-21T07:22:36.7244927Z at org.codehaus.plexus.classworlds.launcher.Launcher.launchEnhanced (Launcher.java:282)
2021-06-21T07:22:36.7247871Z at org.codehaus.plexus.classworlds.launcher.Launcher.launch (Launcher.java:225)
2021-06-21T07:22:36.7253865Z at org.codehaus.plexus.classworlds.launcher.Launcher.mainWithExitCode (Launcher.java:406)
2021-06-21T07:22:36.7263556Z at org.codehaus.plexus.classworlds.launcher.Launcher.main (Launcher.java:347)
2021-06-21T07:22:36.7267701Z Caused by: org.apache.maven.plugin.MojoExecutionException: Fail to request url: https://atep.comp.com/sonar/api/new_code_periods/show.protobuf?project=TIS&branch=master
2021-06-21T07:22:36.7274139Z at org.sonarsource.scanner.maven.bootstrap.ScannerBootstrapper.execute (ScannerBootstrapper.java:67)
2021-06-21T07:22:36.7277152Z at org.sonarsource.scanner.maven.SonarQubeMojo.execute (SonarQubeMojo.java:104)
2021-06-21T07:22:36.7277830Z at org.apache.maven.plugin.DefaultBuildPluginManager.executeMojo (DefaultBuildPluginManager.java:137)
2021-06-21T07:22:36.7278632Z at org.apache.maven.lifecycle.internal.MojoExecutor.execute (MojoExecutor.java:210)
2021-06-21T07:22:36.7279270Z at org.apache.maven.lifecycle.internal.MojoExecutor.execute (MojoExecutor.java:156)
2021-06-21T07:22:36.7279883Z at org.apache.maven.lifecycle.internal.MojoExecutor.execute (MojoExecutor.java:148)
2021-06-21T07:22:36.7280567Z at org.apache.maven.lifecycle.internal.LifecycleModuleBuilder.buildProject (LifecycleModuleBuilder.java:117)
2021-06-21T07:22:36.7349181Z at org.apache.maven.lifecycle.internal.LifecycleModuleBuilder.buildProject (LifecycleModuleBuilder.java:81)
2021-06-21T07:22:36.7350171Z at org.apache.maven.lifecycle.internal.builder.singlethreaded.SingleThreadedBuilder.build (SingleThreadedBuilder.java:56)
2021-06-21T07:22:36.7350994Z at org.apache.maven.lifecycle.internal.LifecycleStarter.execute (LifecycleStarter.java:128)
2021-06-21T07:22:36.7351723Z at org.apache.maven.DefaultMaven.doExecute (DefaultMaven.java:305)
2021-06-21T07:22:36.7352359Z at org.apache.maven.DefaultMaven.doExecute (DefaultMaven.java:192)
2021-06-21T07:22:36.7353009Z at org.apache.maven.DefaultMaven.execute (DefaultMaven.java:105)
2021-06-21T07:22:36.7353637Z at org.apache.maven.cli.MavenCli.execute (MavenCli.java:957)
2021-06-21T07:22:36.7354266Z at org.apache.maven.cli.MavenCli.doMain (MavenCli.java:289)
2021-06-21T07:22:36.7354883Z at org.apache.maven.cli.MavenCli.main (MavenCli.java:193)
2021-06-21T07:22:36.7355497Z at sun.reflect.NativeMethodAccessorImpl.invoke0 (Native Method)
2021-06-21T07:22:36.7356133Z at sun.reflect.NativeMethodAccessorImpl.invoke (NativeMethodAccessorImpl.java:62)
2021-06-21T07:22:36.7356869Z at sun.reflect.DelegatingMethodAccessorImpl.invoke (DelegatingMethodAccessorImpl.java:43)
2021-06-21T07:22:36.7357530Z at java.lang.reflect.Method.invoke (Method.java:498)
2021-06-21T07:22:36.7358208Z at org.codehaus.plexus.classworlds.launcher.Launcher.launchEnhanced (Launcher.java:282)
2021-06-21T07:22:36.7358936Z at org.codehaus.plexus.classworlds.launcher.Launcher.launch (Launcher.java:225)
2021-06-21T07:22:36.7359672Z at org.codehaus.plexus.classworlds.launcher.Launcher.mainWithExitCode (Launcher.java:406)
2021-06-21T07:22:36.7360384Z at org.codehaus.plexus.classworlds.launcher.Launcher.main (Launcher.java:347)
2021-06-21T07:22:36.7361204Z Caused by: java.lang.IllegalStateException: Fail to request url: https://atep.comp.com/sonar/api/new_code_periods/show.protobuf?project=TIS&branch=master
2021-06-21T07:22:36.7362006Z at org.sonarqube.ws.client.HttpConnector.doCall (HttpConnector.java:205)
2021-06-21T07:22:36.7362682Z at org.sonarqube.ws.client.HttpConnector.get (HttpConnector.java:124)
2021-06-21T07:22:36.7363340Z at org.sonarqube.ws.client.HttpConnector.call (HttpConnector.java:111)
2021-06-21T07:22:36.7364056Z at org.sonar.scanner.bootstrap.DefaultScannerWsClient.call (DefaultScannerWsClient.java:73)
2021-06-21T07:22:36.7364817Z at org.sonar.scanner.repository.DefaultNewCodePeriodLoader.call (DefaultNewCodePeriodLoader.java:51)
2021-06-21T07:22:36.7369972Z at org.sonar.scanner.repository.DefaultNewCodePeriodLoader.load (DefaultNewCodePeriodLoader.java:43)
2021-06-21T07:22:36.7371061Z at org.sonar.scanner.repository.ForkDateSupplier.get (ForkDateSupplier.java:65)
2021-06-21T07:22:36.7376090Z at org.sonar.scanner.report.MetadataPublisher.addForkPoint (MetadataPublisher.java:118)
2021-06-21T07:22:36.7380278Z at org.sonar.scanner.report.MetadataPublisher.publish (MetadataPublisher.java:96)
2021-06-21T07:22:36.7384357Z at org.sonar.scanner.report.ReportPublisher.generateReportFile (ReportPublisher.java:162)
2021-06-21T07:22:36.7388292Z at org.sonar.scanner.report.ReportPublisher.execute (ReportPublisher.java:136)
2021-06-21T07:22:36.7392315Z at org.sonar.scanner.scan.ProjectScanContainer.doAfterStart (ProjectScanContainer.java:365)
2021-06-21T07:22:36.7396297Z at org.sonar.core.platform.ComponentContainer.startComponents (ComponentContainer.java:137)
2021-06-21T07:22:36.7401424Z at org.sonar.core.platform.ComponentContainer.execute (ComponentContainer.java:123)
2021-06-21T07:22:36.7411798Z at org.sonar.scanner.bootstrap.GlobalContainer.doAfterStart (GlobalContainer.java:150)
2021-06-21T07:22:36.7412636Z at org.sonar.core.platform.ComponentContainer.startComponents (ComponentContainer.java:137)
2021-06-21T07:22:36.7413375Z at org.sonar.core.platform.ComponentContainer.execute (ComponentContainer.java:123)
2021-06-21T07:22:36.7414055Z at org.sonar.batch.bootstrapper.Batch.doExecute (Batch.java:72)
2021-06-21T07:22:36.7423507Z at org.sonar.batch.bootstrapper.Batch.execute (Batch.java:66)
2021-06-21T07:22:36.7424175Z at org.sonarsource.scanner.api.internal.batch.BatchIsolatedLauncher.execute (BatchIsolatedLauncher.java:46)
2021-06-21T07:22:36.7424916Z at sun.reflect.NativeMethodAccessorImpl.invoke0 (Native Method)
2021-06-21T07:22:36.7434480Z at sun.reflect.NativeMethodAccessorImpl.invoke (NativeMethodAccessorImpl.java:62)
2021-06-21T07:22:36.7446603Z at sun.reflect.DelegatingMethodAccessorImpl.invoke (DelegatingMethodAccessorImpl.java:43)
2021-06-21T07:22:36.7447365Z at java.lang.reflect.Method.invoke (Method.java:498)
2021-06-21T07:22:36.7448061Z at org.sonarsource.scanner.api.internal.IsolatedLauncherProxy.invoke (IsolatedLauncherProxy.java:60)
2021-06-21T07:22:36.7448738Z at com.sun.proxy.$Proxy163.execute (Unknown Source)
2021-06-21T07:22:36.7458382Z at org.sonarsource.scanner.api.EmbeddedScanner.doExecute (EmbeddedScanner.java:185)
2021-06-21T07:22:36.7459193Z at org.sonarsource.scanner.api.EmbeddedScanner.execute (EmbeddedScanner.java:137)
2021-06-21T07:22:36.7459846Z at org.sonarsource.scanner.maven.bootstrap.ScannerBootstrapper.execute (ScannerBootstrapper.java:65)
2021-06-21T07:22:36.7469982Z at org.sonarsource.scanner.maven.SonarQubeMojo.execute (SonarQubeMojo.java:104)
2021-06-21T07:22:36.7470669Z at org.apache.maven.plugin.DefaultBuildPluginManager.executeMojo (DefaultBuildPluginManager.java:137)
2021-06-21T07:22:36.7471330Z at org.apache.maven.lifecycle.internal.MojoExecutor.execute (MojoExecutor.java:210)
2021-06-21T07:22:36.7475515Z at org.apache.maven.lifecycle.internal.MojoExecutor.execute (MojoExecutor.java:156)
2021-06-21T07:22:36.7484749Z at org.apache.maven.lifecycle.internal.MojoExecutor.execute (MojoExecutor.java:148)
2021-06-21T07:22:36.7485487Z at org.apache.maven.lifecycle.internal.LifecycleModuleBuilder.buildProject (LifecycleModuleBuilder.java:117)
2021-06-21T07:22:36.7492888Z at org.apache.maven.lifecycle.internal.LifecycleModuleBuilder.buildProject (LifecycleModuleBuilder.java:81)
2021-06-21T07:22:36.7498497Z at org.apache.maven.lifecycle.internal.builder.singlethreaded.SingleThreadedBuilder.build (SingleThreadedBuilder.java:56)
2021-06-21T07:22:36.7503301Z at org.apache.maven.lifecycle.internal.LifecycleStarter.execute (LifecycleStarter.java:128)
2021-06-21T07:22:36.7507377Z at org.apache.maven.DefaultMaven.doExecute (DefaultMaven.java:305)
2021-06-21T07:22:36.7512114Z at org.apache.maven.DefaultMaven.doExecute (DefaultMaven.java:192)
2021-06-21T07:22:36.7516286Z at org.apache.maven.DefaultMaven.execute (DefaultMaven.java:105)
2021-06-21T07:22:36.7520467Z at org.apache.maven.cli.MavenCli.execute (MavenCli.java:957)
2021-06-21T07:22:36.7524995Z at org.apache.maven.cli.MavenCli.doMain (MavenCli.java:289)
2021-06-21T07:22:36.7532293Z at org.apache.maven.cli.MavenCli.main (MavenCli.java:193)
2021-06-21T07:22:36.7532827Z at sun.reflect.NativeMethodAccessorImpl.invoke0 (Native Method)
2021-06-21T07:22:36.7533380Z at sun.reflect.NativeMethodAccessorImpl.invoke (NativeMethodAccessorImpl.java:62)
2021-06-21T07:22:36.7542987Z at sun.reflect.DelegatingMethodAccessorImpl.invoke (DelegatingMethodAccessorImpl.java:43)
2021-06-21T07:22:36.7543610Z at java.lang.reflect.Method.invoke (Method.java:498)
2021-06-21T07:22:36.7544352Z at org.codehaus.plexus.classworlds.launcher.Launcher.launchEnhanced (Launcher.java:282)
2021-06-21T07:22:36.7544976Z at org.codehaus.plexus.classworlds.launcher.Launcher.launch (Launcher.java:225)
2021-06-21T07:22:36.7551882Z at org.codehaus.plexus.classworlds.launcher.Launcher.mainWithExitCode (Launcher.java:406)
2021-06-21T07:22:36.7552534Z at org.codehaus.plexus.classworlds.launcher.Launcher.main (Launcher.java:347)
2021-06-21T07:22:36.7559002Z Caused by: java.net.SocketTimeoutException: timeout
2021-06-21T07:22:36.7561589Z at okio.SocketAsyncTimeout.newTimeoutException (JvmOkio.kt:143)
2021-06-21T07:22:36.7566302Z at okio.AsyncTimeout.access$newTimeoutException (AsyncTimeout.kt:162)
2021-06-21T07:22:36.7568916Z at okio.AsyncTimeout$source$1.read (AsyncTimeout.kt:335)
2021-06-21T07:22:36.7572486Z at okio.RealBufferedSource.indexOf (RealBufferedSource.kt:427)
2021-06-21T07:22:36.7576322Z at okio.RealBufferedSource.readUtf8LineStrict (RealBufferedSource.kt:320)
2021-06-21T07:22:36.7580247Z at okhttp3.internal.http1.HeadersReader.readLine (HeadersReader.kt:29)
2021-06-21T07:22:36.7584692Z at okhttp3.internal.http1.Http1ExchangeCodec.readResponseHeaders (Http1ExchangeCodec.kt:178)
2021-06-21T07:22:36.7589295Z at okhttp3.internal.connection.Exchange.readResponseHeaders (Exchange.kt:106)
2021-06-21T07:22:36.7594043Z at okhttp3.internal.http.CallServerInterceptor.intercept (CallServerInterceptor.kt:79)
2021-06-21T07:22:36.7594831Z at okhttp3.internal.http.RealInterceptorChain.proceed (RealInterceptorChain.kt:109)
2021-06-21T07:22:36.7608422Z at org.sonarqube.ws.client.OkHttpClientBuilder.addHeaders (OkHttpClientBuilder.java:222)
2021-06-21T07:22:36.7609065Z at okhttp3.internal.http.RealInterceptorChain.proceed (RealInterceptorChain.kt:109)
2021-06-21T07:22:36.7609703Z at okhttp3.internal.connection.ConnectInterceptor.intercept (ConnectInterceptor.kt:34)
2021-06-21T07:22:36.7610563Z at okhttp3.internal.http.RealInterceptorChain.proceed (RealInterceptorChain.kt:109)
2021-06-21T07:22:36.7611195Z at okhttp3.internal.cache.CacheInterceptor.intercept (CacheInterceptor.kt:95)
2021-06-21T07:22:36.7614182Z at okhttp3.internal.http.RealInterceptorChain.proceed (RealInterceptorChain.kt:109)
2021-06-21T07:22:36.7614828Z at okhttp3.internal.http.BridgeInterceptor.intercept (BridgeInterceptor.kt:83)
2021-06-21T07:22:36.7619436Z at okhttp3.internal.http.RealInterceptorChain.proceed (RealInterceptorChain.kt:109)
2021-06-21T07:22:36.7623796Z at okhttp3.internal.http.RetryAndFollowUpInterceptor.intercept (RetryAndFollowUpInterceptor.kt:76)
2021-06-21T07:22:36.7663199Z at okhttp3.internal.http.RealInterceptorChain.proceed (RealInterceptorChain.kt:109)
2021-06-21T07:22:36.7667754Z at okhttp3.internal.connection.RealCall.getResponseWithInterceptorChain$okhttp (RealCall.kt:201)
2021-06-21T07:22:36.7671979Z at okhttp3.internal.connection.RealCall.execute (RealCall.kt:154)
2021-06-21T07:22:36.7677541Z at org.sonarqube.ws.client.HttpConnector.doCall (HttpConnector.java:203)
2021-06-21T07:22:36.7713371Z at org.sonarqube.ws.client.HttpConnector.get (HttpConnector.java:124)
2021-06-21T07:22:36.7714181Z at org.sonarqube.ws.client.HttpConnector.call (HttpConnector.java:111)
2021-06-21T07:22:36.7714802Z at org.sonar.scanner.bootstrap.DefaultScannerWsClient.call (DefaultScannerWsClient.java:73)
2021-06-21T07:22:36.7722249Z at org.sonar.scanner.repository.DefaultNewCodePeriodLoader.call (DefaultNewCodePeriodLoader.java:51)
2021-06-21T07:22:36.7723393Z at org.sonar.scanner.repository.DefaultNewCodePeriodLoader.load (DefaultNewCodePeriodLoader.java:43)
2021-06-21T07:22:36.7724049Z at org.sonar.scanner.repository.ForkDateSupplier.get (ForkDateSupplier.java:65)
2021-06-21T07:22:36.7730707Z at org.sonar.scanner.report.MetadataPublisher.addForkPoint (MetadataPublisher.java:118)
2021-06-21T07:22:36.7731545Z at org.sonar.scanner.report.MetadataPublisher.publish (MetadataPublisher.java:96)
2021-06-21T07:22:36.7732344Z at org.sonar.scanner.report.ReportPublisher.generateReportFile (ReportPublisher.java:162)
2021-06-21T07:22:36.7732965Z at org.sonar.scanner.report.ReportPublisher.execute (ReportPublisher.java:136)
2021-06-21T07:22:36.7739346Z at org.sonar.scanner.scan.ProjectScanContainer.doAfterStart (ProjectScanContainer.java:365)
2021-06-21T07:22:36.7740022Z at org.sonar.core.platform.ComponentContainer.startComponents (ComponentContainer.java:137)
2021-06-21T07:22:36.7740863Z at org.sonar.core.platform.ComponentContainer.execute (ComponentContainer.java:123)
2021-06-21T07:22:36.7748507Z at org.sonar.scanner.bootstrap.GlobalContainer.doAfterStart (GlobalContainer.java:150)
2021-06-21T07:22:36.7749369Z at org.sonar.core.platform.ComponentContainer.startComponents (ComponentContainer.java:137)
2021-06-21T07:22:36.7750011Z at org.sonar.core.platform.ComponentContainer.execute (ComponentContainer.java:123)
2021-06-21T07:22:36.7756590Z at org.sonar.batch.bootstrapper.Batch.doExecute (Batch.java:72)
2021-06-21T07:22:36.7757300Z at org.sonar.batch.bootstrapper.Batch.execute (Batch.java:66)
2021-06-21T07:22:36.7758129Z at org.sonarsource.scanner.api.internal.batch.BatchIsolatedLauncher.execute (BatchIsolatedLauncher.java:46)
2021-06-21T07:22:36.7775902Z at sun.reflect.NativeMethodAccessorImpl.invoke0 (Native Method)
2021-06-21T07:22:36.7792506Z at sun.reflect.NativeMethodAccessorImpl.invoke (NativeMethodAccessorImpl.java:62)
2021-06-21T07:22:36.7793590Z at sun.reflect.DelegatingMethodAccessorImpl.invoke (DelegatingMethodAccessorImpl.java:43)
2021-06-21T07:22:36.7794263Z at java.lang.reflect.Method.invoke (Method.java:498)
2021-06-21T07:22:36.7802364Z at org.sonarsource.scanner.api.internal.IsolatedLauncherProxy.invoke (IsolatedLauncherProxy.java:60)
2021-06-21T07:22:36.7824150Z at com.sun.proxy.$Proxy163.execute (Unknown Source)
2021-06-21T07:22:36.7824939Z at org.sonarsource.scanner.api.EmbeddedScanner.doExecute (EmbeddedScanner.java:185)
2021-06-21T07:22:36.7825956Z at org.sonarsource.scanner.api.EmbeddedScanner.execute (EmbeddedScanner.java:137)
2021-06-21T07:22:36.7861325Z at org.sonarsource.scanner.maven.bootstrap.ScannerBootstrapper.execute (ScannerBootstrapper.java:65)
2021-06-21T07:22:36.7862573Z at org.sonarsource.scanner.maven.SonarQubeMojo.execute (SonarQubeMojo.java:104)
2021-06-21T07:22:36.7863729Z at org.apache.maven.plugin.DefaultBuildPluginManager.executeMojo (DefaultBuildPluginManager.java:137)
2021-06-21T07:22:36.7900641Z at org.apache.maven.lifecycle.internal.MojoExecutor.execute (MojoExecutor.java:210)
2021-06-21T07:22:36.7901325Z at org.apache.maven.lifecycle.internal.MojoExecutor.execute (MojoExecutor.java:156)
2021-06-21T07:22:36.7901952Z at org.apache.maven.lifecycle.internal.MojoExecutor.execute (MojoExecutor.java:148)
2021-06-21T07:22:36.7902825Z at org.apache.maven.lifecycle.internal.LifecycleModuleBuilder.buildProject (LifecycleModuleBuilder.java:117)
2021-06-21T07:22:36.7903637Z at org.apache.maven.lifecycle.internal.LifecycleModuleBuilder.buildProject (LifecycleModuleBuilder.java:81)
2021-06-21T07:22:36.7904497Z at org.apache.maven.lifecycle.internal.builder.singlethreaded.SingleThreadedBuilder.build (SingleThreadedBuilder.java:56)
2021-06-21T07:22:36.7905298Z at org.apache.maven.lifecycle.internal.LifecycleStarter.execute (LifecycleStarter.java:128)
2021-06-21T07:22:36.7905995Z at org.apache.maven.DefaultMaven.doExecute (DefaultMaven.java:305)
2021-06-21T07:22:36.7906943Z at org.apache.maven.DefaultMaven.doExecute (DefaultMaven.java:192)
2021-06-21T07:22:36.7907616Z at org.apache.maven.DefaultMaven.execute (DefaultMaven.java:105)
2021-06-21T07:22:36.7908245Z at org.apache.maven.cli.MavenCli.execute (MavenCli.java:957)
2021-06-21T07:22:36.7908887Z at org.apache.maven.cli.MavenCli.doMain (MavenCli.java:289)
2021-06-21T07:22:36.7909497Z at org.apache.maven.cli.MavenCli.main (MavenCli.java:193)
2021-06-21T07:22:36.7913236Z at sun.reflect.NativeMethodAccessorImpl.invoke0 (Native Method)
2021-06-21T07:22:36.7915877Z at sun.reflect.NativeMethodAccessorImpl.invoke (NativeMethodAccessorImpl.java:62)
2021-06-21T07:22:36.7916811Z at sun.reflect.DelegatingMethodAccessorImpl.invoke (DelegatingMethodAccessorImpl.java:43)
2021-06-21T07:22:36.7917475Z at java.lang.reflect.Method.invoke (Method.java:498)
2021-06-21T07:22:36.7919873Z at org.codehaus.plexus.classworlds.launcher.Launcher.launchEnhanced (Launcher.java:282)
2021-06-21T07:22:36.7923132Z at org.codehaus.plexus.classworlds.launcher.Launcher.launch (Launcher.java:225)
2021-06-21T07:22:36.7924086Z at org.codehaus.plexus.classworlds.launcher.Launcher.mainWithExitCode (Launcher.java:406)
2021-06-21T07:22:36.7924803Z at org.codehaus.plexus.classworlds.launcher.Launcher.main (Launcher.java:347)
2021-06-21T07:22:36.7928541Z Caused by: javax.net.ssl.SSLException: Socket closed
2021-06-21T07:22:36.7938287Z at sun.security.ssl.Alert.createSSLException (Alert.java:127)
2021-06-21T07:22:36.7945511Z at sun.security.ssl.TransportContext.fatal (TransportContext.java:324)
2021-06-21T07:22:36.7950774Z at sun.security.ssl.TransportContext.fatal (TransportContext.java:267)
2021-06-21T07:22:36.7955114Z at sun.security.ssl.TransportContext.fatal (TransportContext.java:262)
2021-06-21T07:22:36.7959760Z at sun.security.ssl.SSLSocketImpl.handleException (SSLSocketImpl.java:1554)
2021-06-21T07:22:36.7962596Z at sun.security.ssl.SSLSocketImpl.access$400 (SSLSocketImpl.java:73)
2021-06-21T07:22:36.7990697Z at sun.security.ssl.SSLSocketImpl$AppInputStream.read (SSLSocketImpl.java:964)
2021-06-21T07:22:36.7991755Z at okio.InputStreamSource.read (JvmOkio.kt:90)
2021-06-21T07:22:36.7992262Z at okio.AsyncTimeout$source$1.read (AsyncTimeout.kt:129)
2021-06-21T07:22:36.7992802Z at okio.RealBufferedSource.indexOf (RealBufferedSource.kt:427)
2021-06-21T07:22:36.7993358Z at okio.RealBufferedSource.readUtf8LineStrict (RealBufferedSource.kt:320)
2021-06-21T07:22:36.7993947Z at okhttp3.internal.http1.HeadersReader.readLine (HeadersReader.kt:29)
2021-06-21T07:22:36.7994563Z at okhttp3.internal.http1.Http1ExchangeCodec.readResponseHeaders (Http1ExchangeCodec.kt:178)
2021-06-21T07:22:36.7995188Z at okhttp3.internal.connection.Exchange.readResponseHeaders (Exchange.kt:106)
2021-06-21T07:22:36.7995807Z at okhttp3.internal.http.CallServerInterceptor.intercept (CallServerInterceptor.kt:79)
2021-06-21T07:22:36.7996425Z at okhttp3.internal.http.RealInterceptorChain.proceed (RealInterceptorChain.kt:109)
2021-06-21T07:22:36.7997063Z at org.sonarqube.ws.client.OkHttpClientBuilder.addHeaders (OkHttpClientBuilder.java:222)
2021-06-21T07:22:36.7997685Z at okhttp3.internal.http.RealInterceptorChain.proceed (RealInterceptorChain.kt:109)
2021-06-21T07:22:36.7998311Z at okhttp3.internal.connection.ConnectInterceptor.intercept (ConnectInterceptor.kt:34)
2021-06-21T07:22:36.7998924Z at okhttp3.internal.http.RealInterceptorChain.proceed (RealInterceptorChain.kt:109)
2021-06-21T07:22:36.7999531Z at okhttp3.internal.cache.CacheInterceptor.intercept (CacheInterceptor.kt:95)
2021-06-21T07:22:36.8000136Z at okhttp3.internal.http.RealInterceptorChain.proceed (RealInterceptorChain.kt:109)
2021-06-21T07:22:36.8000744Z at okhttp3.internal.http.BridgeInterceptor.intercept (BridgeInterceptor.kt:83)
2021-06-21T07:22:36.8025627Z at okhttp3.internal.http.RealInterceptorChain.proceed (RealInterceptorChain.kt:109)
2021-06-21T07:22:36.8029650Z at okhttp3.internal.http.RetryAndFollowUpInterceptor.intercept (RetryAndFollowUpInterceptor.kt:76)
2021-06-21T07:22:36.8030519Z at okhttp3.internal.http.RealInterceptorChain.proceed (RealInterceptorChain.kt:109)
2021-06-21T07:22:36.8036136Z at okhttp3.internal.connection.RealCall.getResponseWithInterceptorChain$okhttp (RealCall.kt:201)
2021-06-21T07:22:36.8036781Z at okhttp3.internal.connection.RealCall.execute (RealCall.kt:154)
2021-06-21T07:22:36.8037347Z at org.sonarqube.ws.client.HttpConnector.doCall (HttpConnector.java:203)
2021-06-21T07:22:36.8043126Z at org.sonarqube.ws.client.HttpConnector.get (HttpConnector.java:124)
2021-06-21T07:22:36.8043715Z at org.sonarqube.ws.client.HttpConnector.call (HttpConnector.java:111)
2021-06-21T07:22:36.8044340Z at org.sonar.scanner.bootstrap.DefaultScannerWsClient.call (DefaultScannerWsClient.java:73)
2021-06-21T07:22:36.8045015Z at org.sonar.scanner.repository.DefaultNewCodePeriodLoader.call (DefaultNewCodePeriodLoader.java:51)
2021-06-21T07:22:36.8050966Z at org.sonar.scanner.repository.DefaultNewCodePeriodLoader.load (DefaultNewCodePeriodLoader.java:43)
2021-06-21T07:22:36.8051635Z at org.sonar.scanner.repository.ForkDateSupplier.get (ForkDateSupplier.java:65)
2021-06-21T07:22:36.8052276Z at org.sonar.scanner.report.MetadataPublisher.addForkPoint (MetadataPublisher.java:118)
2021-06-21T07:22:36.8057602Z at org.sonar.scanner.report.MetadataPublisher.publish (MetadataPublisher.java:96)
2021-06-21T07:22:36.8059694Z at org.sonar.scanner.report.ReportPublisher.generateReportFile (ReportPublisher.java:162)
2021-06-21T07:22:36.8061888Z at org.sonar.scanner.report.ReportPublisher.execute (ReportPublisher.java:136)
2021-06-21T07:22:36.8064483Z at org.sonar.scanner.scan.ProjectScanContainer.doAfterStart (ProjectScanContainer.java:365)
2021-06-21T07:22:36.8067625Z at org.sonar.core.platform.ComponentContainer.startComponents (ComponentContainer.java:137)
2021-06-21T07:22:36.8102352Z at org.sonar.core.platform.ComponentContainer.execute (ComponentContainer.java:123)
2021-06-21T07:22:36.8104816Z at org.sonar.scanner.bootstrap.GlobalContainer.doAfterStart (GlobalContainer.java:150)
2021-06-21T07:22:36.8105663Z at org.sonar.core.platform.ComponentContainer.startComponents (ComponentContainer.java:137)
2021-06-21T07:22:36.8107786Z at org.sonar.core.platform.ComponentContainer.execute (ComponentContainer.java:123)
2021-06-21T07:22:36.8109344Z at org.sonar.batch.bootstrapper.Batch.doExecute (Batch.java:72)
2021-06-21T07:22:36.8111379Z at org.sonar.batch.bootstrapper.Batch.execute (Batch.java:66)
2021-06-21T07:22:36.8112634Z at org.sonarsource.scanner.api.internal.batch.BatchIsolatedLauncher.execute (BatchIsolatedLauncher.java:46)
2021-06-21T07:22:36.8113754Z at sun.reflect.NativeMethodAccessorImpl.invoke0 (Native Method)
2021-06-21T07:22:36.8114486Z at sun.reflect.NativeMethodAccessorImpl.invoke (NativeMethodAccessorImpl.java:62)
2021-06-21T07:22:36.8116103Z at sun.reflect.DelegatingMethodAccessorImpl.invoke (DelegatingMethodAccessorImpl.java:43)
2021-06-21T07:22:36.8118232Z at java.lang.reflect.Method.invoke (Method.java:498)
2021-06-21T07:22:36.8119813Z at org.sonarsource.scanner.api.internal.IsolatedLauncherProxy.invoke (IsolatedLauncherProxy.java:60)
2021-06-21T07:22:36.8120911Z at com.sun.proxy.$Proxy163.execute (Unknown Source)
2021-06-21T07:22:36.8121458Z at org.sonarsource.scanner.api.EmbeddedScanner.doExecute (EmbeddedScanner.java:185)
2021-06-21T07:22:36.8122089Z at org.sonarsource.scanner.api.EmbeddedScanner.execute (EmbeddedScanner.java:137)
2021-06-21T07:22:36.8122740Z at org.sonarsource.scanner.maven.bootstrap.ScannerBootstrapper.execute (ScannerBootstrapper.java:65)
2021-06-21T07:22:36.8123835Z at org.sonarsource.scanner.maven.SonarQubeMojo.execute (SonarQubeMojo.java:104)
2021-06-21T07:22:36.8124484Z at org.apache.maven.plugin.DefaultBuildPluginManager.executeMojo (DefaultBuildPluginManager.java:137)
2021-06-21T07:22:36.8134333Z at org.apache.maven.lifecycle.internal.MojoExecutor.execute (MojoExecutor.java:210)
2021-06-21T07:22:36.8136996Z at org.apache.maven.lifecycle.internal.MojoExecutor.execute (MojoExecutor.java:156)
2021-06-21T07:22:36.8137640Z at org.apache.maven.lifecycle.internal.MojoExecutor.execute (MojoExecutor.java:148)
2021-06-21T07:22:36.8138634Z at org.apache.maven.lifecycle.internal.LifecycleModuleBuilder.buildProject (LifecycleModuleBuilder.java:117)
2021-06-21T07:22:36.8148097Z at org.apache.maven.lifecycle.internal.LifecycleModuleBuilder.buildProject (LifecycleModuleBuilder.java:81)
2021-06-21T07:22:36.8152082Z at org.apache.maven.lifecycle.internal.builder.singlethreaded.SingleThreadedBuilder.build (SingleThreadedBuilder.java:56)
2021-06-21T07:22:36.8168295Z at org.apache.maven.lifecycle.internal.LifecycleStarter.execute (LifecycleStarter.java:128)
2021-06-21T07:22:36.8178031Z at org.apache.maven.DefaultMaven.doExecute (DefaultMaven.java:305)
2021-06-21T07:22:36.8178646Z at org.apache.maven.DefaultMaven.doExecute (DefaultMaven.java:192)
2021-06-21T07:22:36.8179320Z at org.apache.maven.DefaultMaven.execute (DefaultMaven.java:105)
2021-06-21T07:22:36.8180189Z at org.apache.maven.cli.MavenCli.execute (MavenCli.java:957)
2021-06-21T07:22:36.8196545Z at org.apache.maven.cli.MavenCli.doMain (MavenCli.java:289)
2021-06-21T07:22:36.8197099Z at org.apache.maven.cli.MavenCli.main (MavenCli.java:193)
2021-06-21T07:22:36.8197623Z at sun.reflect.NativeMethodAccessorImpl.invoke0 (Native Method)
2021-06-21T07:22:36.8198178Z at sun.reflect.NativeMethodAccessorImpl.invoke (NativeMethodAccessorImpl.java:62)
2021-06-21T07:22:36.8215147Z at sun.reflect.DelegatingMethodAccessorImpl.invoke (DelegatingMethodAccessorImpl.java:43)
2021-06-21T07:22:36.8215755Z at java.lang.reflect.Method.invoke (Method.java:498)
2021-06-21T07:22:36.8216348Z at org.codehaus.plexus.classworlds.launcher.Launcher.launchEnhanced (Launcher.java:282)
2021-06-21T07:22:36.8216971Z at org.codehaus.plexus.classworlds.launcher.Launcher.launch (Launcher.java:225)
2021-06-21T07:22:36.8243407Z at org.codehaus.plexus.classworlds.launcher.Launcher.mainWithExitCode (Launcher.java:406)
2021-06-21T07:22:36.8244080Z at org.codehaus.plexus.classworlds.launcher.Launcher.main (Launcher.java:347)
2021-06-21T07:22:36.8244616Z Caused by: java.net.SocketException: Socket closed
2021-06-21T07:22:36.8245133Z at java.net.SocketInputStream.read (SocketInputStream.java:204)
2021-06-21T07:22:36.8300857Z at java.net.SocketInputStream.read (SocketInputStream.java:141)
2021-06-21T07:22:36.8301490Z at sun.security.ssl.SSLSocketInputRecord.read (SSLSocketInputRecord.java:457)
2021-06-21T07:22:36.8302123Z at sun.security.ssl.SSLSocketInputRecord.bytesInCompletePacket (SSLSocketInputRecord.java:68)
2021-06-21T07:22:36.8311919Z at sun.security.ssl.SSLSocketImpl.readApplicationRecord (SSLSocketImpl.java:1332)
2021-06-21T07:22:36.8315632Z at sun.security.ssl.SSLSocketImpl.access$300 (SSLSocketImpl.java:73)
2021-06-21T07:22:36.8316259Z at sun.security.ssl.SSLSocketImpl$AppInputStream.read (SSLSocketImpl.java:948)
2021-06-21T07:22:36.8316788Z at okio.InputStreamSource.read (JvmOkio.kt:90)
2021-06-21T07:22:36.8317279Z at okio.AsyncTimeout$source$1.read (AsyncTimeout.kt:129)
2021-06-21T07:22:36.8317819Z at okio.RealBufferedSource.indexOf (RealBufferedSource.kt:427)
2021-06-21T07:22:36.8318377Z at okio.RealBufferedSource.readUtf8LineStrict (RealBufferedSource.kt:320)
2021-06-21T07:22:36.8318963Z at okhttp3.internal.http1.HeadersReader.readLine (HeadersReader.kt:29)
2021-06-21T07:22:36.8319581Z at okhttp3.internal.http1.Http1ExchangeCodec.readResponseHeaders (Http1ExchangeCodec.kt:178)
2021-06-21T07:22:36.8320219Z at okhttp3.internal.connection.Exchange.readResponseHeaders (Exchange.kt:106)
2021-06-21T07:22:36.8333928Z at okhttp3.internal.http.CallServerInterceptor.intercept (CallServerInterceptor.kt:79)
2021-06-21T07:22:36.8334605Z at okhttp3.internal.http.RealInterceptorChain.proceed (RealInterceptorChain.kt:109)
2021-06-21T07:22:36.8335407Z at org.sonarqube.ws.client.OkHttpClientBuilder.addHeaders (OkHttpClientBuilder.java:222)
2021-06-21T07:22:36.8336055Z at okhttp3.internal.http.RealInterceptorChain.proceed (RealInterceptorChain.kt:109)
2021-06-21T07:22:36.8336675Z at okhttp3.internal.connection.ConnectInterceptor.intercept (ConnectInterceptor.kt:34)
2021-06-21T07:22:36.8337297Z at okhttp3.internal.http.RealInterceptorChain.proceed (RealInterceptorChain.kt:109)
2021-06-21T07:22:36.8338265Z at okhttp3.internal.cache.CacheInterceptor.intercept (CacheInterceptor.kt:95)
2021-06-21T07:22:36.8351757Z at okhttp3.internal.http.RealInterceptorChain.proceed (RealInterceptorChain.kt:109)
2021-06-21T07:22:36.8352401Z at okhttp3.internal.http.BridgeInterceptor.intercept (BridgeInterceptor.kt:83)
2021-06-21T07:22:36.8353012Z at okhttp3.internal.http.RealInterceptorChain.proceed (RealInterceptorChain.kt:109)
2021-06-21T07:22:36.8370784Z at okhttp3.internal.http.RetryAndFollowUpInterceptor.intercept (RetryAndFollowUpInterceptor.kt:76)
2021-06-21T07:22:36.8371508Z at okhttp3.internal.http.RealInterceptorChain.proceed (RealInterceptorChain.kt:109)
2021-06-21T07:22:36.8372164Z at okhttp3.internal.connection.RealCall.getResponseWithInterceptorChain$okhttp (RealCall.kt:201)
2021-06-21T07:22:36.8373069Z at okhttp3.internal.connection.RealCall.execute (RealCall.kt:154)
2021-06-21T07:22:36.8389509Z at org.sonarqube.ws.client.HttpConnector.doCall (HttpConnector.java:203)
2021-06-21T07:22:36.8390137Z at org.sonarqube.ws.client.HttpConnector.get (HttpConnector.java:124)
2021-06-21T07:22:36.8390729Z at org.sonarqube.ws.client.HttpConnector.call (HttpConnector.java:111)
2021-06-21T07:22:36.8407201Z at org.sonar.scanner.bootstrap.DefaultScannerWsClient.call (DefaultScannerWsClient.java:73)
2021-06-21T07:22:36.8407908Z at org.sonar.scanner.repository.DefaultNewCodePeriodLoader.call (DefaultNewCodePeriodLoader.java:51)
2021-06-21T07:22:36.8408601Z at org.sonar.scanner.repository.DefaultNewCodePeriodLoader.load (DefaultNewCodePeriodLoader.java:43)
2021-06-21T07:22:36.8409262Z at org.sonar.scanner.repository.ForkDateSupplier.get (ForkDateSupplier.java:65)
2021-06-21T07:22:36.8424819Z at org.sonar.scanner.report.MetadataPublisher.addForkPoint (MetadataPublisher.java:118)
2021-06-21T07:22:36.8425478Z at org.sonar.scanner.report.MetadataPublisher.publish (MetadataPublisher.java:96)
2021-06-21T07:22:36.8426126Z at org.sonar.scanner.report.ReportPublisher.generateReportFile (ReportPublisher.java:162)
2021-06-21T07:22:36.8442882Z at org.sonar.scanner.report.ReportPublisher.execute (ReportPublisher.java:136)
2021-06-21T07:22:36.8443552Z at org.sonar.scanner.scan.ProjectScanContainer.doAfterStart (ProjectScanContainer.java:365)
2021-06-21T07:22:36.8444201Z at org.sonar.core.platform.ComponentContainer.startComponents (ComponentContainer.java:137)
2021-06-21T07:22:36.8460287Z at org.sonar.core.platform.ComponentContainer.execute (ComponentContainer.java:123)
2021-06-21T07:22:36.8460948Z at org.sonar.scanner.bootstrap.GlobalContainer.doAfterStart (GlobalContainer.java:150)
2021-06-21T07:22:36.8461607Z at org.sonar.core.platform.ComponentContainer.startComponents (ComponentContainer.java:137)
2021-06-21T07:22:36.8462236Z at org.sonar.core.platform.ComponentContainer.execute (ComponentContainer.java:123)
2021-06-21T07:22:36.8477030Z at org.sonar.batch.bootstrapper.Batch.doExecute (Batch.java:72)
2021-06-21T07:22:36.8477603Z at org.sonar.batch.bootstrapper.Batch.execute (Batch.java:66)
2021-06-21T07:22:36.8478242Z at org.sonarsource.scanner.api.internal.batch.BatchIsolatedLauncher.execute (BatchIsolatedLauncher.java:46)
2021-06-21T07:22:36.8515147Z at sun.reflect.NativeMethodAccessorImpl.invoke0 (Native Method)
2021-06-21T07:22:36.8519030Z at sun.reflect.NativeMethodAccessorImpl.invoke (NativeMethodAccessorImpl.java:62)
2021-06-21T07:22:36.8529258Z at sun.reflect.DelegatingMethodAccessorImpl.invoke (DelegatingMethodAccessorImpl.java:43)
2021-06-21T07:22:36.8534668Z at java.lang.reflect.Method.invoke (Method.java:498)
2021-06-21T07:22:36.8546371Z at org.sonarsource.scanner.api.internal.IsolatedLauncherProxy.invoke (IsolatedLauncherProxy.java:60)
2021-06-21T07:22:36.8556977Z at com.sun.proxy.$Proxy163.execute (Unknown Source)
2021-06-21T07:22:36.8557704Z at org.sonarsource.scanner.api.EmbeddedScanner.doExecute (EmbeddedScanner.java:185)
2021-06-21T07:22:36.8558337Z at org.sonarsource.scanner.api.EmbeddedScanner.execute (EmbeddedScanner.java:137)
2021-06-21T07:22:36.8559152Z at org.sonarsource.scanner.maven.bootstrap.ScannerBootstrapper.execute (ScannerBootstrapper.java:65)
2021-06-21T07:22:36.8559789Z at org.sonarsource.scanner.maven.SonarQubeMojo.execute (SonarQubeMojo.java:104)
2021-06-21T07:22:36.8560481Z at org.apache.maven.plugin.DefaultBuildPluginManager.executeMojo (DefaultBuildPluginManager.java:137)
2021-06-21T07:22:36.8561132Z at org.apache.maven.lifecycle.internal.MojoExecutor.execute (MojoExecutor.java:210)
2021-06-21T07:22:36.8561761Z at org.apache.maven.lifecycle.internal.MojoExecutor.execute (MojoExecutor.java:156)
2021-06-21T07:22:36.8562398Z at org.apache.maven.lifecycle.internal.MojoExecutor.execute (MojoExecutor.java:148)
2021-06-21T07:22:36.8580550Z at org.apache.maven.lifecycle.internal.LifecycleModuleBuilder.buildProject (LifecycleModuleBuilder.java:117)
2021-06-21T07:22:36.8581349Z at org.apache.maven.lifecycle.internal.LifecycleModuleBuilder.buildProject (LifecycleModuleBuilder.java:81)
2021-06-21T07:22:36.8582129Z at org.apache.maven.lifecycle.internal.builder.singlethreaded.SingleThreadedBuilder.build (SingleThreadedBuilder.java:56)
2021-06-21T07:22:36.8660770Z at org.apache.maven.lifecycle.internal.LifecycleStarter.execute (LifecycleStarter.java:128)
2021-06-21T07:22:36.8661463Z at org.apache.maven.DefaultMaven.doExecute (DefaultMaven.java:305)
2021-06-21T07:22:36.8662037Z at org.apache.maven.DefaultMaven.doExecute (DefaultMaven.java:192)
2021-06-21T07:22:36.8662607Z at org.apache.maven.DefaultMaven.execute (DefaultMaven.java:105)
2021-06-21T07:22:36.8663160Z at org.apache.maven.cli.MavenCli.execute (MavenCli.java:957)
2021-06-21T07:22:36.8663693Z at org.apache.maven.cli.MavenCli.doMain (MavenCli.java:289)
2021-06-21T07:22:36.8664230Z at org.apache.maven.cli.MavenCli.main (MavenCli.java:193)
2021-06-21T07:22:36.8664729Z at sun.reflect.NativeMethodAccessorImpl.invoke0 (Native Method)
2021-06-21T07:22:36.8665293Z at sun.reflect.NativeMethodAccessorImpl.invoke (NativeMethodAccessorImpl.java:62)
2021-06-21T07:22:36.8665935Z at sun.reflect.DelegatingMethodAccessorImpl.invoke (DelegatingMethodAccessorImpl.java:43)
2021-06-21T07:22:36.8666508Z at java.lang.reflect.Method.invoke (Method.java:498)
2021-06-21T07:22:36.8667094Z at org.codehaus.plexus.classworlds.launcher.Launcher.launchEnhanced (Launcher.java:282)
2021-06-21T07:22:36.8667717Z at org.codehaus.plexus.classworlds.launcher.Launcher.launch (Launcher.java:225)
2021-06-21T07:22:36.8668361Z at org.codehaus.plexus.classworlds.launcher.Launcher.mainWithExitCode (Launcher.java:406)
2021-06-21T07:22:36.8668983Z at org.codehaus.plexus.classworlds.launcher.Launcher.main (Launcher.java:347)
2021-06-21T07:22:36.8669442Z [ERROR]
2021-06-21T07:22:36.8669743Z [ERROR]
2021-06-21T07:22:36.8670242Z [ERROR] For more information about the errors and possible solutions, please read the following articles:
2021-06-21T07:22:36.8670887Z [ERROR] [Help 1] http://cwiki.apache.org/confluence/display/MAVEN/MojoExecutionException
2021-06-21T07:22:36.8671323Z [ERROR]
2021-06-21T07:22:36.8671747Z [ERROR] After correcting the problems, you can resume the build with the command
2021-06-21T07:22:36.8672778Z [ERROR] mvn <args> -rf :app-info-service
2021-06-21T07:22:36.9480322Z
2021-06-21T07:22:37.2303221Z Sonar failed/__w/1/source/app-info-service-api/target/site/jacoco/jacoco.xml 820
2021-06-21T07:22:37.2304023Z /__w/1/source/app-info-service-ui/target/site/jacoco/jacoco.xml 36
2021-06-21T07:22:37.2304986Z /__w/1/source/app-info-service-testlib/target/site/jacoco/jacoco.xml 8
2021-06-21T07:22:37.2305651Z /__w/1/source/app-info-framework/target/site/jacoco/jacoco.xml 292
2021-06-21T07:22:37.2306328Z /__w/1/source/app-info-service-app/target/site/jacoco/jacoco.xml 868
2021-06-21T07:22:37.2307016Z /__w/1/source/app-info-service-websocket-client/target/site/jacoco/jacoco.xml 32
2021-06-21T07:22:37.2331488Z ##[debug]Exit code 1 received from tool '/bin/bash'
2021-06-21T07:22:37.2343129Z ##[debug]STDIO streams have closed for tool '/bin/bash'
2021-06-21T07:22:37.2384957Z ##[error]Bash exited with code '1'.
2021-06-21T07:22:37.2392499Z ##[debug]Processed: ##vso[task.issue type=error;]Bash exited with code '1'.
2021-06-21T07:22:37.2393425Z ##[debug]task result: Failed
2021-06-21T07:22:37.2395525Z ##[debug]Processed: ##vso[task.complete result=Failed;done=true;]
2021-06-21T07:22:37.2446682Z ##[debug]Handler exit code: 0
2021-06-21T07:22:37.2526650Z ##[section]Finishing: sonar analysis
Sign up for free to join this conversation on GitHub. Already have an account? Sign in to comment