Skip to content

Instantly share code, notes, and snippets.

Embed
What would you like to do?
1>------ Build started: Project: Common, Configuration: Debug Win32 ------
2>------ Build started: Project: core, Configuration: Debug Win32 ------
1>Build started 1/19/2015 9:24:33 PM.
1>InitializeBuildStatus:
2>Build started 1/19/2015 9:24:33 PM.
2>InitializeBuildStatus:
2> Creating "C:\Users\RJ\project64\build/Debug/core\core.unsuccessfulbuild" because "AlwaysCreate" was specified.
2>ComputeCustomBuildOutput:
2> Creating directory "C:\Users\RJ\project64\Source\3rd Party\wx\lib\vc_lib\mswud\wx\msw\".
1> Creating "C:\Users\RJ\project64\build/Debug/Common\Common.unsuccessfulbuild" because "AlwaysCreate" was specified.
2>CustomBuild:
2> Creating lib\vc_lib\mswd\wx\setup.h
2> 1 file(s) copied.
2> Creating lib\vc_lib\mswud\wx\msw\rcdefs.h
2> genrcdefs.h
1>ClCompile:
1> stdafx.cpp
2>ClCompile:
2> dummy.cpp
1> Version.cpp
1> Trace.cpp
1> std string.cpp
1> registry.cpp
1> path.cpp
1> osversion.cpp
1> MemTest.cpp
1> md5.cpp
1> Log Class.cpp
1> Ini File Class.cpp
1> File Class.cpp
1> Generating Code...
1>c:\users\rj\project64\source\common\md5.cpp(116): warning C4706: assignment within conditional expression
1>MakeDirsForLib:
1> Creating directory "C:\Users\RJ\project64\bin\Debug\lib".
1>C:\Program Files (x86)\MSBuild\Microsoft.Cpp\v4.0\Microsoft.CppBuild.targets(1151,5): warning MSB8012: TargetPath(C:\Users\RJ\project64\bin/Debug\Common.lib) does not match the Library's OutputFile property value (C:\Users\RJ\project64\bin\Debug\lib\Common.lib). This may cause your project to build incorrectly. To correct this, please make sure that $(OutDir), $(TargetName) and $(TargetExt) property values match the value specified in %(Lib.OutputFile).
2> vscroll.cpp
2> vlbox.cpp
2> treectlg.cpp
2> treebkg.cpp
2> toolbkg.cpp
2> tipwin.cpp
2> textdlgg.cpp
2> statusbr.cpp
2> stattextg.cpp
2> statbmpg.cpp
2> srchctlg.cpp
2> splitter.cpp
2> spinctlg.cpp
2> selstore.cpp
2> scrlwing.cpp
2> richmsgdlgg.cpp
2> renderg.cpp
2> progdlgg.cpp
2> prntdlgg.cpp
1>Lib:
1> Common.vcxproj -> C:\Users\RJ\project64\bin/Debug\Common.lib
1>FinalizeBuildStatus:
1> Deleting file "C:\Users\RJ\project64\build/Debug/Common\Common.unsuccessfulbuild".
1> Touching "C:\Users\RJ\project64\build/Debug/Common\Common.lastbuildstate".
1>
1>Build succeeded.
1>
1>Time Elapsed 00:00:19.90
2> printps.cpp
2> Generating Code...
3>------ Build started: Project: Glitch64, Configuration: Debug Win32 ------
3>Build started 1/19/2015 9:24:54 PM.
3>InitializeBuildStatus:
3> Creating "C:\Users\RJ\project64\build/Debug/Glitch64\Glitch64.unsuccessfulbuild" because "AlwaysCreate" was specified.
3>ClCompile:
3> vram.cpp
2> Compiling...
2> numdlgg.cpp
3> textures.cpp
2> msgdlgg.cpp
2> markuptext.cpp
2> logg.cpp
3> main.cpp
2> listbkg.cpp
2> infobar.cpp
2> headerctrlg.cpp
2> graphicc.cpp
3>main.cpp(229): warning C4389: '==' : signed/unsigned mismatch
3>main.cpp(503): warning C4018: '>' : signed/unsigned mismatch
3>main.cpp(504): warning C4018: '>' : signed/unsigned mismatch
3>main.cpp(607): warning C4100: 'pixelformat' : unreferenced formal parameter
3>main.cpp(1331): warning C4018: '>' : signed/unsigned mismatch
3>main.cpp(1333): warning C4018: '<' : signed/unsigned mismatch
3>main.cpp(1476): warning C4018: '<=' : signed/unsigned mismatch
3>main.cpp(1476): warning C4018: '>' : signed/unsigned mismatch
2> fontpickerg.cpp
3> geometry.cpp
2> filepickerg.cpp
2> filectrlg.cpp
3> combiner.cpp
2> dragimgg.cpp
2> dirctrlg.cpp
3> Generating Code...
3>C:\Program Files (x86)\MSBuild\Microsoft.Cpp\v4.0\Microsoft.CppBuild.targets(1151,5): warning MSB8012: TargetPath(C:\Users\RJ\project64\bin/Debug\Glitch64.lib) does not match the Library's OutputFile property value (C:\Users\RJ\project64\bin\Debug\lib\Glitch64.lib). This may cause your project to build incorrectly. To correct this, please make sure that $(OutDir), $(TargetName) and $(TargetExt) property values match the value specified in %(Lib.OutputFile).
2> dcpsg.cpp
2> combog.cpp
3>Lib:
3> Glitch64.vcxproj -> C:\Users\RJ\project64\bin/Debug\Glitch64.lib
3>FinalizeBuildStatus:
3> Deleting file "C:\Users\RJ\project64\build/Debug/Glitch64\Glitch64.unsuccessfulbuild".
3> Touching "C:\Users\RJ\project64\build/Debug/Glitch64\Glitch64.lastbuildstate".
3>
3>Build succeeded.
3>
3>Time Elapsed 00:00:05.58
4>------ Build started: Project: Settings, Configuration: Debug Win32 ------
2> collpaneg.cpp
4>Build started 1/19/2015 9:25:00 PM.
4>InitializeBuildStatus:
4> Creating "C:\Users\RJ\project64\build/Debug/Settings\Settings.unsuccessfulbuild" because "AlwaysCreate" was specified.
2> clrpickerg.cpp
4>ClCompile:
4> Settings.cpp
2> choicdgg.cpp
2> choicbkg.cpp
2> buttonbar.cpp
2> Generating Code...
4>C:\Program Files (x86)\MSBuild\Microsoft.Cpp\v4.0\Microsoft.CppBuild.targets(1151,5): warning MSB8012: TargetPath(C:\Users\RJ\project64\bin/Debug\Settings.lib) does not match the Library's OutputFile property value (C:\Users\RJ\project64\bin\Debug\lib\Settings.lib). This may cause your project to build incorrectly. To correct this, please make sure that $(OutDir), $(TargetName) and $(TargetExt) property values match the value specified in %(Lib.OutputFile).
4>Lib:
4> Settings.vcxproj -> C:\Users\RJ\project64\bin/Debug\Settings.lib
4>FinalizeBuildStatus:
4> Deleting file "C:\Users\RJ\project64\build/Debug/Settings\Settings.unsuccessfulbuild".
4> Touching "C:\Users\RJ\project64\build/Debug/Settings\Settings.lastbuildstate".
4>
4>Build succeeded.
4>
4>Time Elapsed 00:00:01.27
5>------ Build started: Project: wxpng, Configuration: Debug Win32 ------
5>Build started 1/19/2015 9:25:01 PM.
5>InitializeBuildStatus:
5> Creating "C:\Users\RJ\project64\build/Debug/wxpng\wxpng.unsuccessfulbuild" because "AlwaysCreate" was specified.
5>ClCompile:
5> pngwutil.c
5> pngwtran.c
5> pngwrite.c
2> Compiling...
2> busyinfo.cpp
2> window.cpp
5> pngwio.c
5> pngtrans.c
5> pngset.c
2> volume.cpp
5> pngrutil.c
5> pngrtran.c
5> pngrio.c
5> pngread.c
2> uxtheme.cpp
2> uuid.cpp
2> utilsgui.cpp
5> pngpread.c
2> uiaction.cpp
2> treectrl.cpp
5> pngmem.c
2> toplevel.cpp
5> pngget.c
2> tooltip.cpp
2> toolbar.cpp
5> pngerror.c
2> tglbtn.cpp
5> png.c
2> textentry.cpp
5> Generating Code...
2> textctrl.cpp
5>C:\Program Files (x86)\MSBuild\Microsoft.Cpp\v4.0\Microsoft.CppBuild.targets(1151,5): warning MSB8012: TargetPath(C:\Users\RJ\project64\bin/Debug\wxpng.lib) does not match the Library's OutputFile property value (C:\Users\RJ\project64\bin\Debug\lib\wxpngd.lib). This may cause your project to build incorrectly. To correct this, please make sure that $(OutDir), $(TargetName) and $(TargetExt) property values match the value specified in %(Lib.OutputFile).
5>C:\Program Files (x86)\MSBuild\Microsoft.Cpp\v4.0\Microsoft.CppBuild.targets(1153,5): warning MSB8012: TargetName(wxpng) does not match the Library's OutputFile property value (wxpngd). This may cause your project to build incorrectly. To correct this, please make sure that $(OutDir), $(TargetName) and $(TargetExt) property values match the value specified in %(Lib.OutputFile).
2> statusbar.cpp
5>Lib:
5> wx_wxpng.vcxproj -> C:\Users\RJ\project64\bin/Debug\wxpng.lib
5>FinalizeBuildStatus:
5> Deleting file "C:\Users\RJ\project64\build/Debug/wxpng\wxpng.unsuccessfulbuild".
5> Touching "C:\Users\RJ\project64\build/Debug/wxpng\wxpng.lastbuildstate".
5>
5>Build succeeded.
5>
5>Time Elapsed 00:00:10.09
2> stattext.cpp
2> statline.cpp
6>------ Build started: Project: wxjpeg, Configuration: Debug Win32 ------
2> statbox.cpp
6>Build started 1/19/2015 9:25:11 PM.
6>InitializeBuildStatus:
6> Creating "C:\Users\RJ\project64\build/Debug/wxjpeg\wxjpeg.unsuccessfulbuild" because "AlwaysCreate" was specified.
6>ClCompile:
6> jutils.c
2> statbmp.cpp
6> jquant2.c
2> spinctrl.cpp
6> jquant1.c
6> jmemnobs.c
6> jmemmgr.c
6> jidctred.c
2> Generating Code...
6> jidctint.c
6> jidctfst.c
6> jidctflt.c
6> jfdctint.c
6> jfdctfst.c
6> jfdctflt.c
6> jerror.c
6> jdtrans.c
6> jdsample.c
2> Compiling...
2> spinbutt.cpp
6> jdpostct.c
6> jdphuff.c
2> slider.cpp
2> settings.cpp
6> jdmerge.c
6> jdmaster.c
2> scrolbar.cpp
6> jdmarker.c
2> richmsgdlg.cpp
6> Generating Code...
2> renderer.cpp
6> Compiling...
6> jdmainct.c
2> region.cpp
6> jdinput.c
6> jdhuff.c
2> radiobut.cpp
6> jddctmgr.c
2> radiobox.cpp
6> jdcolor.c
2> progdlg.cpp
6> jdcoefct.c
6> jdatasrc.c
6> jdatadst.c
2> printwin.cpp
6> jdapistd.c
6> jdapimin.c
6> jctrans.c
6> jcsample.c
2> popupwin.cpp
6> jcprepct.c
2> pen.cpp
6> jcphuff.c
2> panel.cpp
6> jcparam.c
2> palette.cpp
6> jcomapi.c
2> ownerdrw.cpp
6> jcmaster.c
2> notebook.cpp
6> jcmarker.c
6> jcmainct.c
6> jcinit.c
2> nativewin.cpp
6> Generating Code...
2> nativdlg.cpp
2> mslu.cpp
6> Compiling...
2> Generating Code...
6> jchuff.c
6> jcdctmgr.c
6> jccolor.c
6> jccoefct.c
6> jcapistd.c
6> jcapimin.c
6> Generating Code...
2> Compiling...
2> msgdlg.cpp
6>C:\Program Files (x86)\MSBuild\Microsoft.Cpp\v4.0\Microsoft.CppBuild.targets(1151,5): warning MSB8012: TargetPath(C:\Users\RJ\project64\bin/Debug\wxjpeg.lib) does not match the Library's OutputFile property value (C:\Users\RJ\project64\bin\Debug\lib\wxjpegd.lib). This may cause your project to build incorrectly. To correct this, please make sure that $(OutDir), $(TargetName) and $(TargetExt) property values match the value specified in %(Lib.OutputFile).
6>C:\Program Files (x86)\MSBuild\Microsoft.Cpp\v4.0\Microsoft.CppBuild.targets(1153,5): warning MSB8012: TargetName(wxjpeg) does not match the Library's OutputFile property value (wxjpegd). This may cause your project to build incorrectly. To correct this, please make sure that $(OutDir), $(TargetName) and $(TargetExt) property values match the value specified in %(Lib.OutputFile).
2> minifram.cpp
6>Lib:
6> wx_wxjpeg.vcxproj -> C:\Users\RJ\project64\bin/Debug\wxjpeg.lib
6>FinalizeBuildStatus:
6> Deleting file "C:\Users\RJ\project64\build/Debug/wxjpeg\wxjpeg.unsuccessfulbuild".
6> Touching "C:\Users\RJ\project64\build/Debug/wxjpeg\wxjpeg.lastbuildstate".
6>
6>Build succeeded.
6>
6>Time Elapsed 00:00:12.16
2> metafile.cpp
2> menuitem.cpp
7>------ Build started: Project: wxzlib, Configuration: Debug Win32 ------
2> menu.cpp
7>Build started 1/19/2015 9:25:24 PM.
7>InitializeBuildStatus:
7> Creating "C:\Users\RJ\project64\build/Debug/wxzlib\wxzlib.unsuccessfulbuild" because "AlwaysCreate" was specified.
7>ClCompile:
7> zutil.c
7> uncompr.c
2> mdi.cpp
7> trees.c
7> inftrees.c
7> inflate.c
2> main.cpp
7> inffast.c
7> infback.c
2> listctrl.cpp
7> gzio.c
7> deflate.c
7> crc32.c
2> listbox.cpp
7> compress.c
7> adler32.c
7> Generating Code...
2> iniconf.cpp
2> imaglist.cpp
2> icon.cpp
7>C:\Program Files (x86)\MSBuild\Microsoft.Cpp\v4.0\Microsoft.CppBuild.targets(1151,5): warning MSB8012: TargetPath(C:\Users\RJ\project64\bin/Debug\wxzlib.lib) does not match the Library's OutputFile property value (C:\Users\RJ\project64\bin\Debug\lib\wxzlibd.lib). This may cause your project to build incorrectly. To correct this, please make sure that $(OutDir), $(TargetName) and $(TargetExt) property values match the value specified in %(Lib.OutputFile).
7>C:\Program Files (x86)\MSBuild\Microsoft.Cpp\v4.0\Microsoft.CppBuild.targets(1153,5): warning MSB8012: TargetName(wxzlib) does not match the Library's OutputFile property value (wxzlibd). This may cause your project to build incorrectly. To correct this, please make sure that $(OutDir), $(TargetName) and $(TargetExt) property values match the value specified in %(Lib.OutputFile).
2> helpwin.cpp
2> helpchm.cpp
7>Lib:
7> wx_wxzlib.vcxproj -> C:\Users\RJ\project64\bin/Debug\wxzlib.lib
7>FinalizeBuildStatus:
7> Deleting file "C:\Users\RJ\project64\build/Debug/wxzlib\wxzlib.unsuccessfulbuild".
7> Touching "C:\Users\RJ\project64\build/Debug/wxzlib\wxzlib.lastbuildstate".
7>
7>Build succeeded.
7>
7>Time Elapsed 00:00:02.76
2> headerctrl.cpp
8>------ Build started: Project: GlideHQ, Configuration: Debug Win32 ------
2> gdiobj.cpp
8>Build started 1/19/2015 9:25:27 PM.
2> gdiimage.cpp
8>InitializeBuildStatus:
8> Creating "C:\Users\RJ\project64\build/Debug/GlideHQ\GlideHQ.unsuccessfulbuild" because "AlwaysCreate" was specified.
8>ClCompile:
8> TxUtil.cpp
2> gauge.cpp
2> frame.cpp
2> fontutil.cpp
2> Generating Code...
8> TxTexCache.cpp
2> Compiling...
2> fontenum.cpp
2> fontdlg.cpp
2> font.cpp
2> fdrepdlg.cpp
2> evtloop.cpp
2> enhmeta.cpp
2> droptgt.cpp
8> TxReSample.cpp
8> TxQuantize.cpp
2> dropsrc.cpp
8>TxQuantize.cpp(1820): warning C4100: 'srcformat' : unreferenced formal parameter
8> TxImage.cpp
2> dragimag.cpp
8>TxImage.cpp(63): warning C4611: interaction between '_setjmp' and C++ object destruction is non-portable
2> display.cpp
2> dirdlg.cpp
2> dib.cpp
2> dialup.cpp
2> dialog.cpp
2> dcscreen.cpp
2> dcprint.cpp
2> dcmemory.cpp
2> dcclient.cpp
2> dc.cpp
2> data.cpp
2> Generating Code...
8>TxImage.cpp(247): warning C4100: 'palette' : unreferenced formal parameter
8> TxHiResCache.cpp
8> TxFilterExport.cpp
8> TxFilter.cpp
8> TxDbg.cpp
2> Compiling...
2> cursor.cpp
2> control.cpp
2> combobox.cpp
2> combo.cpp
8> TxCache.cpp
2> colour.cpp
2> colordlg.cpp
2> clipbrd.cpp
2> choice.cpp
2> checklst.cpp
8> TextureFilters_hq4x.cpp
2> checkbox.cpp
2> caret.cpp
2> button.cpp
8> TextureFilters_hq2x.cpp
2> brush.cpp
8>c:\users\rj\project64\source\glidehq\TextureFilters_hq2x.h(112): warning C4127: conditional expression is constant
8>c:\users\rj\project64\source\glidehq\TextureFilters_hq2x.h(124): warning C4127: conditional expression is constant
8>c:\users\rj\project64\source\glidehq\TextureFilters_hq2x.h(135): warning C4127: conditional expression is constant
8>c:\users\rj\project64\source\glidehq\TextureFilters_hq2x.h(148): warning C4127: conditional expression is constant
8>c:\users\rj\project64\source\glidehq\TextureFilters_hq2x.h(172): warning C4127: conditional expression is constant
8>c:\users\rj\project64\source\glidehq\TextureFilters_hq2x.h(183): warning C4127: conditional expression is constant
8>c:\users\rj\project64\source\glidehq\TextureFilters_hq2x.h(207): warning C4127: conditional expression is constant
8>c:\users\rj\project64\source\glidehq\TextureFilters_hq2x.h(218): warning C4127: conditional expression is constant
8>c:\users\rj\project64\source\glidehq\TextureFilters_hq2x.h(247): warning C4127: conditional expression is constant
8>c:\users\rj\project64\source\glidehq\TextureFilters_hq2x.h(252): warning C4127: conditional expression is constant
8>c:\users\rj\project64\source\glidehq\TextureFilters_hq2x.h(264): warning C4127: conditional expression is constant
8>c:\users\rj\project64\source\glidehq\TextureFilters_hq2x.h(290): warning C4127: conditional expression is constant
8>c:\users\rj\project64\source\glidehq\TextureFilters_hq2x.h(321): warning C4127: conditional expression is constant
8>c:\users\rj\project64\source\glidehq\TextureFilters_hq2x.h(334): warning C4127: conditional expression is constant
8>c:\users\rj\project64\source\glidehq\TextureFilters_hq2x.h(348): warning C4127: conditional expression is constant
2> bmpbuttn.cpp
8>c:\users\rj\project64\source\glidehq\TextureFilters_hq2x.h(360): warning C4127: conditional expression is constant
8>c:\users\rj\project64\source\glidehq\TextureFilters_hq2x.h(384): warning C4127: conditional expression is constant
8>c:\users\rj\project64\source\glidehq\TextureFilters_hq2x.h(389): warning C4127: conditional expression is constant
8>c:\users\rj\project64\source\glidehq\TextureFilters_hq2x.h(399): warning C4127: conditional expression is constant
8>c:\users\rj\project64\source\glidehq\TextureFilters_hq2x.h(404): warning C4127: conditional expression is constant
8>c:\users\rj\project64\source\glidehq\TextureFilters_hq2x.h(429): warning C4127: conditional expression is constant
8>c:\users\rj\project64\source\glidehq\TextureFilters_hq2x.h(439): warning C4127: conditional expression is constant
8>c:\users\rj\project64\source\glidehq\TextureFilters_hq2x.h(444): warning C4127: conditional expression is constant
8>c:\users\rj\project64\source\glidehq\TextureFilters_hq2x.h(487): warning C4127: conditional expression is constant
8>c:\users\rj\project64\source\glidehq\TextureFilters_hq2x.h(498): warning C4127: conditional expression is constant
8>c:\users\rj\project64\source\glidehq\TextureFilters_hq2x.h(512): warning C4127: conditional expression is constant
8>c:\users\rj\project64\source\glidehq\TextureFilters_hq2x.h(517): warning C4127: conditional expression is constant
8>c:\users\rj\project64\source\glidehq\TextureFilters_hq2x.h(527): warning C4127: conditional expression is constant
8>c:\users\rj\project64\source\glidehq\TextureFilters_hq2x.h(532): warning C4127: conditional expression is constant
8>c:\users\rj\project64\source\glidehq\TextureFilters_hq2x.h(542): warning C4127: conditional expression is constant
8>c:\users\rj\project64\source\glidehq\TextureFilters_hq2x.h(547): warning C4127: conditional expression is constant
8>c:\users\rj\project64\source\glidehq\TextureFilters_hq2x.h(559): warning C4127: conditional expression is constant
8>c:\users\rj\project64\source\glidehq\TextureFilters_hq2x.h(571): warning C4127: conditional expression is constant
8>c:\users\rj\project64\source\glidehq\TextureFilters_hq2x.h(576): warning C4127: conditional expression is constant
8>c:\users\rj\project64\source\glidehq\TextureFilters_hq2x.h(586): warning C4127: conditional expression is constant
8>c:\users\rj\project64\source\glidehq\TextureFilters_hq2x.h(591): warning C4127: conditional expression is constant
8>c:\users\rj\project64\source\glidehq\TextureFilters_hq2x.h(602): warning C4127: conditional expression is constant
8>c:\users\rj\project64\source\glidehq\TextureFilters_hq2x.h(614): warning C4127: conditional expression is constant
8>c:\users\rj\project64\source\glidehq\TextureFilters_hq2x.h(619): warning C4127: conditional expression is constant
8>c:\users\rj\project64\source\glidehq\TextureFilters_hq2x.h(631): warning C4127: conditional expression is constant
8>c:\users\rj\project64\source\glidehq\TextureFilters_hq2x.h(636): warning C4127: conditional expression is constant
8>c:\users\rj\project64\source\glidehq\TextureFilters_hq2x.h(646): warning C4127: conditional expression is constant
8>c:\users\rj\project64\source\glidehq\TextureFilters_hq2x.h(651): warning C4127: conditional expression is constant
8>c:\users\rj\project64\source\glidehq\TextureFilters_hq2x.h(659): warning C4127: conditional expression is constant
8>c:\users\rj\project64\source\glidehq\TextureFilters_hq2x.h(664): warning C4127: conditional expression is constant
8>c:\users\rj\project64\source\glidehq\TextureFilters_hq2x.h(669): warning C4127: conditional expression is constant
8>c:\users\rj\project64\source\glidehq\TextureFilters_hq2x.h(674): warning C4127: conditional expression is constant
8>c:\users\rj\project64\source\glidehq\TextureFilters_hq2x.h(682): warning C4127: conditional expression is constant
8>c:\users\rj\project64\source\glidehq\TextureFilters_hq2x.h(687): warning C4127: conditional expression is constant
8>c:\users\rj\project64\source\glidehq\TextureFilters_hq2x.h(692): warning C4127: conditional expression is constant
8>c:\users\rj\project64\source\glidehq\TextureFilters_hq2x.h(697): warning C4127: conditional expression is constant
8>c:\users\rj\project64\source\glidehq\TextureFilters_hq2x.h(707): warning C4127: conditional expression is constant
8>c:\users\rj\project64\source\glidehq\TextureFilters_hq2x.h(712): warning C4127: conditional expression is constant
8>c:\users\rj\project64\source\glidehq\TextureFilters_hq2x.h(722): warning C4127: conditional expression is constant
8>c:\users\rj\project64\source\glidehq\TextureFilters_hq2x.h(727): warning C4127: conditional expression is constant
8>c:\users\rj\project64\source\glidehq\TextureFilters_hq2x.h(735): warning C4127: conditional expression is constant
8>c:\users\rj\project64\source\glidehq\TextureFilters_hq2x.h(740): warning C4127: conditional expression is constant
8>c:\users\rj\project64\source\glidehq\TextureFilters_hq2x.h(745): warning C4127: conditional expression is constant
8>c:\users\rj\project64\source\glidehq\TextureFilters_hq2x.h(750): warning C4127: conditional expression is constant
8>c:\users\rj\project64\source\glidehq\TextureFilters_hq2x.h(800): warning C4127: conditional expression is constant
8>c:\users\rj\project64\source\glidehq\TextureFilters_hq2x.h(811): warning C4127: conditional expression is constant
8>c:\users\rj\project64\source\glidehq\TextureFilters_hq2x.h(825): warning C4127: conditional expression is constant
8>c:\users\rj\project64\source\glidehq\TextureFilters_hq2x.h(836): warning C4127: conditional expression is constant
8>c:\users\rj\project64\source\glidehq\TextureFilters_hq2x.h(846): warning C4127: conditional expression is constant
8>c:\users\rj\project64\source\glidehq\TextureFilters_hq2x.h(851): warning C4127: conditional expression is constant
8>c:\users\rj\project64\source\glidehq\TextureFilters_hq2x.h(862): warning C4127: conditional expression is constant
8>c:\users\rj\project64\source\glidehq\TextureFilters_hq2x.h(874): warning C4127: conditional expression is constant
8>c:\users\rj\project64\source\glidehq\TextureFilters_hq2x.h(879): warning C4127: conditional expression is constant
8>c:\users\rj\project64\source\glidehq\TextureFilters_hq2x.h(889): warning C4127: conditional expression is constant
8>c:\users\rj\project64\source\glidehq\TextureFilters_hq2x.h(894): warning C4127: conditional expression is constant
8>c:\users\rj\project64\source\glidehq\TextureFilters_hq2x.h(906): warning C4127: conditional expression is constant
8>c:\users\rj\project64\source\glidehq\TextureFilters_hq2x.h(917): warning C4127: conditional expression is constant
8>c:\users\rj\project64\source\glidehq\TextureFilters_hq2x.h(927): warning C4127: conditional expression is constant
8>c:\users\rj\project64\source\glidehq\TextureFilters_hq2x.h(939): warning C4127: conditional expression is constant
8>c:\users\rj\project64\source\glidehq\TextureFilters_hq2x.h(944): warning C4127: conditional expression is constant
8>c:\users\rj\project64\source\glidehq\TextureFilters_hq2x.h(952): warning C4127: conditional expression is constant
8>c:\users\rj\project64\source\glidehq\TextureFilters_hq2x.h(957): warning C4127: conditional expression is constant
8>c:\users\rj\project64\source\glidehq\TextureFilters_hq2x.h(962): warning C4127: conditional expression is constant
8>c:\users\rj\project64\source\glidehq\TextureFilters_hq2x.h(967): warning C4127: conditional expression is constant
8>c:\users\rj\project64\source\glidehq\TextureFilters_hq2x.h(978): warning C4127: conditional expression is constant
8>c:\users\rj\project64\source\glidehq\TextureFilters_hq2x.h(988): warning C4127: conditional expression is constant
8>c:\users\rj\project64\source\glidehq\TextureFilters_hq2x.h(1000): warning C4127: conditional expression is constant
8>c:\users\rj\project64\source\glidehq\TextureFilters_hq2x.h(1005): warning C4127: conditional expression is constant
8>c:\users\rj\project64\source\glidehq\TextureFilters_hq2x.h(1014): warning C4127: conditional expression is constant
8>c:\users\rj\project64\source\glidehq\TextureFilters_hq2x.h(1019): warning C4127: conditional expression is constant
8>c:\users\rj\project64\source\glidehq\TextureFilters_hq2x.h(1024): warning C4127: conditional expression is constant
8>c:\users\rj\project64\source\glidehq\TextureFilters_hq2x.h(1045): warning C4127: conditional expression is constant
8>c:\users\rj\project64\source\glidehq\TextureFilters_hq2x.h(1059): warning C4127: conditional expression is constant
8>c:\users\rj\project64\source\glidehq\TextureFilters_hq2x.h(1080): warning C4127: conditional expression is constant
8>c:\users\rj\project64\source\glidehq\TextureFilters_hq2x.h(1094): warning C4127: conditional expression is constant
8>c:\users\rj\project64\source\glidehq\TextureFilters_hq2x.h(1118): warning C4127: conditional expression is constant
8>c:\users\rj\project64\source\glidehq\TextureFilters_hq2x.h(1123): warning C4127: conditional expression is constant
8>c:\users\rj\project64\source\glidehq\TextureFilters_hq2x.h(1134): warning C4127: conditional expression is constant
8>c:\users\rj\project64\source\glidehq\TextureFilters_hq2x.h(1158): warning C4127: conditional expression is constant
8>c:\users\rj\project64\source\glidehq\TextureFilters_hq2x.h(1163): warning C4127: conditional expression is constant
8>c:\users\rj\project64\source\glidehq\TextureFilters_hq2x.h(1173): warning C4127: conditional expression is constant
8>c:\users\rj\project64\source\glidehq\TextureFilters_hq2x.h(1178): warning C4127: conditional expression is constant
2> bitmap.cpp
8>c:\users\rj\project64\source\glidehq\TextureFilters_hq2x.h(1202): warning C4127: conditional expression is constant
8>c:\users\rj\project64\source\glidehq\TextureFilters_hq2x.h(1207): warning C4127: conditional expression is constant
8>c:\users\rj\project64\source\glidehq\TextureFilters_hq2x.h(1217): warning C4127: conditional expression is constant
8>c:\users\rj\project64\source\glidehq\TextureFilters_hq2x.h(1243): warning C4127: conditional expression is constant
8>c:\users\rj\project64\source\glidehq\TextureFilters_hq2x.h(1255): warning C4127: conditional expression is constant
8>c:\users\rj\project64\source\glidehq\TextureFilters_hq2x.h(1260): warning C4127: conditional expression is constant
8>c:\users\rj\project64\source\glidehq\TextureFilters_hq2x.h(1309): warning C4127: conditional expression is constant
8>c:\users\rj\project64\source\glidehq\TextureFilters_hq2x.h(1323): warning C4127: conditional expression is constant
8>c:\users\rj\project64\source\glidehq\TextureFilters_hq2x.h(1333): warning C4127: conditional expression is constant
8>c:\users\rj\project64\source\glidehq\TextureFilters_hq2x.h(1338): warning C4127: conditional expression is constant
8>c:\users\rj\project64\source\glidehq\TextureFilters_hq2x.h(1349): warning C4127: conditional expression is constant
8>c:\users\rj\project64\source\glidehq\TextureFilters_hq2x.h(1359): warning C4127: conditional expression is constant
8>c:\users\rj\project64\source\glidehq\TextureFilters_hq2x.h(1364): warning C4127: conditional expression is constant
8>c:\users\rj\project64\source\glidehq\TextureFilters_hq2x.h(1374): warning C4127: conditional expression is constant
8>c:\users\rj\project64\source\glidehq\TextureFilters_hq2x.h(1388): warning C4127: conditional expression is constant
8>c:\users\rj\project64\source\glidehq\TextureFilters_hq2x.h(1400): warning C4127: conditional expression is constant
8>c:\users\rj\project64\source\glidehq\TextureFilters_hq2x.h(1411): warning C4127: conditional expression is constant
8>c:\users\rj\project64\source\glidehq\TextureFilters_hq2x.h(1422): warning C4127: conditional expression is constant
8>c:\users\rj\project64\source\glidehq\TextureFilters_hq2x.h(1434): warning C4127: conditional expression is constant
8>c:\users\rj\project64\source\glidehq\TextureFilters_hq2x.h(1439): warning C4127: conditional expression is constant
8>c:\users\rj\project64\source\glidehq\TextureFilters_hq2x.h(1450): warning C4127: conditional expression is constant
8>c:\users\rj\project64\source\glidehq\TextureFilters_hq2x.h(1458): warning C4127: conditional expression is constant
8>c:\users\rj\project64\source\glidehq\TextureFilters_hq2x.h(1463): warning C4127: conditional expression is constant
8>c:\users\rj\project64\source\glidehq\TextureFilters_hq2x.h(1468): warning C4127: conditional expression is constant
8>c:\users\rj\project64\source\glidehq\TextureFilters_hq2x.h(1473): warning C4127: conditional expression is constant
8>c:\users\rj\project64\source\glidehq\TextureFilters_hq2x.h(1483): warning C4127: conditional expression is constant
8>c:\users\rj\project64\source\glidehq\TextureFilters_hq2x.h(1488): warning C4127: conditional expression is constant
8>c:\users\rj\project64\source\glidehq\TextureFilters_hq2x.h(1498): warning C4127: conditional expression is constant
8>c:\users\rj\project64\source\glidehq\TextureFilters_hq2x.h(1503): warning C4127: conditional expression is constant
8>c:\users\rj\project64\source\glidehq\TextureFilters_hq2x.h(1513): warning C4127: conditional expression is constant
8>c:\users\rj\project64\source\glidehq\TextureFilters_hq2x.h(1524): warning C4127: conditional expression is constant
8>c:\users\rj\project64\source\glidehq\TextureFilters_hq2x.h(1529): warning C4127: conditional expression is constant
8>c:\users\rj\project64\source\glidehq\TextureFilters_hq2x.h(1534): warning C4127: conditional expression is constant
8>c:\users\rj\project64\source\glidehq\TextureFilters_hq2x.h(1583): warning C4127: conditional expression is constant
8>c:\users\rj\project64\source\glidehq\TextureFilters_hq2x.h(1597): warning C4127: conditional expression is constant
8>c:\users\rj\project64\source\glidehq\TextureFilters_hq2x.h(1607): warning C4127: conditional expression is constant
8>c:\users\rj\project64\source\glidehq\TextureFilters_hq2x.h(1612): warning C4127: conditional expression is constant
8>c:\users\rj\project64\source\glidehq\TextureFilters_hq2x.h(1622): warning C4127: conditional expression is constant
8>c:\users\rj\project64\source\glidehq\TextureFilters_hq2x.h(1627): warning C4127: conditional expression is constant
8>c:\users\rj\project64\source\glidehq\TextureFilters_hq2x.h(1637): warning C4127: conditional expression is constant
8>c:\users\rj\project64\source\glidehq\TextureFilters_hq2x.h(1649): warning C4127: conditional expression is constant
8>c:\users\rj\project64\source\glidehq\TextureFilters_hq2x.h(1654): warning C4127: conditional expression is constant
8>c:\users\rj\project64\source\glidehq\TextureFilters_hq2x.h(1665): warning C4127: conditional expression is constant
8>c:\users\rj\project64\source\glidehq\TextureFilters_hq2x.h(1677): warning C4127: conditional expression is constant
8>c:\users\rj\project64\source\glidehq\TextureFilters_hq2x.h(1682): warning C4127: conditional expression is constant
8>c:\users\rj\project64\source\glidehq\TextureFilters_hq2x.h(1692): warning C4127: conditional expression is constant
8>c:\users\rj\project64\source\glidehq\TextureFilters_hq2x.h(1706): warning C4127: conditional expression is constant
8>c:\users\rj\project64\source\glidehq\TextureFilters_hq2x.h(1716): warning C4127: conditional expression is constant
8>c:\users\rj\project64\source\glidehq\TextureFilters_hq2x.h(1721): warning C4127: conditional expression is constant
8>c:\users\rj\project64\source\glidehq\TextureFilters_hq2x.h(1731): warning C4127: conditional expression is constant
8>c:\users\rj\project64\source\glidehq\TextureFilters_hq2x.h(1736): warning C4127: conditional expression is constant
8>c:\users\rj\project64\source\glidehq\TextureFilters_hq2x.h(1746): warning C4127: conditional expression is constant
8>c:\users\rj\project64\source\glidehq\TextureFilters_hq2x.h(1751): warning C4127: conditional expression is constant
8>c:\users\rj\project64\source\glidehq\TextureFilters_hq2x.h(1760): warning C4127: conditional expression is constant
8>c:\users\rj\project64\source\glidehq\TextureFilters_hq2x.h(1765): warning C4127: conditional expression is constant
8>c:\users\rj\project64\source\glidehq\TextureFilters_hq2x.h(1770): warning C4127: conditional expression is constant
8>c:\users\rj\project64\source\glidehq\TextureFilters_hq2x.h(1780): warning C4127: conditional expression is constant
8>c:\users\rj\project64\source\glidehq\TextureFilters_hq2x.h(1785): warning C4127: conditional expression is constant
8>c:\users\rj\project64\source\glidehq\TextureFilters_hq2x.h(1795): warning C4127: conditional expression is constant
8>c:\users\rj\project64\source\glidehq\TextureFilters_hq2x.h(1800): warning C4127: conditional expression is constant
8>c:\users\rj\project64\source\glidehq\TextureFilters_hq2x.h(1809): warning C4127: conditional expression is constant
8>c:\users\rj\project64\source\glidehq\TextureFilters_hq2x.h(1814): warning C4127: conditional expression is constant
8>c:\users\rj\project64\source\glidehq\TextureFilters_hq2x.h(1819): warning C4127: conditional expression is constant
8>c:\users\rj\project64\source\glidehq\TextureFilters_hq2x.h(1827): warning C4127: conditional expression is constant
8>c:\users\rj\project64\source\glidehq\TextureFilters_hq2x.h(1832): warning C4127: conditional expression is constant
8>c:\users\rj\project64\source\glidehq\TextureFilters_hq2x.h(1837): warning C4127: conditional expression is constant
8>c:\users\rj\project64\source\glidehq\TextureFilters_hq2x.h(1842): warning C4127: conditional expression is constant
8>c:\users\rj\project64\source\glidehq\TextureFilters_lq2x.h(166): warning C4127: conditional expression is constant
8>c:\users\rj\project64\source\glidehq\TextureFilters_lq2x.h(182): warning C4127: conditional expression is constant
8>c:\users\rj\project64\source\glidehq\TextureFilters_lq2x.h(193): warning C4127: conditional expression is constant
8>c:\users\rj\project64\source\glidehq\TextureFilters_lq2x.h(207): warning C4127: conditional expression is constant
8>c:\users\rj\project64\source\glidehq\TextureFilters_lq2x.h(227): warning C4127: conditional expression is constant
8>c:\users\rj\project64\source\glidehq\TextureFilters_lq2x.h(238): warning C4127: conditional expression is constant
8>c:\users\rj\project64\source\glidehq\TextureFilters_lq2x.h(252): warning C4127: conditional expression is constant
8>c:\users\rj\project64\source\glidehq\TextureFilters_lq2x.h(264): warning C4127: conditional expression is constant
8>c:\users\rj\project64\source\glidehq\TextureFilters_lq2x.h(269): warning C4127: conditional expression is constant
8>c:\users\rj\project64\source\glidehq\TextureFilters_lq2x.h(280): warning C4127: conditional expression is constant
8>c:\users\rj\project64\source\glidehq\TextureFilters_lq2x.h(285): warning C4127: conditional expression is constant
8>c:\users\rj\project64\source\glidehq\TextureFilters_lq2x.h(296): warning C4127: conditional expression is constant
8>c:\users\rj\project64\source\glidehq\TextureFilters_lq2x.h(310): warning C4127: conditional expression is constant
8>c:\users\rj\project64\source\glidehq\TextureFilters_lq2x.h(324): warning C4127: conditional expression is constant
8>c:\users\rj\project64\source\glidehq\TextureFilters_lq2x.h(336): warning C4127: conditional expression is constant
8>c:\users\rj\project64\source\glidehq\TextureFilters_lq2x.h(348): warning C4127: conditional expression is constant
8>c:\users\rj\project64\source\glidehq\TextureFilters_lq2x.h(353): warning C4127: conditional expression is constant
8>c:\users\rj\project64\source\glidehq\TextureFilters_lq2x.h(363): warning C4127: conditional expression is constant
8>c:\users\rj\project64\source\glidehq\TextureFilters_lq2x.h(368): warning C4127: conditional expression is constant
8>c:\users\rj\project64\source\glidehq\TextureFilters_lq2x.h(378): warning C4127: conditional expression is constant
8>c:\users\rj\project64\source\glidehq\TextureFilters_lq2x.h(383): warning C4127: conditional expression is constant
8>c:\users\rj\project64\source\glidehq\TextureFilters_lq2x.h(401): warning C4127: conditional expression is constant
2> automtn.cpp
8>c:\users\rj\project64\source\glidehq\TextureFilters_lq2x.h(415): warning C4127: conditional expression is constant
8>c:\users\rj\project64\source\glidehq\TextureFilters_lq2x.h(427): warning C4127: conditional expression is constant
8>c:\users\rj\project64\source\glidehq\TextureFilters_lq2x.h(432): warning C4127: conditional expression is constant
8>c:\users\rj\project64\source\glidehq\TextureFilters_lq2x.h(444): warning C4127: conditional expression is constant
8>c:\users\rj\project64\source\glidehq\TextureFilters_lq2x.h(449): warning C4127: conditional expression is constant
8>c:\users\rj\project64\source\glidehq\TextureFilters_lq2x.h(459): warning C4127: conditional expression is constant
8>c:\users\rj\project64\source\glidehq\TextureFilters_lq2x.h(464): warning C4127: conditional expression is constant
8>c:\users\rj\project64\source\glidehq\TextureFilters_lq2x.h(478): warning C4127: conditional expression is constant
8>c:\users\rj\project64\source\glidehq\TextureFilters_lq2x.h(491): warning C4127: conditional expression is constant
8>c:\users\rj\project64\source\glidehq\TextureFilters_lq2x.h(503): warning C4127: conditional expression is constant
8>c:\users\rj\project64\source\glidehq\TextureFilters_lq2x.h(508): warning C4127: conditional expression is constant
8>c:\users\rj\project64\source\glidehq\TextureFilters_lq2x.h(519): warning C4127: conditional expression is constant
8>c:\users\rj\project64\source\glidehq\TextureFilters_lq2x.h(524): warning C4127: conditional expression is constant
8>c:\users\rj\project64\source\glidehq\TextureFilters_lq2x.h(535): warning C4127: conditional expression is constant
8>c:\users\rj\project64\source\glidehq\TextureFilters_lq2x.h(549): warning C4127: conditional expression is constant
8>c:\users\rj\project64\source\glidehq\TextureFilters_lq2x.h(561): warning C4127: conditional expression is constant
8>c:\users\rj\project64\source\glidehq\TextureFilters_lq2x.h(566): warning C4127: conditional expression is constant
8>c:\users\rj\project64\source\glidehq\TextureFilters_lq2x.h(578): warning C4127: conditional expression is constant
8>c:\users\rj\project64\source\glidehq\TextureFilters_lq2x.h(583): warning C4127: conditional expression is constant
8>c:\users\rj\project64\source\glidehq\TextureFilters_lq2x.h(594): warning C4127: conditional expression is constant
8>c:\users\rj\project64\source\glidehq\TextureFilters_lq2x.h(599): warning C4127: conditional expression is constant
8>c:\users\rj\project64\source\glidehq\TextureFilters_lq2x.h(607): warning C4127: conditional expression is constant
8>c:\users\rj\project64\source\glidehq\TextureFilters_lq2x.h(612): warning C4127: conditional expression is constant
8>c:\users\rj\project64\source\glidehq\TextureFilters_lq2x.h(617): warning C4127: conditional expression is constant
8>c:\users\rj\project64\source\glidehq\TextureFilters_lq2x.h(622): warning C4127: conditional expression is constant
8>c:\users\rj\project64\source\glidehq\TextureFilters_lq2x.h(630): warning C4127: conditional expression is constant
8>c:\users\rj\project64\source\glidehq\TextureFilters_lq2x.h(635): warning C4127: conditional expression is constant
8>c:\users\rj\project64\source\glidehq\TextureFilters_lq2x.h(640): warning C4127: conditional expression is constant
8>c:\users\rj\project64\source\glidehq\TextureFilters_lq2x.h(645): warning C4127: conditional expression is constant
8>c:\users\rj\project64\source\glidehq\TextureFilters_lq2x.h(655): warning C4127: conditional expression is constant
8>c:\users\rj\project64\source\glidehq\TextureFilters_lq2x.h(660): warning C4127: conditional expression is constant
8>c:\users\rj\project64\source\glidehq\TextureFilters_lq2x.h(668): warning C4127: conditional expression is constant
8>c:\users\rj\project64\source\glidehq\TextureFilters_lq2x.h(673): warning C4127: conditional expression is constant
8>c:\users\rj\project64\source\glidehq\TextureFilters_lq2x.h(678): warning C4127: conditional expression is constant
8>c:\users\rj\project64\source\glidehq\TextureFilters_lq2x.h(683): warning C4127: conditional expression is constant
8>c:\users\rj\project64\source\glidehq\TextureFilters_lq2x.h(694): warning C4127: conditional expression is constant
8>c:\users\rj\project64\source\glidehq\TextureFilters_lq2x.h(699): warning C4127: conditional expression is constant
8>c:\users\rj\project64\source\glidehq\TextureFilters_lq2x.h(709): warning C4127: conditional expression is constant
8>c:\users\rj\project64\source\glidehq\TextureFilters_lq2x.h(714): warning C4127: conditional expression is constant
8>c:\users\rj\project64\source\glidehq\TextureFilters_lq2x.h(725): warning C4127: conditional expression is constant
8>c:\users\rj\project64\source\glidehq\TextureFilters_lq2x.h(738): warning C4127: conditional expression is constant
8>c:\users\rj\project64\source\glidehq\TextureFilters_lq2x.h(750): warning C4127: conditional expression is constant
8>c:\users\rj\project64\source\glidehq\TextureFilters_lq2x.h(755): warning C4127: conditional expression is constant
8>c:\users\rj\project64\source\glidehq\TextureFilters_lq2x.h(766): warning C4127: conditional expression is constant
8>c:\users\rj\project64\source\glidehq\TextureFilters_lq2x.h(777): warning C4127: conditional expression is constant
8>c:\users\rj\project64\source\glidehq\TextureFilters_lq2x.h(787): warning C4127: conditional expression is constant
8>c:\users\rj\project64\source\glidehq\TextureFilters_lq2x.h(792): warning C4127: conditional expression is constant
8>c:\users\rj\project64\source\glidehq\TextureFilters_lq2x.h(800): warning C4127: conditional expression is constant
8>c:\users\rj\project64\source\glidehq\TextureFilters_lq2x.h(805): warning C4127: conditional expression is constant
8>c:\users\rj\project64\source\glidehq\TextureFilters_lq2x.h(810): warning C4127: conditional expression is constant
8>c:\users\rj\project64\source\glidehq\TextureFilters_lq2x.h(815): warning C4127: conditional expression is constant
8>c:\users\rj\project64\source\glidehq\TextureFilters_lq2x.h(825): warning C4127: conditional expression is constant
8>c:\users\rj\project64\source\glidehq\TextureFilters_lq2x.h(830): warning C4127: conditional expression is constant
8>c:\users\rj\project64\source\glidehq\TextureFilters_lq2x.h(839): warning C4127: conditional expression is constant
8>c:\users\rj\project64\source\glidehq\TextureFilters_lq2x.h(844): warning C4127: conditional expression is constant
8>c:\users\rj\project64\source\glidehq\TextureFilters_lq2x.h(849): warning C4127: conditional expression is constant
8>c:\users\rj\project64\source\glidehq\TextureFilters_lq2x.h(863): warning C4127: conditional expression is constant
8>c:\users\rj\project64\source\glidehq\TextureFilters_lq2x.h(877): warning C4127: conditional expression is constant
8>c:\users\rj\project64\source\glidehq\TextureFilters_lq2x.h(889): warning C4127: conditional expression is constant
8>c:\users\rj\project64\source\glidehq\TextureFilters_lq2x.h(899): warning C4127: conditional expression is constant
8>c:\users\rj\project64\source\glidehq\TextureFilters_lq2x.h(904): warning C4127: conditional expression is constant
8>c:\users\rj\project64\source\glidehq\TextureFilters_lq2x.h(914): warning C4127: conditional expression is constant
8>c:\users\rj\project64\source\glidehq\TextureFilters_lq2x.h(919): warning C4127: conditional expression is constant
8>c:\users\rj\project64\source\glidehq\TextureFilters_lq2x.h(929): warning C4127: conditional expression is constant
8>c:\users\rj\project64\source\glidehq\TextureFilters_lq2x.h(934): warning C4127: conditional expression is constant
8>c:\users\rj\project64\source\glidehq\TextureFilters_lq2x.h(948): warning C4127: conditional expression is constant
8>c:\users\rj\project64\source\glidehq\TextureFilters_lq2x.h(962): warning C4127: conditional expression is constant
8>c:\users\rj\project64\source\glidehq\TextureFilters_lq2x.h(973): warning C4127: conditional expression is constant
8>c:\users\rj\project64\source\glidehq\TextureFilters_lq2x.h(983): warning C4127: conditional expression is constant
8>c:\users\rj\project64\source\glidehq\TextureFilters_lq2x.h(988): warning C4127: conditional expression is constant
8>c:\users\rj\project64\source\glidehq\TextureFilters_lq2x.h(996): warning C4127: conditional expression is constant
8>c:\users\rj\project64\source\glidehq\TextureFilters_lq2x.h(1001): warning C4127: conditional expression is constant
8>c:\users\rj\project64\source\glidehq\TextureFilters_lq2x.h(1006): warning C4127: conditional expression is constant
8>c:\users\rj\project64\source\glidehq\TextureFilters_lq2x.h(1011): warning C4127: conditional expression is constant
8>c:\users\rj\project64\source\glidehq\TextureFilters_lq2x.h(1021): warning C4127: conditional expression is constant
8>c:\users\rj\project64\source\glidehq\TextureFilters_lq2x.h(1026): warning C4127: conditional expression is constant
8>c:\users\rj\project64\source\glidehq\TextureFilters_lq2x.h(1036): warning C4127: conditional expression is constant
8>c:\users\rj\project64\source\glidehq\TextureFilters_lq2x.h(1041): warning C4127: conditional expression is constant
8>c:\users\rj\project64\source\glidehq\TextureFilters_lq2x.h(1050): warning C4127: conditional expression is constant
8>c:\users\rj\project64\source\glidehq\TextureFilters_lq2x.h(1055): warning C4127: conditional expression is constant
8>c:\users\rj\project64\source\glidehq\TextureFilters_lq2x.h(1060): warning C4127: conditional expression is constant
8>c:\users\rj\project64\source\glidehq\TextureFilters_lq2x.h(1072): warning C4127: conditional expression is constant
8>c:\users\rj\project64\source\glidehq\TextureFilters_lq2x.h(1082): warning C4127: conditional expression is constant
8>c:\users\rj\project64\source\glidehq\TextureFilters_lq2x.h(1087): warning C4127: conditional expression is constant
8>c:\users\rj\project64\source\glidehq\TextureFilters_lq2x.h(1097): warning C4127: conditional expression is constant
8>c:\users\rj\project64\source\glidehq\TextureFilters_lq2x.h(1102): warning C4127: conditional expression is constant
8>c:\users\rj\project64\source\glidehq\TextureFilters_lq2x.h(1112): warning C4127: conditional expression is constant
8>c:\users\rj\project64\source\glidehq\TextureFilters_lq2x.h(1117): warning C4127: conditional expression is constant
8>c:\users\rj\project64\source\glidehq\TextureFilters_lq2x.h(1127): warning C4127: conditional expression is constant
8>c:\users\rj\project64\source\glidehq\TextureFilters_lq2x.h(1132): warning C4127: conditional expression is constant
8>c:\users\rj\project64\source\glidehq\TextureFilters_lq2x.h(1142): warning C4127: conditional expression is constant
8>c:\users\rj\project64\source\glidehq\TextureFilters_lq2x.h(1155): warning C4127: conditional expression is constant
8>c:\users\rj\project64\source\glidehq\TextureFilters_lq2x.h(1166): warning C4127: conditional expression is constant
8>c:\users\rj\project64\source\glidehq\TextureFilters_lq2x.h(1176): warning C4127: conditional expression is constant
8>c:\users\rj\project64\source\glidehq\TextureFilters_lq2x.h(1181): warning C4127: conditional expression is constant
8>c:\users\rj\project64\source\glidehq\TextureFilters_lq2x.h(1191): warning C4127: conditional expression is constant
8>c:\users\rj\project64\source\glidehq\TextureFilters_lq2x.h(1196): warning C4127: conditional expression is constant
8>c:\users\rj\project64\source\glidehq\TextureFilters_lq2x.h(1206): warning C4127: conditional expression is constant
8>c:\users\rj\project64\source\glidehq\TextureFilters_lq2x.h(1211): warning C4127: conditional expression is constant
8>c:\users\rj\project64\source\glidehq\TextureFilters_lq2x.h(1220): warning C4127: conditional expression is constant
8>c:\users\rj\project64\source\glidehq\TextureFilters_lq2x.h(1225): warning C4127: conditional expression is constant
8>c:\users\rj\project64\source\glidehq\TextureFilters_lq2x.h(1230): warning C4127: conditional expression is constant
8>c:\users\rj\project64\source\glidehq\TextureFilters_lq2x.h(1240): warning C4127: conditional expression is constant
8>c:\users\rj\project64\source\glidehq\TextureFilters_lq2x.h(1245): warning C4127: conditional expression is constant
8>c:\users\rj\project64\source\glidehq\TextureFilters_lq2x.h(1255): warning C4127: conditional expression is constant
8>c:\users\rj\project64\source\glidehq\TextureFilters_lq2x.h(1260): warning C4127: conditional expression is constant
8>c:\users\rj\project64\source\glidehq\TextureFilters_lq2x.h(1269): warning C4127: conditional expression is constant
8>c:\users\rj\project64\source\glidehq\TextureFilters_lq2x.h(1274): warning C4127: conditional expression is constant
8>c:\users\rj\project64\source\glidehq\TextureFilters_lq2x.h(1279): warning C4127: conditional expression is constant
8>c:\users\rj\project64\source\glidehq\TextureFilters_lq2x.h(1287): warning C4127: conditional expression is constant
8>c:\users\rj\project64\source\glidehq\TextureFilters_lq2x.h(1292): warning C4127: conditional expression is constant
8>c:\users\rj\project64\source\glidehq\TextureFilters_lq2x.h(1297): warning C4127: conditional expression is constant
8>c:\users\rj\project64\source\glidehq\TextureFilters_lq2x.h(1302): warning C4127: conditional expression is constant
8>TextureFilters_hq2x.cpp(152): warning C4505: 'hq2x_interp_32_71' : unreferenced local function has been removed
8>TextureFilters_hq2x.cpp(158): warning C4505: 'hq2x_interp_32_772' : unreferenced local function has been removed
8>TextureFilters_hq2x.cpp(164): warning C4505: 'hq2x_interp_32_11' : unreferenced local function has been removed
8>TextureFilters_hq2x.cpp(182): warning C4505: 'hq2x_interp_32_431' : unreferenced local function has been removed
8>TextureFilters_hq2x.cpp(188): warning C4505: 'hq2x_interp_32_53' : unreferenced local function has been removed
8>TextureFilters_hq2x.cpp(194): warning C4505: 'hq2x_interp_32_151' : unreferenced local function has been removed
8>TextureFilters_hq2x.cpp(200): warning C4505: 'hq2x_interp_32_97' : unreferenced local function has been removed
8> TextureFilters_2xsai.cpp
8>TextureFilters_2xsai.cpp(40): warning C4189: 'destHeight' : local variable is initialized but not referenced
8> TextureFilters.cpp
2> artmsw.cpp
8> Generating Code...
8>c:\users\rj\project64\source\glidehq\texturefilters.cpp(107): warning C4701: potentially uninitialized local variable 'b2' used
8>c:\users\rj\project64\source\glidehq\texturefilters.cpp(107): warning C4701: potentially uninitialized local variable 'g2' used
8>c:\users\rj\project64\source\glidehq\texturefilters.cpp(107): warning C4701: potentially uninitialized local variable 'r2' used
8>c:\users\rj\project64\source\glidehq\texturefilters.cpp(107): warning C4701: potentially uninitialized local variable 'a2' used
8>c:\users\rj\project64\source\glidehq\texturefilters.cpp(116): warning C4701: potentially uninitialized local variable 'b3' used
8>c:\users\rj\project64\source\glidehq\texturefilters.cpp(116): warning C4701: potentially uninitialized local variable 'g3' used
8>c:\users\rj\project64\source\glidehq\texturefilters.cpp(116): warning C4701: potentially uninitialized local variable 'r3' used
8>c:\users\rj\project64\source\glidehq\texturefilters.cpp(116): warning C4701: potentially uninitialized local variable 'a3' used
8>c:\users\rj\project64\source\glidehq\texturefilters.cpp(126): warning C4701: potentially uninitialized local variable 'b4' used
8>c:\users\rj\project64\source\glidehq\texturefilters.cpp(126): warning C4701: potentially uninitialized local variable 'g4' used
8>c:\users\rj\project64\source\glidehq\texturefilters.cpp(126): warning C4701: potentially uninitialized local variable 'r4' used
8>c:\users\rj\project64\source\glidehq\texturefilters.cpp(126): warning C4701: potentially uninitialized local variable 'a4' used
2> app.cpp
8>c:\users\rj\project64\source\glidehq\tximage.cpp(366): warning C4700: uninitialized local variable 'palette_ptr' used
8>c:\users\rj\project64\source\glidehq\tximage.cpp(367): warning C4700: uninitialized local variable 'trans_ptr' used
8>c:\users\rj\project64\source\glidehq\tximage.cpp(366): warning C4701: potentially uninitialized local variable 'num_palette' used
8>c:\users\rj\project64\source\glidehq\tximage.cpp(387): warning C4701: potentially uninitialized local variable 'row_bytes' used
2> anybutton.cpp
8>c:\users\rj\project64\source\glidehq\txquantize.cpp(1225): warning C4701: potentially uninitialized local variable 'qr' used
8>c:\users\rj\project64\source\glidehq\txquantize.cpp(1226): warning C4701: potentially uninitialized local variable 'qg' used
8>c:\users\rj\project64\source\glidehq\txquantize.cpp(1227): warning C4701: potentially uninitialized local variable 'qb' used
8>c:\users\rj\project64\source\glidehq\txquantize.cpp(1327): warning C4701: potentially uninitialized local variable 'qr' used
8>c:\users\rj\project64\source\glidehq\txquantize.cpp(1328): warning C4701: potentially uninitialized local variable 'qg' used
8>c:\users\rj\project64\source\glidehq\txquantize.cpp(1329): warning C4701: potentially uninitialized local variable 'qb' used
8>c:\users\rj\project64\source\glidehq\txquantize.cpp(1437): warning C4701: potentially uninitialized local variable 'qr' used
8>c:\users\rj\project64\source\glidehq\txquantize.cpp(1438): warning C4701: potentially uninitialized local variable 'qg' used
8>c:\users\rj\project64\source\glidehq\txquantize.cpp(1439): warning C4701: potentially uninitialized local variable 'qb' used
8>c:\users\rj\project64\source\glidehq\txquantize.cpp(1440): warning C4701: potentially uninitialized local variable 'qa' used
8>c:\users\rj\project64\source\glidehq\txquantize.cpp(1559): warning C4701: potentially uninitialized local variable 'qi' used
8>c:\users\rj\project64\source\glidehq\txquantize.cpp(1560): warning C4701: potentially uninitialized local variable 'qa' used
2> access.cpp
2> Generating Code...
8> wrapper.c
8> texstore.c
8> fxt1.c
8>tc-1.1+\fxt1.c(544): warning C4127: conditional expression is constant
8>tc-1.1+\fxt1.c(551): warning C4127: conditional expression is constant
8>tc-1.1+\fxt1.c(551): warning C4127: conditional expression is constant
8>tc-1.1+\fxt1.c(564): warning C4127: conditional expression is constant
8>tc-1.1+\fxt1.c(571): warning C4127: conditional expression is constant
8>tc-1.1+\fxt1.c(571): warning C4127: conditional expression is constant
8>tc-1.1+\fxt1.c(657): warning C4127: conditional expression is constant
8>tc-1.1+\fxt1.c(669): warning C4127: conditional expression is constant
8>tc-1.1+\fxt1.c(669): warning C4127: conditional expression is constant
8>tc-1.1+\fxt1.c(771): warning C4127: conditional expression is constant
8>tc-1.1+\fxt1.c(779): warning C4127: conditional expression is constant
8>tc-1.1+\fxt1.c(779): warning C4127: conditional expression is constant
8>tc-1.1+\fxt1.c(805): warning C4127: conditional expression is constant
8>tc-1.1+\fxt1.c(813): warning C4127: conditional expression is constant
8>tc-1.1+\fxt1.c(813): warning C4127: conditional expression is constant
8>tc-1.1+\fxt1.c(946): warning C4127: conditional expression is constant
8>tc-1.1+\fxt1.c(953): warning C4127: conditional expression is constant
8>tc-1.1+\fxt1.c(953): warning C4127: conditional expression is constant
8>tc-1.1+\fxt1.c(979): warning C4127: conditional expression is constant
8>tc-1.1+\fxt1.c(986): warning C4127: conditional expression is constant
8>tc-1.1+\fxt1.c(986): warning C4127: conditional expression is constant
8>tc-1.1+\fxt1.c(1234): warning C4244: '=' : conversion from 'int' to 'byte', possible loss of data
8>tc-1.1+\fxt1.c(1235): warning C4244: '=' : conversion from 'int' to 'byte', possible loss of data
8>tc-1.1+\fxt1.c(1236): warning C4244: '=' : conversion from 'int' to 'byte', possible loss of data
8>tc-1.1+\fxt1.c(1334): warning C4244: '=' : conversion from 'int' to 'byte', possible loss of data
8>tc-1.1+\fxt1.c(1336): warning C4244: '=' : conversion from 'int' to 'byte', possible loss of data
8>tc-1.1+\fxt1.c(1337): warning C4244: '=' : conversion from 'int' to 'byte', possible loss of data
8>tc-1.1+\fxt1.c(1382): warning C4244: '=' : conversion from 'int' to 'byte', possible loss of data
8>tc-1.1+\fxt1.c(1383): warning C4244: '=' : conversion from 'int' to 'byte', possible loss of data
8>tc-1.1+\fxt1.c(1384): warning C4244: '=' : conversion from 'int' to 'byte', possible loss of data
8>tc-1.1+\fxt1.c(1385): warning C4244: '=' : conversion from 'int' to 'byte', possible loss of data
8> dxtn.c
8>tc-1.1+\dxtn.c(167): warning C4127: conditional expression is constant
8>tc-1.1+\dxtn.c(182): warning C4127: conditional expression is constant
8>tc-1.1+\dxtn.c(182): warning C4127: conditional expression is constant
8>tc-1.1+\dxtn.c(288): warning C4127: conditional expression is constant
8>tc-1.1+\dxtn.c(297): warning C4127: conditional expression is constant
8>tc-1.1+\dxtn.c(297): warning C4127: conditional expression is constant
8>tc-1.1+\dxtn.c(423): warning C4127: conditional expression is constant
8>tc-1.1+\dxtn.c(429): warning C4127: conditional expression is constant
8>tc-1.1+\dxtn.c(429): warning C4127: conditional expression is constant
8>tc-1.1+\dxtn.c(606): warning C4127: conditional expression is constant
8>tc-1.1+\dxtn.c(612): warning C4127: conditional expression is constant
8>tc-1.1+\dxtn.c(612): warning C4127: conditional expression is constant
8>tc-1.1+\dxtn.c(876): warning C4244: '=' : conversion from 'int' to 'byte', possible loss of data
8>tc-1.1+\dxtn.c(882): warning C4244: '=' : conversion from 'int' to 'byte', possible loss of data
8> Generating Code...
8>C:\Program Files (x86)\MSBuild\Microsoft.Cpp\v4.0\Microsoft.CppBuild.targets(1151,5): warning MSB8012: TargetPath(C:\Users\RJ\project64\bin/Debug\GlideHQ.lib) does not match the Library's OutputFile property value (C:\Users\RJ\project64\bin\Debug\lib\GlideHQ.lib). This may cause your project to build incorrectly. To correct this, please make sure that $(OutDir), $(TargetName) and $(TargetExt) property values match the value specified in %(Lib.OutputFile).
8>Lib:
8> GlideHQ.vcxproj -> C:\Users\RJ\project64\bin/Debug\GlideHQ.lib
8>FinalizeBuildStatus:
8> Deleting file "C:\Users\RJ\project64\build/Debug/GlideHQ\GlideHQ.unsuccessfulbuild".
8> Touching "C:\Users\RJ\project64\build/Debug/GlideHQ\GlideHQ.lastbuildstate".
8>
8>Build succeeded.
8>
8>Time Elapsed 00:00:19.56
2> Compiling...
2> accel.cpp
2> xpmdecod.cpp
2> wrapsizer.cpp
2> windowid.cpp
9>------ Build started: Project: 7zip, Configuration: Debug Win32 ------
9>Build started 1/19/2015 9:25:48 PM.
9>InitializeBuildStatus:
9> Creating "C:\Users\RJ\project64\build/Debug/7zip\7zip.unsuccessfulbuild" because "AlwaysCreate" was specified.
2> wincmn.cpp
9>ClCompile:
9> LzmaDecode.c
9> 7zMethodID.c
9> 7zItem.c
9> 7zIn.c
9> 7zHeader.c
9> 7zExtract.c
9> 7zDecode.c
2> valtext.cpp
9> 7zCrc.c
9> 7zBuffer.c
9> 7zAlloc.c
9> Generating Code...
2> valnum.cpp
2> validate.cpp
2> valgen.cpp
9>C:\Program Files (x86)\MSBuild\Microsoft.Cpp\v4.0\Microsoft.CppBuild.targets(1151,5): warning MSB8012: TargetPath(C:\Users\RJ\project64\bin/Debug\7zip.lib) does not match the Library's OutputFile property value (C:\Users\RJ\project64\bin\Debug\lib\7zip.lib). This may cause your project to build incorrectly. To correct this, please make sure that $(OutDir), $(TargetName) and $(TargetExt) property values match the value specified in %(Lib.OutputFile).
9>Lib:
9> 7zip.vcxproj -> C:\Users\RJ\project64\bin/Debug\7zip.lib
9>FinalizeBuildStatus:
9> Deleting file "C:\Users\RJ\project64\build/Debug/7zip\7zip.unsuccessfulbuild".
9> Touching "C:\Users\RJ\project64\build/Debug/7zip\7zip.lastbuildstate".
9>
9>Build succeeded.
9>
9>Time Elapsed 00:00:01.55
2> utilscmn.cpp
10>------ Build started: Project: zlib, Configuration: Debug Win32 ------
10>Build started 1/19/2015 9:25:50 PM.
10>InitializeBuildStatus:
10> Creating "C:\Users\RJ\project64\build/Debug/zlib\zlib.unsuccessfulbuild" because "AlwaysCreate" was specified.
2> uiactioncmn.cpp
2> treebase.cpp
10>ClCompile:
10> zip.c
10> unzip.c
2> toplvcmn.cpp
10> mztools.c
10> minizip.c
2> textentrycmn.cpp
2> textcmn.cpp
10> iowin32.c
2> tbarbase.cpp
2> stockitem.cpp
2> stattextcmn.cpp
10> ioapi.c
10> zutil.c
2> statlinecmn.cpp
10> uncompr.c
2> statboxcmn.cpp
10> trees.c
2> Generating Code...
10> inftrees.c
10> inflate.c
10> inffast.c
10> infback.c
10> gzwrite.c
10> gzread.c
10> gzlib.c
10> gzclose.c
10> deflate.c
10> crc32.c
10> compress.c
10> Generating Code...
2> Compiling...
2> statbmpcmn.cpp
2> statbar.cpp
2> srchcmn.cpp
10> Compiling...
10> adler32.c
10> Generating Code...
2> spinctrlcmn.cpp
10>C:\Program Files (x86)\MSBuild\Microsoft.Cpp\v4.0\Microsoft.CppBuild.targets(1151,5): warning MSB8012: TargetPath(C:\Users\RJ\project64\bin/Debug\zlib.lib) does not match the Library's OutputFile property value (C:\Users\RJ\project64\bin\Debug\lib\zlib.lib). This may cause your project to build incorrectly. To correct this, please make sure that $(OutDir), $(TargetName) and $(TargetExt) property values match the value specified in %(Lib.OutputFile).
2> spinbtncmn.cpp
2> slidercmn.cpp
10>Lib:
10> zlib.vcxproj -> C:\Users\RJ\project64\bin/Debug\zlib.lib
2> sizer.cpp
10>FinalizeBuildStatus:
10> Deleting file "C:\Users\RJ\project64\build/Debug/zlib\zlib.unsuccessfulbuild".
10> Touching "C:\Users\RJ\project64\build/Debug/zlib\zlib.lastbuildstate".
10>
10>Build succeeded.
10>
10>Time Elapsed 00:00:04.32
2> settcmn.cpp
2> scrolbarcmn.cpp
2> rgncmn.cpp
11>------ Build started: Project: SortRdb, Configuration: Debug Win32 ------
11>Build started 1/19/2015 9:25:55 PM.
11>InitializeBuildStatus:
11> Creating "C:\Users\RJ\project64\build/Debug/SortRdb\SortRdb.unsuccessfulbuild" because "AlwaysCreate" was specified.
2> rendcmn.cpp
11>ClCompile:
11> main.cpp
2> rearrangectrl.cpp
2> radiocmn.cpp
2> radiobtncmn.cpp
2> quantize.cpp
2> prntbase.cpp
2> popupcmn.cpp
2> pickerbase.cpp
2> persist.cpp
2> paper.cpp
2> Generating Code...
2> Compiling...
2> panelcmn.cpp
2> ownerdrwcmn.cpp
2> overlaycmn.cpp
2> nbkbase.cpp
2> msgout.cpp
2> mousemanager.cpp
11>Link:
11> SortRdb.vcxproj -> C:\Users\RJ\project64\bin/Debug\SortRdb.exe
2> menucmn.cpp
2> matrix.cpp
2> markupparser.cpp
2> listctrlcmn.cpp
11>FinalizeBuildStatus:
11> Deleting file "C:\Users\RJ\project64\build/Debug/SortRdb\SortRdb.unsuccessfulbuild".
11> Touching "C:\Users\RJ\project64\build/Debug/SortRdb\SortRdb.lastbuildstate".
11>
11>Build succeeded.
11>
11>Time Elapsed 00:00:05.94
2> lboxcmn.cpp
2> layout.cpp
2> imagxpm.cpp
12>------ Build started: Project: RSP, Configuration: Debug Win32 ------
12>Build started 1/19/2015 9:26:01 PM.
12>InitializeBuildStatus:
12> Creating "C:\Users\RJ\project64\build/Debug/RSP\RSP.unsuccessfulbuild" because "AlwaysCreate" was specified.
12>ClCompile:
12> X86.c
2> imagtiff.cpp
2> imagtga.cpp
12>c:\users\rj\project64\source\rsp\x86.h(256): warning C4201: nonstandard extension used : nameless struct/union
12>c:\users\rj\project64\source\rsp\x86.h(258): warning C4201: nonstandard extension used : nameless struct/union
12>X86.c(421): warning C4152: nonstandard extension, function/data pointer conversion in expression
12>X86.c(812): warning C4131: 'DecX86reg' : uses old-style declarator
12> Sse.c
2> imagpnm.cpp
2> imagpng.cpp
12>c:\users\rj\project64\source\rsp\x86.h(256): warning C4201: nonstandard extension used : nameless struct/union
12>c:\users\rj\project64\source\rsp\x86.h(258): warning C4201: nonstandard extension used : nameless struct/union
12> RSP Register.c
2> imagpcx.cpp
2> imagjpeg.cpp
12> RSP Command.c
2> imagiff.cpp
12>c:\users\rj\project64\source\rsp\opcode.h(43): warning C4201: nonstandard extension used : nameless struct/union
12>c:\users\rj\project64\source\rsp\opcode.h(50): warning C4201: nonstandard extension used : nameless struct/union
12>c:\users\rj\project64\source\rsp\opcode.h(55): warning C4201: nonstandard extension used : nameless struct/union
12>c:\users\rj\project64\source\rsp\opcode.h(64): warning C4201: nonstandard extension used : nameless struct/union
12>c:\users\rj\project64\source\rsp\opcode.h(73): warning C4201: nonstandard extension used : nameless struct/union
12>c:\users\rj\project64\source\rsp\opcode.h(75): warning C4201: nonstandard extension used : nameless struct/union
2> Generating Code...
12>RSP Command.c(707): warning C4100: 'PC' : unreferenced formal parameter
12>RSP Command.c(828): warning C4100: 'PC' : unreferenced formal parameter
12>RSP Command.c(845): warning C4100: 'PC' : unreferenced formal parameter
12>RSP Command.c(1056): warning C4100: 'PC' : unreferenced formal parameter
12>RSP Command.c(1116): warning C4100: 'PC' : unreferenced formal parameter
12> Recompiler Sections.c
12>c:\users\rj\project64\source\rsp\opcode.h(43): warning C4201: nonstandard extension used : nameless struct/union
12>c:\users\rj\project64\source\rsp\opcode.h(50): warning C4201: nonstandard extension used : nameless struct/union
12>c:\users\rj\project64\source\rsp\opcode.h(55): warning C4201: nonstandard extension used : nameless struct/union
12>c:\users\rj\project64\source\rsp\opcode.h(64): warning C4201: nonstandard extension used : nameless struct/union
12>c:\users\rj\project64\source\rsp\opcode.h(73): warning C4201: nonstandard extension used : nameless struct/union
12>c:\users\rj\project64\source\rsp\opcode.h(75): warning C4201: nonstandard extension used : nameless struct/union
12>c:\users\rj\project64\source\rsp\x86.h(256): warning C4201: nonstandard extension used : nameless struct/union
12>c:\users\rj\project64\source\rsp\x86.h(258): warning C4201: nonstandard extension used : nameless struct/union
12>Recompiler Sections.c(812): warning C4152: nonstandard extension, function/data pointer conversion in expression
12>Recompiler Sections.c(824): warning C4152: nonstandard extension, function/data pointer conversion in expression
12>Recompiler Sections.c(1018): warning C4152: nonstandard extension, function/data pointer conversion in expression
12>Recompiler Sections.c(1114): warning C4152: nonstandard extension, function/data pointer conversion in expression
12> Recompiler Ops.c
12>c:\users\rj\project64\source\rsp\opcode.h(43): warning C4201: nonstandard extension used : nameless struct/union
12>c:\users\rj\project64\source\rsp\opcode.h(50): warning C4201: nonstandard extension used : nameless struct/union
12>c:\users\rj\project64\source\rsp\opcode.h(55): warning C4201: nonstandard extension used : nameless struct/union
12>c:\users\rj\project64\source\rsp\opcode.h(64): warning C4201: nonstandard extension used : nameless struct/union
12>c:\users\rj\project64\source\rsp\opcode.h(73): warning C4201: nonstandard extension used : nameless struct/union
12>c:\users\rj\project64\source\rsp\opcode.h(75): warning C4201: nonstandard extension used : nameless struct/union
12>c:\users\rj\project64\source\rsp\x86.h(256): warning C4201: nonstandard extension used : nameless struct/union
12>c:\users\rj\project64\source\rsp\x86.h(258): warning C4201: nonstandard extension used : nameless struct/union
12>Recompiler Ops.c(171): warning C4055: 'type cast' : from data pointer 'void *' to function pointer 'void (__cdecl *)()'
12>Recompiler Ops.c(175): warning C4055: 'type cast' : from data pointer 'void *' to function pointer 'void (__cdecl *)()'
12>Recompiler Ops.c(209): warning C4152: nonstandard extension, function/data pointer conversion in expression
2> Compiling...
2> imaggif.cpp
12>Recompiler Ops.c(448): warning C4127: conditional expression is constant
12>Recompiler Ops.c(482): warning C4152: nonstandard extension, function/data pointer conversion in expression
12>Recompiler Ops.c(487): warning C4152: nonstandard extension, function/data pointer conversion in expression
12>Recompiler Ops.c(575): warning C4055: 'type cast' : from data pointer 'void *' to function pointer 'void (__cdecl *)()'
12>Recompiler Ops.c(579): warning C4055: 'type cast' : from data pointer 'void *' to function pointer 'void (__cdecl *)()'
12>Recompiler Ops.c(616): warning C4152: nonstandard extension, function/data pointer conversion in expression
12>Recompiler Ops.c(669): warning C4152: nonstandard extension, function/data pointer conversion in expression
12>Recompiler Ops.c(757): warning C4152: nonstandard extension, function/data pointer conversion in expression
12>Recompiler Ops.c(782): warning C4152: nonstandard extension, function/data pointer conversion in expression
12>Recompiler Ops.c(831): warning C4152: nonstandard extension, function/data pointer conversion in expression
12>Recompiler Ops.c(885): warning C4152: nonstandard extension, function/data pointer conversion in expression
12>Recompiler Ops.c(950): warning C4055: 'type cast' : from data pointer 'void *' to function pointer 'void (__cdecl *)()'
12>Recompiler Ops.c(954): warning C4055: 'type cast' : from data pointer 'void *' to function pointer 'void (__cdecl *)()'
12>Recompiler Ops.c(1010): warning C4152: nonstandard extension, function/data pointer conversion in expression
12>Recompiler Ops.c(1029): warning C4152: nonstandard extension, function/data pointer conversion in expression
12>Recompiler Ops.c(1055): warning C4152: nonstandard extension, function/data pointer conversion in expression
12>Recompiler Ops.c(1123): warning C4152: nonstandard extension, function/data pointer conversion in expression
12>Recompiler Ops.c(1318): warning C4152: nonstandard extension, function/data pointer conversion in expression
12>Recompiler Ops.c(1351): warning C4152: nonstandard extension, function/data pointer conversion in expression
12>Recompiler Ops.c(1534): warning C4152: nonstandard extension, function/data pointer conversion in expression
12>Recompiler Ops.c(1565): warning C4152: nonstandard extension, function/data pointer conversion in expression
12>Recompiler Ops.c(1619): warning C4152: nonstandard extension, function/data pointer conversion in expression
12>Recompiler Ops.c(1652): warning C4152: nonstandard extension, function/data pointer conversion in expression
12>Recompiler Ops.c(1657): warning C4152: nonstandard extension, function/data pointer conversion in expression
12>Recompiler Ops.c(1673): warning C4152: nonstandard extension, function/data pointer conversion in expression
12>Recompiler Ops.c(1680): warning C4245: 'function' : conversion from 'int' to 'DWORD', signed/unsigned mismatch
12>Recompiler Ops.c(1681): warning C4152: nonstandard extension, function/data pointer conversion in expression
12>Recompiler Ops.c(1685): warning C4152: nonstandard extension, function/data pointer conversion in expression
12>Recompiler Ops.c(1688): warning C4152: nonstandard extension, function/data pointer conversion in expression
12>Recompiler Ops.c(1701): warning C4152: nonstandard extension, function/data pointer conversion in expression
12>Recompiler Ops.c(1758): warning C4152: nonstandard extension, function/data pointer conversion in expression
12>Recompiler Ops.c(1787): warning C4152: nonstandard extension, function/data pointer conversion in expression
12>Recompiler Ops.c(1791): warning C4055: 'type cast' : from data pointer 'void *' to function pointer 'void (__cdecl *)()'
12>Recompiler Ops.c(2038): warning C4152: nonstandard extension, function/data pointer conversion in expression
12>Recompiler Ops.c(2268): warning C4244: 'function' : conversion from 'int' to 'BYTE', possible loss of data
12>Recompiler Ops.c(2275): warning C4244: 'function' : conversion from 'int' to 'BYTE', possible loss of data
12>Recompiler Ops.c(2285): warning C4244: 'function' : conversion from 'int' to 'BYTE', possible loss of data
12>Recompiler Ops.c(2300): warning C4244: 'function' : conversion from 'int' to 'BYTE', possible loss of data
12>Recompiler Ops.c(2384): warning C4244: 'function' : conversion from 'int' to 'BYTE', possible loss of data
12>Recompiler Ops.c(2618): warning C4189: 'bWriteToAccum' : local variable is initialized but not referenced
12>Recompiler Ops.c(2677): warning C4152: nonstandard extension, function/data pointer conversion in expression
12>Recompiler Ops.c(2681): warning C4152: nonstandard extension, function/data pointer conversion in expression
12>Recompiler Ops.c(2799): warning C4244: 'function' : conversion from 'int' to 'BYTE', possible loss of data
12>Recompiler Ops.c(2806): warning C4244: 'function' : conversion from 'int' to 'BYTE', possible loss of data
12>Recompiler Ops.c(2830): warning C4244: 'function' : conversion from 'int' to 'BYTE', possible loss of data
12>Recompiler Ops.c(2759): warning C4189: 'bWriteToAccum' : local variable is initialized but not referenced
12>Recompiler Ops.c(2875): warning C4244: 'function' : conversion from 'int' to 'BYTE', possible loss of data
12>Recompiler Ops.c(2902): warning C4245: 'function' : conversion from 'int' to 'DWORD', signed/unsigned mismatch
12>Recompiler Ops.c(2843): warning C4189: 'bWriteToAccum' : local variable is initialized but not referenced
12>Recompiler Ops.c(3009): warning C4244: 'function' : conversion from 'int' to 'BYTE', possible loss of data
12>Recompiler Ops.c(3016): warning C4244: 'function' : conversion from 'int' to 'BYTE', possible loss of data
12>Recompiler Ops.c(3034): warning C4244: 'function' : conversion from 'int' to 'BYTE', possible loss of data
12>Recompiler Ops.c(3400): warning C4244: 'function' : conversion from 'int' to 'BYTE', possible loss of data
12>Recompiler Ops.c(3413): warning C4244: 'function' : conversion from 'int' to 'BYTE', possible loss of data
12>Recompiler Ops.c(3472): warning C4244: 'function' : conversion from 'int' to 'BYTE', possible loss of data
12>Recompiler Ops.c(3478): warning C4244: 'function' : conversion from 'int' to 'BYTE', possible loss of data
12>Recompiler Ops.c(3547): warning C4152: nonstandard extension, function/data pointer conversion in expression
12>Recompiler Ops.c(3551): warning C4152: nonstandard extension, function/data pointer conversion in expression
12>Recompiler Ops.c(3555): warning C4152: nonstandard extension, function/data pointer conversion in expression
12>Recompiler Ops.c(3609): warning C4152: nonstandard extension, function/data pointer conversion in expression
12>Recompiler Ops.c(3613): warning C4152: nonstandard extension, function/data pointer conversion in expression
12>Recompiler Ops.c(3617): warning C4152: nonstandard extension, function/data pointer conversion in expression
12>Recompiler Ops.c(3621): warning C4152: nonstandard extension, function/data pointer conversion in expression
12>Recompiler Ops.c(4107): warning C4152: nonstandard extension, function/data pointer conversion in expression
12>Recompiler Ops.c(4189): warning C4152: nonstandard extension, function/data pointer conversion in expression
12>Recompiler Ops.c(4193): warning C4152: nonstandard extension, function/data pointer conversion in expression
12>Recompiler Ops.c(4197): warning C4152: nonstandard extension, function/data pointer conversion in expression
12>Recompiler Ops.c(4271): warning C4152: nonstandard extension, function/data pointer conversion in expression
12>Recompiler Ops.c(4276): warning C4152: nonstandard extension, function/data pointer conversion in expression
12>Recompiler Ops.c(4316): warning C4152: nonstandard extension, function/data pointer conversion in expression
12>Recompiler Ops.c(4393): warning C4152: nonstandard extension, function/data pointer conversion in expression
12>Recompiler Ops.c(4402): warning C4152: nonstandard extension, function/data pointer conversion in expression
12>Recompiler Ops.c(4427): warning C4152: nonstandard extension, function/data pointer conversion in expression
12>Recompiler Ops.c(4468): warning C4152: nonstandard extension, function/data pointer conversion in expression
12>Recompiler Ops.c(4550): warning C4152: nonstandard extension, function/data pointer conversion in expression
12>Recompiler Ops.c(4559): warning C4152: nonstandard extension, function/data pointer conversion in expression
12>Recompiler Ops.c(4607): warning C4152: nonstandard extension, function/data pointer conversion in expression
12>Recompiler Ops.c(4666): warning C4152: nonstandard extension, function/data pointer conversion in expression
12>Recompiler Ops.c(4713): warning C4152: nonstandard extension, function/data pointer conversion in expression
12>Recompiler Ops.c(4717): warning C4152: nonstandard extension, function/data pointer conversion in expression
12>Recompiler Ops.c(4722): warning C4152: nonstandard extension, function/data pointer conversion in expression
12>Recompiler Ops.c(4727): warning C4152: nonstandard extension, function/data pointer conversion in expression
12>Recompiler Ops.c(4731): warning C4152: nonstandard extension, function/data pointer conversion in expression
12>Recompiler Ops.c(4737): warning C4152: nonstandard extension, function/data pointer conversion in expression
12>Recompiler Ops.c(4822): warning C4152: nonstandard extension, function/data pointer conversion in expression
12>Recompiler Ops.c(4847): warning C4152: nonstandard extension, function/data pointer conversion in expression
12>Recompiler Ops.c(4889): warning C4152: nonstandard extension, function/data pointer conversion in expression
12>Recompiler Ops.c(4970): warning C4152: nonstandard extension, function/data pointer conversion in expression
12>Recompiler Ops.c(5032): warning C4152: nonstandard extension, function/data pointer conversion in expression
12>Recompiler Ops.c(5063): warning C4152: nonstandard extension, function/data pointer conversion in expression
12>Recompiler Ops.c(5067): warning C4152: nonstandard extension, function/data pointer conversion in expression
12>Recompiler Ops.c(5071): warning C4152: nonstandard extension, function/data pointer conversion in expression
12>Recompiler Ops.c(5075): warning C4152: nonstandard extension, function/data pointer conversion in expression
12>Recompiler Ops.c(5079): warning C4152: nonstandard extension, function/data pointer conversion in expression
12>Recompiler Ops.c(5083): warning C4152: nonstandard extension, function/data pointer conversion in expression
12>Recompiler Ops.c(5087): warning C4152: nonstandard extension, function/data pointer conversion in expression
12>Recompiler Ops.c(5097): warning C4152: nonstandard extension, function/data pointer conversion in expression
12> Recompiler CPU.c
2> imagfill.cpp
12>c:\users\rj\project64\source\rsp\opcode.h(43): warning C4201: nonstandard extension used : nameless struct/union
12>c:\users\rj\project64\source\rsp\opcode.h(50): warning C4201: nonstandard extension used : nameless struct/union
12>c:\users\rj\project64\source\rsp\opcode.h(55): warning C4201: nonstandard extension used : nameless struct/union
12>c:\users\rj\project64\source\rsp\opcode.h(64): warning C4201: nonstandard extension used : nameless struct/union
12>c:\users\rj\project64\source\rsp\opcode.h(73): warning C4201: nonstandard extension used : nameless struct/union
12>c:\users\rj\project64\source\rsp\opcode.h(75): warning C4201: nonstandard extension used : nameless struct/union
2> image.cpp
12>c:\users\rj\project64\source\rsp\x86.h(256): warning C4201: nonstandard extension used : nameless struct/union
12>c:\users\rj\project64\source\rsp\x86.h(258): warning C4201: nonstandard extension used : nameless struct/union
12>Recompiler CPU.c(59): warning C4152: nonstandard extension, function/data pointer conversion in expression
12>Recompiler CPU.c(60): warning C4152: nonstandard extension, function/data pointer conversion in expression
12>Recompiler CPU.c(61): warning C4152: nonstandard extension, function/data pointer conversion in expression
12>Recompiler CPU.c(62): warning C4152: nonstandard extension, function/data pointer conversion in expression
12>Recompiler CPU.c(63): warning C4152: nonstandard extension, function/data pointer conversion in expression
12>Recompiler CPU.c(64): warning C4152: nonstandard extension, function/data pointer conversion in expression
12>Recompiler CPU.c(65): warning C4152: nonstandard extension, function/data pointer conversion in expression
12>Recompiler CPU.c(66): warning C4152: nonstandard extension, function/data pointer conversion in expression
12>Recompiler CPU.c(67): warning C4152: nonstandard extension, function/data pointer conversion in expression
12>Recompiler CPU.c(68): warning C4152: nonstandard extension, function/data pointer conversion in expression
12>Recompiler CPU.c(69): warning C4152: nonstandard extension, function/data pointer conversion in expression
12>Recompiler CPU.c(70): warning C4152: nonstandard extension, function/data pointer conversion in expression
12>Recompiler CPU.c(71): warning C4152: nonstandard extension, function/data pointer conversion in expression
12>Recompiler CPU.c(72): warning C4152: nonstandard extension, function/data pointer conversion in expression
12>Recompiler CPU.c(73): warning C4152: nonstandard extension, function/data pointer conversion in expression
12>Recompiler CPU.c(74): warning C4152: nonstandard extension, function/data pointer conversion in expression
12>Recompiler CPU.c(75): warning C4152: nonstandard extension, function/data pointer conversion in expression
12>Recompiler CPU.c(76): warning C4152: nonstandard extension, function/data pointer conversion in expression
12>Recompiler CPU.c(77): warning C4152: nonstandard extension, function/data pointer conversion in expression
12>Recompiler CPU.c(78): warning C4152: nonstandard extension, function/data pointer conversion in expression
12>Recompiler CPU.c(79): warning C4152: nonstandard extension, function/data pointer conversion in expression
12>Recompiler CPU.c(80): warning C4152: nonstandard extension, function/data pointer conversion in expression
12>Recompiler CPU.c(81): warning C4152: nonstandard extension, function/data pointer conversion in expression
12>Recompiler CPU.c(82): warning C4152: nonstandard extension, function/data pointer conversion in expression
12>Recompiler CPU.c(83): warning C4152: nonstandard extension, function/data pointer conversion in expression
12>Recompiler CPU.c(84): warning C4152: nonstandard extension, function/data pointer conversion in expression
12>Recompiler CPU.c(85): warning C4152: nonstandard extension, function/data pointer conversion in expression
12>Recompiler CPU.c(86): warning C4152: nonstandard extension, function/data pointer conversion in expression
12>Recompiler CPU.c(87): warning C4152: nonstandard extension, function/data pointer conversion in expression
12>Recompiler CPU.c(88): warning C4152: nonstandard extension, function/data pointer conversion in expression
12>Recompiler CPU.c(89): warning C4152: nonstandard extension, function/data pointer conversion in expression
12>Recompiler CPU.c(90): warning C4152: nonstandard extension, function/data pointer conversion in expression
12>Recompiler CPU.c(91): warning C4152: nonstandard extension, function/data pointer conversion in expression
12>Recompiler CPU.c(92): warning C4152: nonstandard extension, function/data pointer conversion in expression
12>Recompiler CPU.c(93): warning C4152: nonstandard extension, function/data pointer conversion in expression
12>Recompiler CPU.c(94): warning C4152: nonstandard extension, function/data pointer conversion in expression
12>Recompiler CPU.c(95): warning C4152: nonstandard extension, function/data pointer conversion in expression
12>Recompiler CPU.c(96): warning C4152: nonstandard extension, function/data pointer conversion in expression
12>Recompiler CPU.c(97): warning C4152: nonstandard extension, function/data pointer conversion in expression
12>Recompiler CPU.c(98): warning C4152: nonstandard extension, function/data pointer conversion in expression
12>Recompiler CPU.c(99): warning C4152: nonstandard extension, function/data pointer conversion in expression
12>Recompiler CPU.c(100): warning C4152: nonstandard extension, function/data pointer conversion in expression
12>Recompiler CPU.c(101): warning C4152: nonstandard extension, function/data pointer conversion in expression
12>Recompiler CPU.c(102): warning C4152: nonstandard extension, function/data pointer conversion in expression
12>Recompiler CPU.c(103): warning C4152: nonstandard extension, function/data pointer conversion in expression
12>Recompiler CPU.c(104): warning C4152: nonstandard extension, function/data pointer conversion in expression
12>Recompiler CPU.c(105): warning C4152: nonstandard extension, function/data pointer conversion in expression
12>Recompiler CPU.c(106): warning C4152: nonstandard extension, function/data pointer conversion in expression
12>Recompiler CPU.c(107): warning C4152: nonstandard extension, function/data pointer conversion in expression
12>Recompiler CPU.c(108): warning C4152: nonstandard extension, function/data pointer conversion in expression
12>Recompiler CPU.c(109): warning C4152: nonstandard extension, function/data pointer conversion in expression
12>Recompiler CPU.c(110): warning C4152: nonstandard extension, function/data pointer conversion in expression
12>Recompiler CPU.c(111): warning C4152: nonstandard extension, function/data pointer conversion in expression
12>Recompiler CPU.c(112): warning C4152: nonstandard extension, function/data pointer conversion in expression
12>Recompiler CPU.c(113): warning C4152: nonstandard extension, function/data pointer conversion in expression
12>Recompiler CPU.c(114): warning C4152: nonstandard extension, function/data pointer conversion in expression
12>Recompiler CPU.c(115): warning C4152: nonstandard extension, function/data pointer conversion in expression
12>Recompiler CPU.c(116): warning C4152: nonstandard extension, function/data pointer conversion in expression
12>Recompiler CPU.c(117): warning C4152: nonstandard extension, function/data pointer conversion in expression
12>Recompiler CPU.c(118): warning C4152: nonstandard extension, function/data pointer conversion in expression
12>Recompiler CPU.c(119): warning C4152: nonstandard extension, function/data pointer conversion in expression
12>Recompiler CPU.c(120): warning C4152: nonstandard extension, function/data pointer conversion in expression
12>Recompiler CPU.c(121): warning C4152: nonstandard extension, function/data pointer conversion in expression
12>Recompiler CPU.c(122): warning C4152: nonstandard extension, function/data pointer conversion in expression
12>Recompiler CPU.c(124): warning C4152: nonstandard extension, function/data pointer conversion in expression
12>Recompiler CPU.c(125): warning C4152: nonstandard extension, function/data pointer conversion in expression
12>Recompiler CPU.c(126): warning C4152: nonstandard extension, function/data pointer conversion in expression
12>Recompiler CPU.c(127): warning C4152: nonstandard extension, function/data pointer conversion in expression
12>Recompiler CPU.c(128): warning C4152: nonstandard extension, function/data pointer conversion in expression
12>Recompiler CPU.c(129): warning C4152: nonstandard extension, function/data pointer conversion in expression
12>Recompiler CPU.c(130): warning C4152: nonstandard extension, function/data pointer conversion in expression
12>Recompiler CPU.c(131): warning C4152: nonstandard extension, function/data pointer conversion in expression
12>Recompiler CPU.c(132): warning C4152: nonstandard extension, function/data pointer conversion in expression
12>Recompiler CPU.c(133): warning C4152: nonstandard extension, function/data pointer conversion in expression
12>Recompiler CPU.c(134): warning C4152: nonstandard extension, function/data pointer conversion in expression
12>Recompiler CPU.c(135): warning C4152: nonstandard extension, function/data pointer conversion in expression
12>Recompiler CPU.c(136): warning C4152: nonstandard extension, function/data pointer conversion in expression
12>Recompiler CPU.c(137): warning C4152: nonstandard extension, function/data pointer conversion in expression
12>Recompiler CPU.c(138): warning C4152: nonstandard extension, function/data pointer conversion in expression
12>Recompiler CPU.c(139): warning C4152: nonstandard extension, function/data pointer conversion in expression
12>Recompiler CPU.c(140): warning C4152: nonstandard extension, function/data pointer conversion in expression
12>Recompiler CPU.c(141): warning C4152: nonstandard extension, function/data pointer conversion in expression
12>Recompiler CPU.c(142): warning C4152: nonstandard extension, function/data pointer conversion in expression
12>Recompiler CPU.c(143): warning C4152: nonstandard extension, function/data pointer conversion in expression
12>Recompiler CPU.c(144): warning C4152: nonstandard extension, function/data pointer conversion in expression
12>Recompiler CPU.c(145): warning C4152: nonstandard extension, function/data pointer conversion in expression
12>Recompiler CPU.c(146): warning C4152: nonstandard extension, function/data pointer conversion in expression
12>Recompiler CPU.c(147): warning C4152: nonstandard extension, function/data pointer conversion in expression
12>Recompiler CPU.c(148): warning C4152: nonstandard extension, function/data pointer conversion in expression
12>Recompiler CPU.c(149): warning C4152: nonstandard extension, function/data pointer conversion in expression
12>Recompiler CPU.c(150): warning C4152: nonstandard extension, function/data pointer conversion in expression
12>Recompiler CPU.c(151): warning C4152: nonstandard extension, function/data pointer conversion in expression
12>Recompiler CPU.c(152): warning C4152: nonstandard extension, function/data pointer conversion in expression
12>Recompiler CPU.c(153): warning C4152: nonstandard extension, function/data pointer conversion in expression
12>Recompiler CPU.c(154): warning C4152: nonstandard extension, function/data pointer conversion in expression
12>Recompiler CPU.c(155): warning C4152: nonstandard extension, function/data pointer conversion in expression
12>Recompiler CPU.c(156): warning C4152: nonstandard extension, function/data pointer conversion in expression
12>Recompiler CPU.c(157): warning C4152: nonstandard extension, function/data pointer conversion in expression
12>Recompiler CPU.c(158): warning C4152: nonstandard extension, function/data pointer conversion in expression
12>Recompiler CPU.c(159): warning C4152: nonstandard extension, function/data pointer conversion in expression
12>Recompiler CPU.c(160): warning C4152: nonstandard extension, function/data pointer conversion in expression
12>Recompiler CPU.c(161): warning C4152: nonstandard extension, function/data pointer conversion in expression
12>Recompiler CPU.c(162): warning C4152: nonstandard extension, function/data pointer conversion in expression
12>Recompiler CPU.c(163): warning C4152: nonstandard extension, function/data pointer conversion in expression
12>Recompiler CPU.c(164): warning C4152: nonstandard extension, function/data pointer conversion in expression
12>Recompiler CPU.c(165): warning C4152: nonstandard extension, function/data pointer conversion in expression
12>Recompiler CPU.c(166): warning C4152: nonstandard extension, function/data pointer conversion in expression
12>Recompiler CPU.c(167): warning C4152: nonstandard extension, function/data pointer conversion in expression
12>Recompiler CPU.c(168): warning C4152: nonstandard extension, function/data pointer conversion in expression
12>Recompiler CPU.c(169): warning C4152: nonstandard extension, function/data pointer conversion in expression
12>Recompiler CPU.c(170): warning C4152: nonstandard extension, function/data pointer conversion in expression
12>Recompiler CPU.c(171): warning C4152: nonstandard extension, function/data pointer conversion in expression
12>Recompiler CPU.c(172): warning C4152: nonstandard extension, function/data pointer conversion in expression
12>Recompiler CPU.c(173): warning C4152: nonstandard extension, function/data pointer conversion in expression
12>Recompiler CPU.c(174): warning C4152: nonstandard extension, function/data pointer conversion in expression
12>Recompiler CPU.c(175): warning C4152: nonstandard extension, function/data pointer conversion in expression
12>Recompiler CPU.c(176): warning C4152: nonstandard extension, function/data pointer conversion in expression
12>Recompiler CPU.c(177): warning C4152: nonstandard extension, function/data pointer conversion in expression
12>Recompiler CPU.c(178): warning C4152: nonstandard extension, function/data pointer conversion in expression
12>Recompiler CPU.c(179): warning C4152: nonstandard extension, function/data pointer conversion in expression
12>Recompiler CPU.c(180): warning C4152: nonstandard extension, function/data pointer conversion in expression
12>Recompiler CPU.c(181): warning C4152: nonstandard extension, function/data pointer conversion in expression
12>Recompiler CPU.c(182): warning C4152: nonstandard extension, function/data pointer conversion in expression
12>Recompiler CPU.c(183): warning C4152: nonstandard extension, function/data pointer conversion in expression
12>Recompiler CPU.c(184): warning C4152: nonstandard extension, function/data pointer conversion in expression
12>Recompiler CPU.c(185): warning C4152: nonstandard extension, function/data pointer conversion in expression
12>Recompiler CPU.c(186): warning C4152: nonstandard extension, function/data pointer conversion in expression
12>Recompiler CPU.c(187): warning C4152: nonstandard extension, function/data pointer conversion in expression
12>Recompiler CPU.c(189): warning C4152: nonstandard extension, function/data pointer conversion in expression
12>Recompiler CPU.c(190): warning C4152: nonstandard extension, function/data pointer conversion in expression
12>Recompiler CPU.c(191): warning C4152: nonstandard extension, function/data pointer conversion in expression
12>Recompiler CPU.c(192): warning C4152: nonstandard extension, function/data pointer conversion in expression
12>Recompiler CPU.c(193): warning C4152: nonstandard extension, function/data pointer conversion in expression
12>Recompiler CPU.c(194): warning C4152: nonstandard extension, function/data pointer conversion in expression
12>Recompiler CPU.c(195): warning C4152: nonstandard extension, function/data pointer conversion in expression
12>Recompiler CPU.c(196): warning C4152: nonstandard extension, function/data pointer conversion in expression
12>Recompiler CPU.c(197): warning C4152: nonstandard extension, function/data pointer conversion in expression
12>Recompiler CPU.c(198): warning C4152: nonstandard extension, function/data pointer conversion in expression
12>Recompiler CPU.c(199): warning C4152: nonstandard extension, function/data pointer conversion in expression
12>Recompiler CPU.c(200): warning C4152: nonstandard extension, function/data pointer conversion in expression
12>Recompiler CPU.c(201): warning C4152: nonstandard extension, function/data pointer conversion in expression
12>Recompiler CPU.c(202): warning C4152: nonstandard extension, function/data pointer conversion in expression
12>Recompiler CPU.c(203): warning C4152: nonstandard extension, function/data pointer conversion in expression
12>Recompiler CPU.c(204): warning C4152: nonstandard extension, function/data pointer conversion in expression
12>Recompiler CPU.c(205): warning C4152: nonstandard extension, function/data pointer conversion in expression
12>Recompiler CPU.c(206): warning C4152: nonstandard extension, function/data pointer conversion in expression
12>Recompiler CPU.c(207): warning C4152: nonstandard extension, function/data pointer conversion in expression
12>Recompiler CPU.c(208): warning C4152: nonstandard extension, function/data pointer conversion in expression
12>Recompiler CPU.c(209): warning C4152: nonstandard extension, function/data pointer conversion in expression
12>Recompiler CPU.c(210): warning C4152: nonstandard extension, function/data pointer conversion in expression
12>Recompiler CPU.c(211): warning C4152: nonstandard extension, function/data pointer conversion in expression
12>Recompiler CPU.c(212): warning C4152: nonstandard extension, function/data pointer conversion in expression
12>Recompiler CPU.c(213): warning C4152: nonstandard extension, function/data pointer conversion in expression
12>Recompiler CPU.c(214): warning C4152: nonstandard extension, function/data pointer conversion in expression
12>Recompiler CPU.c(215): warning C4152: nonstandard extension, function/data pointer conversion in expression
12>Recompiler CPU.c(216): warning C4152: nonstandard extension, function/data pointer conversion in expression
12>Recompiler CPU.c(217): warning C4152: nonstandard extension, function/data pointer conversion in expression
12>Recompiler CPU.c(218): warning C4152: nonstandard extension, function/data pointer conversion in expression
12>Recompiler CPU.c(219): warning C4152: nonstandard extension, function/data pointer conversion in expression
12>Recompiler CPU.c(220): warning C4152: nonstandard extension, function/data pointer conversion in expression
12>Recompiler CPU.c(222): warning C4152: nonstandard extension, function/data pointer conversion in expression
12>Recompiler CPU.c(223): warning C4152: nonstandard extension, function/data pointer conversion in expression
12>Recompiler CPU.c(224): warning C4152: nonstandard extension, function/data pointer conversion in expression
12>Recompiler CPU.c(225): warning C4152: nonstandard extension, function/data pointer conversion in expression
12>Recompiler CPU.c(226): warning C4152: nonstandard extension, function/data pointer conversion in expression
12>Recompiler CPU.c(227): warning C4152: nonstandard extension, function/data pointer conversion in expression
12>Recompiler CPU.c(228): warning C4152: nonstandard extension, function/data pointer conversion in expression
12>Recompiler CPU.c(229): warning C4152: nonstandard extension, function/data pointer conversion in expression
12>Recompiler CPU.c(230): warning C4152: nonstandard extension, function/data pointer conversion in expression
12>Recompiler CPU.c(231): warning C4152: nonstandard extension, function/data pointer conversion in expression
12>Recompiler CPU.c(232): warning C4152: nonstandard extension, function/data pointer conversion in expression
12>Recompiler CPU.c(233): warning C4152: nonstandard extension, function/data pointer conversion in expression
12>Recompiler CPU.c(234): warning C4152: nonstandard extension, function/data pointer conversion in expression
12>Recompiler CPU.c(235): warning C4152: nonstandard extension, function/data pointer conversion in expression
12>Recompiler CPU.c(236): warning C4152: nonstandard extension, function/data pointer conversion in expression
12>Recompiler CPU.c(237): warning C4152: nonstandard extension, function/data pointer conversion in expression
12>Recompiler CPU.c(238): warning C4152: nonstandard extension, function/data pointer conversion in expression
12>Recompiler CPU.c(239): warning C4152: nonstandard extension, function/data pointer conversion in expression
12>Recompiler CPU.c(240): warning C4152: nonstandard extension, function/data pointer conversion in expression
12>Recompiler CPU.c(241): warning C4152: nonstandard extension, function/data pointer conversion in expression
12>Recompiler CPU.c(242): warning C4152: nonstandard extension, function/data pointer conversion in expression
12>Recompiler CPU.c(243): warning C4152: nonstandard extension, function/data pointer conversion in expression
12>Recompiler CPU.c(244): warning C4152: nonstandard extension, function/data pointer conversion in expression
12>Recompiler CPU.c(245): warning C4152: nonstandard extension, function/data pointer conversion in expression
12>Recompiler CPU.c(246): warning C4152: nonstandard extension, function/data pointer conversion in expression
12>Recompiler CPU.c(247): warning C4152: nonstandard extension, function/data pointer conversion in expression
12>Recompiler CPU.c(248): warning C4152: nonstandard extension, function/data pointer conversion in expression
12>Recompiler CPU.c(249): warning C4152: nonstandard extension, function/data pointer conversion in expression
12>Recompiler CPU.c(250): warning C4152: nonstandard extension, function/data pointer conversion in expression
12>Recompiler CPU.c(251): warning C4152: nonstandard extension, function/data pointer conversion in expression
12>Recompiler CPU.c(252): warning C4152: nonstandard extension, function/data pointer conversion in expression
12>Recompiler CPU.c(253): warning C4152: nonstandard extension, function/data pointer conversion in expression
12>Recompiler CPU.c(255): warning C4152: nonstandard extension, function/data pointer conversion in expression
12>Recompiler CPU.c(256): warning C4152: nonstandard extension, function/data pointer conversion in expression
12>Recompiler CPU.c(257): warning C4152: nonstandard extension, function/data pointer conversion in expression
12>Recompiler CPU.c(258): warning C4152: nonstandard extension, function/data pointer conversion in expression
12>Recompiler CPU.c(259): warning C4152: nonstandard extension, function/data pointer conversion in expression
12>Recompiler CPU.c(260): warning C4152: nonstandard extension, function/data pointer conversion in expression
12>Recompiler CPU.c(261): warning C4152: nonstandard extension, function/data pointer conversion in expression
12>Recompiler CPU.c(262): warning C4152: nonstandard extension, function/data pointer conversion in expression
12>Recompiler CPU.c(263): warning C4152: nonstandard extension, function/data pointer conversion in expression
12>Recompiler CPU.c(264): warning C4152: nonstandard extension, function/data pointer conversion in expression
12>Recompiler CPU.c(265): warning C4152: nonstandard extension, function/data pointer conversion in expression
12>Recompiler CPU.c(266): warning C4152: nonstandard extension, function/data pointer conversion in expression
12>Recompiler CPU.c(267): warning C4152: nonstandard extension, function/data pointer conversion in expression
12>Recompiler CPU.c(268): warning C4152: nonstandard extension, function/data pointer conversion in expression
12>Recompiler CPU.c(269): warning C4152: nonstandard extension, function/data pointer conversion in expression
12>Recompiler CPU.c(270): warning C4152: nonstandard extension, function/data pointer conversion in expression
12>Recompiler CPU.c(271): warning C4152: nonstandard extension, function/data pointer conversion in expression
12>Recompiler CPU.c(272): warning C4152: nonstandard extension, function/data pointer conversion in expression
12>Recompiler CPU.c(273): warning C4152: nonstandard extension, function/data pointer conversion in expression
12>Recompiler CPU.c(274): warning C4152: nonstandard extension, function/data pointer conversion in expression
12>Recompiler CPU.c(275): warning C4152: nonstandard extension, function/data pointer conversion in expression
12>Recompiler CPU.c(276): warning C4152: nonstandard extension, function/data pointer conversion in expression
12>Recompiler CPU.c(277): warning C4152: nonstandard extension, function/data pointer conversion in expression
12>Recompiler CPU.c(278): warning C4152: nonstandard extension, function/data pointer conversion in expression
12>Recompiler CPU.c(279): warning C4152: nonstandard extension, function/data pointer conversion in expression
12>Recompiler CPU.c(280): warning C4152: nonstandard extension, function/data pointer conversion in expression
12>Recompiler CPU.c(281): warning C4152: nonstandard extension, function/data pointer conversion in expression
12>Recompiler CPU.c(282): warning C4152: nonstandard extension, function/data pointer conversion in expression
12>Recompiler CPU.c(283): warning C4152: nonstandard extension, function/data pointer conversion in expression
12>Recompiler CPU.c(284): warning C4152: nonstandard extension, function/data pointer conversion in expression
12>Recompiler CPU.c(285): warning C4152: nonstandard extension, function/data pointer conversion in expression
12>Recompiler CPU.c(286): warning C4152: nonstandard extension, function/data pointer conversion in expression
12>Recompiler CPU.c(288): warning C4152: nonstandard extension, function/data pointer conversion in expression
12>Recompiler CPU.c(289): warning C4152: nonstandard extension, function/data pointer conversion in expression
12>Recompiler CPU.c(290): warning C4152: nonstandard extension, function/data pointer conversion in expression
12>Recompiler CPU.c(291): warning C4152: nonstandard extension, function/data pointer conversion in expression
12>Recompiler CPU.c(292): warning C4152: nonstandard extension, function/data pointer conversion in expression
12>Recompiler CPU.c(293): warning C4152: nonstandard extension, function/data pointer conversion in expression
12>Recompiler CPU.c(294): warning C4152: nonstandard extension, function/data pointer conversion in expression
12>Recompiler CPU.c(295): warning C4152: nonstandard extension, function/data pointer conversion in expression
12>Recompiler CPU.c(296): warning C4152: nonstandard extension, function/data pointer conversion in expression
12>Recompiler CPU.c(297): warning C4152: nonstandard extension, function/data pointer conversion in expression
12>Recompiler CPU.c(298): warning C4152: nonstandard extension, function/data pointer conversion in expression
12>Recompiler CPU.c(299): warning C4152: nonstandard extension, function/data pointer conversion in expression
12>Recompiler CPU.c(300): warning C4152: nonstandard extension, function/data pointer conversion in expression
12>Recompiler CPU.c(301): warning C4152: nonstandard extension, function/data pointer conversion in expression
12>Recompiler CPU.c(302): warning C4152: nonstandard extension, function/data pointer conversion in expression
12>Recompiler CPU.c(303): warning C4152: nonstandard extension, function/data pointer conversion in expression
12>Recompiler CPU.c(304): warning C4152: nonstandard extension, function/data pointer conversion in expression
12>Recompiler CPU.c(305): warning C4152: nonstandard extension, function/data pointer conversion in expression
12>Recompiler CPU.c(306): warning C4152: nonstandard extension, function/data pointer conversion in expression
12>Recompiler CPU.c(307): warning C4152: nonstandard extension, function/data pointer conversion in expression
12>Recompiler CPU.c(308): warning C4152: nonstandard extension, function/data pointer conversion in expression
12>Recompiler CPU.c(309): warning C4152: nonstandard extension, function/data pointer conversion in expression
12>Recompiler CPU.c(310): warning C4152: nonstandard extension, function/data pointer conversion in expression
12>Recompiler CPU.c(311): warning C4152: nonstandard extension, function/data pointer conversion in expression
12>Recompiler CPU.c(312): warning C4152: nonstandard extension, function/data pointer conversion in expression
12>Recompiler CPU.c(313): warning C4152: nonstandard extension, function/data pointer conversion in expression
12>Recompiler CPU.c(314): warning C4152: nonstandard extension, function/data pointer conversion in expression
12>Recompiler CPU.c(315): warning C4152: nonstandard extension, function/data pointer conversion in expression
12>Recompiler CPU.c(316): warning C4152: nonstandard extension, function/data pointer conversion in expression
12>Recompiler CPU.c(317): warning C4152: nonstandard extension, function/data pointer conversion in expression
12>Recompiler CPU.c(318): warning C4152: nonstandard extension, function/data pointer conversion in expression
12>Recompiler CPU.c(319): warning C4152: nonstandard extension, function/data pointer conversion in expression
12>Recompiler CPU.c(320): warning C4152: nonstandard extension, function/data pointer conversion in expression
12>Recompiler CPU.c(321): warning C4152: nonstandard extension, function/data pointer conversion in expression
12>Recompiler CPU.c(322): warning C4152: nonstandard extension, function/data pointer conversion in expression
12>Recompiler CPU.c(323): warning C4152: nonstandard extension, function/data pointer conversion in expression
12>Recompiler CPU.c(324): warning C4152: nonstandard extension, function/data pointer conversion in expression
12>Recompiler CPU.c(325): warning C4152: nonstandard extension, function/data pointer conversion in expression
12>Recompiler CPU.c(326): warning C4152: nonstandard extension, function/data pointer conversion in expression
12>Recompiler CPU.c(327): warning C4152: nonstandard extension, function/data pointer conversion in expression
12>Recompiler CPU.c(328): warning C4152: nonstandard extension, function/data pointer conversion in expression
12>Recompiler CPU.c(329): warning C4152: nonstandard extension, function/data pointer conversion in expression
12>Recompiler CPU.c(330): warning C4152: nonstandard extension, function/data pointer conversion in expression
12>Recompiler CPU.c(331): warning C4152: nonstandard extension, function/data pointer conversion in expression
12>Recompiler CPU.c(332): warning C4152: nonstandard extension, function/data pointer conversion in expression
12>Recompiler CPU.c(333): warning C4152: nonstandard extension, function/data pointer conversion in expression
12>Recompiler CPU.c(334): warning C4152: nonstandard extension, function/data pointer conversion in expression
12>Recompiler CPU.c(335): warning C4152: nonstandard extension, function/data pointer conversion in expression
12>Recompiler CPU.c(336): warning C4152: nonstandard extension, function/data pointer conversion in expression
12>Recompiler CPU.c(337): warning C4152: nonstandard extension, function/data pointer conversion in expression
12>Recompiler CPU.c(338): warning C4152: nonstandard extension, function/data pointer conversion in expression
12>Recompiler CPU.c(339): warning C4152: nonstandard extension, function/data pointer conversion in expression
12>Recompiler CPU.c(340): warning C4152: nonstandard extension, function/data pointer conversion in expression
12>Recompiler CPU.c(341): warning C4152: nonstandard extension, function/data pointer conversion in expression
12>Recompiler CPU.c(342): warning C4152: nonstandard extension, function/data pointer conversion in expression
12>Recompiler CPU.c(343): warning C4152: nonstandard extension, function/data pointer conversion in expression
12>Recompiler CPU.c(344): warning C4152: nonstandard extension, function/data pointer conversion in expression
12>Recompiler CPU.c(345): warning C4152: nonstandard extension, function/data pointer conversion in expression
12>Recompiler CPU.c(346): warning C4152: nonstandard extension, function/data pointer conversion in expression
12>Recompiler CPU.c(347): warning C4152: nonstandard extension, function/data pointer conversion in expression
12>Recompiler CPU.c(348): warning C4152: nonstandard extension, function/data pointer conversion in expression
12>Recompiler CPU.c(349): warning C4152: nonstandard extension, function/data pointer conversion in expression
12>Recompiler CPU.c(350): warning C4152: nonstandard extension, function/data pointer conversion in expression
12>Recompiler CPU.c(351): warning C4152: nonstandard extension, function/data pointer conversion in expression
12>Recompiler CPU.c(353): warning C4152: nonstandard extension, function/data pointer conversion in expression
12>Recompiler CPU.c(354): warning C4152: nonstandard extension, function/data pointer conversion in expression
12>Recompiler CPU.c(355): warning C4152: nonstandard extension, function/data pointer conversion in expression
12>Recompiler CPU.c(356): warning C4152: nonstandard extension, function/data pointer conversion in expression
12>Recompiler CPU.c(357): warning C4152: nonstandard extension, function/data pointer conversion in expression
12>Recompiler CPU.c(358): warning C4152: nonstandard extension, function/data pointer conversion in expression
12>Recompiler CPU.c(359): warning C4152: nonstandard extension, function/data pointer conversion in expression
12>Recompiler CPU.c(360): warning C4152: nonstandard extension, function/data pointer conversion in expression
12>Recompiler CPU.c(361): warning C4152: nonstandard extension, function/data pointer conversion in expression
12>Recompiler CPU.c(362): warning C4152: nonstandard extension, function/data pointer conversion in expression
12>Recompiler CPU.c(363): warning C4152: nonstandard extension, function/data pointer conversion in expression
12>Recompiler CPU.c(364): warning C4152: nonstandard extension, function/data pointer conversion in expression
12>Recompiler CPU.c(365): warning C4152: nonstandard extension, function/data pointer conversion in expression
12>Recompiler CPU.c(366): warning C4152: nonstandard extension, function/data pointer conversion in expression
12>Recompiler CPU.c(367): warning C4152: nonstandard extension, function/data pointer conversion in expression
12>Recompiler CPU.c(368): warning C4152: nonstandard extension, function/data pointer conversion in expression
12>Recompiler CPU.c(369): warning C4152: nonstandard extension, function/data pointer conversion in expression
12>Recompiler CPU.c(370): warning C4152: nonstandard extension, function/data pointer conversion in expression
12>Recompiler CPU.c(371): warning C4152: nonstandard extension, function/data pointer conversion in expression
12>Recompiler CPU.c(372): warning C4152: nonstandard extension, function/data pointer conversion in expression
12>Recompiler CPU.c(373): warning C4152: nonstandard extension, function/data pointer conversion in expression
12>Recompiler CPU.c(374): warning C4152: nonstandard extension, function/data pointer conversion in expression
12>Recompiler CPU.c(375): warning C4152: nonstandard extension, function/data pointer conversion in expression
12>Recompiler CPU.c(376): warning C4152: nonstandard extension, function/data pointer conversion in expression
12>Recompiler CPU.c(377): warning C4152: nonstandard extension, function/data pointer conversion in expression
12>Recompiler CPU.c(378): warning C4152: nonstandard extension, function/data pointer conversion in expression
12>Recompiler CPU.c(379): warning C4152: nonstandard extension, function/data pointer conversion in expression
12>Recompiler CPU.c(380): warning C4152: nonstandard extension, function/data pointer conversion in expression
12>Recompiler CPU.c(381): warning C4152: nonstandard extension, function/data pointer conversion in expression
12>Recompiler CPU.c(382): warning C4152: nonstandard extension, function/data pointer conversion in expression
12>Recompiler CPU.c(383): warning C4152: nonstandard extension, function/data pointer conversion in expression
12>Recompiler CPU.c(384): warning C4152: nonstandard extension, function/data pointer conversion in expression
12>Recompiler CPU.c(386): warning C4152: nonstandard extension, function/data pointer conversion in expression
12>Recompiler CPU.c(387): warning C4152: nonstandard extension, function/data pointer conversion in expression
12>Recompiler CPU.c(388): warning C4152: nonstandard extension, function/data pointer conversion in expression
12>Recompiler CPU.c(389): warning C4152: nonstandard extension, function/data pointer conversion in expression
12>Recompiler CPU.c(390): warning C4152: nonstandard extension, function/data pointer conversion in expression
12>Recompiler CPU.c(391): warning C4152: nonstandard extension, function/data pointer conversion in expression
12>Recompiler CPU.c(392): warning C4152: nonstandard extension, function/data pointer conversion in expression
12>Recompiler CPU.c(393): warning C4152: nonstandard extension, function/data pointer conversion in expression
12>Recompiler CPU.c(394): warning C4152: nonstandard extension, function/data pointer conversion in expression
12>Recompiler CPU.c(395): warning C4152: nonstandard extension, function/data pointer conversion in expression
12>Recompiler CPU.c(396): warning C4152: nonstandard extension, function/data pointer conversion in expression
12>Recompiler CPU.c(397): warning C4152: nonstandard extension, function/data pointer conversion in expression
12>Recompiler CPU.c(398): warning C4152: nonstandard extension, function/data pointer conversion in expression
12>Recompiler CPU.c(399): warning C4152: nonstandard extension, function/data pointer conversion in expression
12>Recompiler CPU.c(400): warning C4152: nonstandard extension, function/data pointer conversion in expression
12>Recompiler CPU.c(401): warning C4152: nonstandard extension, function/data pointer conversion in expression
12>Recompiler CPU.c(402): warning C4152: nonstandard extension, function/data pointer conversion in expression
12>Recompiler CPU.c(403): warning C4152: nonstandard extension, function/data pointer conversion in expression
12>Recompiler CPU.c(404): warning C4152: nonstandard extension, function/data pointer conversion in expression
12>Recompiler CPU.c(405): warning C4152: nonstandard extension, function/data pointer conversion in expression
12>Recompiler CPU.c(406): warning C4152: nonstandard extension, function/data pointer conversion in expression
12>Recompiler CPU.c(407): warning C4152: nonstandard extension, function/data pointer conversion in expression
12>Recompiler CPU.c(408): warning C4152: nonstandard extension, function/data pointer conversion in expression
12>Recompiler CPU.c(409): warning C4152: nonstandard extension, function/data pointer conversion in expression
12>Recompiler CPU.c(410): warning C4152: nonstandard extension, function/data pointer conversion in expression
12>Recompiler CPU.c(411): warning C4152: nonstandard extension, function/data pointer conversion in expression
12>Recompiler CPU.c(412): warning C4152: nonstandard extension, function/data pointer conversion in expression
12>Recompiler CPU.c(413): warning C4152: nonstandard extension, function/data pointer conversion in expression
12>Recompiler CPU.c(414): warning C4152: nonstandard extension, function/data pointer conversion in expression
12>Recompiler CPU.c(415): warning C4152: nonstandard extension, function/data pointer conversion in expression
12>Recompiler CPU.c(416): warning C4152: nonstandard extension, function/data pointer conversion in expression
12>Recompiler CPU.c(417): warning C4152: nonstandard extension, function/data pointer conversion in expression
12>Recompiler CPU.c(830): warning C4152: nonstandard extension, function/data pointer conversion in expression
12>Recompiler CPU.c(838): warning C4055: 'type cast' : from data pointer 'void *' to function pointer 'void (__cdecl *)()'
12>Recompiler CPU.c(902): warning C4245: 'function' : conversion from 'int' to 'DWORD', signed/unsigned mismatch
12> Recompiler Analysis.c
2> imagbmp.cpp
12>c:\users\rj\project64\source\rsp\opcode.h(43): warning C4201: nonstandard extension used : nameless struct/union
12>c:\users\rj\project64\source\rsp\opcode.h(50): warning C4201: nonstandard extension used : nameless struct/union
12>c:\users\rj\project64\source\rsp\opcode.h(55): warning C4201: nonstandard extension used : nameless struct/union
12>c:\users\rj\project64\source\rsp\opcode.h(64): warning C4201: nonstandard extension used : nameless struct/union
12>c:\users\rj\project64\source\rsp\opcode.h(73): warning C4201: nonstandard extension used : nameless struct/union
12>c:\users\rj\project64\source\rsp\opcode.h(75): warning C4201: nonstandard extension used : nameless struct/union
12>Recompiler Analysis.c(136): warning C4189: 'JumpTarget' : local variable is initialized but not referenced
12>Recompiler Analysis.c(435): warning C4189: 'JumpTarget' : local variable is initialized but not referenced
12>Recompiler Analysis.c(1137): warning C4100: 'PC' : unreferenced formal parameter
12>Recompiler Analysis.c(1258): warning C4201: nonstandard extension used : nameless struct/union
12>Recompiler Analysis.c(1262): warning C4201: nonstandard extension used : nameless struct/union
12>Recompiler Analysis.c(1277): warning C4245: '=' : conversion from 'int' to 'DWORD', signed/unsigned mismatch
12>Recompiler Analysis.c(1289): warning C4245: '=' : conversion from 'int' to 'DWORD', signed/unsigned mismatch
12>Recompiler Analysis.c(1290): warning C4245: '=' : conversion from 'int' to 'DWORD', signed/unsigned mismatch
12>Recompiler Analysis.c(1291): warning C4245: '=' : conversion from 'int' to 'DWORD', signed/unsigned mismatch
12>Recompiler Analysis.c(1300): warning C4245: '=' : conversion from 'int' to 'DWORD', signed/unsigned mismatch
12>Recompiler Analysis.c(1324): warning C4245: '=' : conversion from 'int' to 'DWORD', signed/unsigned mismatch
12>Recompiler Analysis.c(1325): warning C4245: '=' : conversion from 'int' to 'DWORD', signed/unsigned mismatch
12>Recompiler Analysis.c(1337): warning C4245: '=' : conversion from 'int' to 'DWORD', signed/unsigned mismatch
12>Recompiler Analysis.c(1338): warning C4245: '=' : conversion from 'int' to 'DWORD', signed/unsigned mismatch
12>Recompiler Analysis.c(1350): warning C4245: '=' : conversion from 'int' to 'DWORD', signed/unsigned mismatch
12>Recompiler Analysis.c(1362): warning C4245: '=' : conversion from 'int' to 'DWORD', signed/unsigned mismatch
12>Recompiler Analysis.c(1368): warning C4245: '=' : conversion from 'int' to 'DWORD', signed/unsigned mismatch
12>Recompiler Analysis.c(1369): warning C4245: '=' : conversion from 'int' to 'DWORD', signed/unsigned mismatch
12>Recompiler Analysis.c(1377): warning C4245: '=' : conversion from 'int' to 'DWORD', signed/unsigned mismatch
12>Recompiler Analysis.c(1378): warning C4245: '=' : conversion from 'int' to 'DWORD', signed/unsigned mismatch
12>Recompiler Analysis.c(1384): warning C4245: '=' : conversion from 'int' to 'DWORD', signed/unsigned mismatch
12>Recompiler Analysis.c(1385): warning C4245: '=' : conversion from 'int' to 'DWORD', signed/unsigned mismatch
12>Recompiler Analysis.c(1395): warning C4245: '=' : conversion from 'int' to 'DWORD', signed/unsigned mismatch
12>Recompiler Analysis.c(1396): warning C4245: '=' : conversion from 'int' to 'DWORD', signed/unsigned mismatch
12>Recompiler Analysis.c(1397): warning C4245: '=' : conversion from 'int' to 'DWORD', signed/unsigned mismatch
12>Recompiler Analysis.c(1467): warning C4245: '=' : conversion from 'int' to 'DWORD', signed/unsigned mismatch
12>Recompiler Analysis.c(1468): warning C4245: '=' : conversion from 'int' to 'DWORD', signed/unsigned mismatch
12>Recompiler Analysis.c(1481): warning C4245: '=' : conversion from 'int' to 'DWORD', signed/unsigned mismatch
12>Recompiler Analysis.c(1482): warning C4245: '=' : conversion from 'int' to 'DWORD', signed/unsigned mismatch
12>Recompiler Analysis.c(1487): warning C4245: '=' : conversion from 'int' to 'DWORD', signed/unsigned mismatch
12>Recompiler Analysis.c(1488): warning C4245: '=' : conversion from 'int' to 'DWORD', signed/unsigned mismatch
12>Recompiler Analysis.c(1496): warning C4245: '=' : conversion from 'int' to 'DWORD', signed/unsigned mismatch
12>Recompiler Analysis.c(1502): warning C4245: '=' : conversion from 'int' to 'DWORD', signed/unsigned mismatch
12>Recompiler Analysis.c(1519): warning C4245: '=' : conversion from 'int' to 'DWORD', signed/unsigned mismatch
12>Recompiler Analysis.c(1527): warning C4245: '=' : conversion from 'int' to 'DWORD', signed/unsigned mismatch
12>Recompiler Analysis.c(1542): warning C4245: '=' : conversion from 'int' to 'DWORD', signed/unsigned mismatch
12>Recompiler Analysis.c(1570): warning C4245: '=' : conversion from 'int' to 'DWORD', signed/unsigned mismatch
12> Mmx.c
12>c:\users\rj\project64\source\rsp\x86.h(256): warning C4201: nonstandard extension used : nameless struct/union
12>c:\users\rj\project64\source\rsp\x86.h(258): warning C4201: nonstandard extension used : nameless struct/union
12> memory.c
2> imagall.cpp
12>memory.c(321): warning C4244: '=' : conversion from 'int' to 'BYTE', possible loss of data
12>memory.c(322): warning C4244: '=' : conversion from 'int' to 'BYTE', possible loss of data
12>memory.c(323): warning C4244: '=' : conversion from 'int' to 'BYTE', possible loss of data
12>memory.c(324): warning C4244: '=' : conversion from 'int' to 'BYTE', possible loss of data
12>memory.c(327): warning C4244: '=' : conversion from 'int' to 'BYTE', possible loss of data
12>memory.c(328): warning C4244: '=' : conversion from 'int' to 'BYTE', possible loss of data
12>memory.c(329): warning C4244: '=' : conversion from 'int' to 'BYTE', possible loss of data
12>memory.c(330): warning C4244: '=' : conversion from 'int' to 'BYTE', possible loss of data
12>memory.c(345): warning C4244: '=' : conversion from 'int' to 'BYTE', possible loss of data
12>memory.c(346): warning C4244: '=' : conversion from 'int' to 'BYTE', possible loss of data
12>memory.c(347): warning C4244: '=' : conversion from 'int' to 'BYTE', possible loss of data
12>memory.c(348): warning C4244: '=' : conversion from 'int' to 'BYTE', possible loss of data
12>memory.c(351): warning C4244: '=' : conversion from 'int' to 'BYTE', possible loss of data
12>memory.c(352): warning C4244: '=' : conversion from 'int' to 'BYTE', possible loss of data
12>memory.c(353): warning C4244: '=' : conversion from 'int' to 'BYTE', possible loss of data
12>memory.c(354): warning C4244: '=' : conversion from 'int' to 'BYTE', possible loss of data
12>memory.c(369): warning C4244: '=' : conversion from 'int' to 'BYTE', possible loss of data
12>memory.c(370): warning C4244: '=' : conversion from 'int' to 'BYTE', possible loss of data
12>memory.c(371): warning C4244: '=' : conversion from 'int' to 'BYTE', possible loss of data
12>memory.c(372): warning C4244: '=' : conversion from 'int' to 'BYTE', possible loss of data
12>memory.c(387): warning C4244: '=' : conversion from 'int' to 'BYTE', possible loss of data
12>memory.c(388): warning C4244: '=' : conversion from 'int' to 'BYTE', possible loss of data
12>memory.c(389): warning C4244: '=' : conversion from 'int' to 'BYTE', possible loss of data
12>memory.c(390): warning C4244: '=' : conversion from 'int' to 'BYTE', possible loss of data
12>memory.c(393): warning C4244: '=' : conversion from 'int' to 'BYTE', possible loss of data
12>memory.c(394): warning C4244: '=' : conversion from 'int' to 'BYTE', possible loss of data
12>memory.c(395): warning C4244: '=' : conversion from 'int' to 'BYTE', possible loss of data
12>memory.c(396): warning C4244: '=' : conversion from 'int' to 'BYTE', possible loss of data
12>memory.c(411): warning C4244: '=' : conversion from 'int' to 'BYTE', possible loss of data
12>memory.c(412): warning C4244: '=' : conversion from 'int' to 'BYTE', possible loss of data
12>memory.c(413): warning C4244: '=' : conversion from 'int' to 'BYTE', possible loss of data
12>memory.c(414): warning C4244: '=' : conversion from 'int' to 'BYTE', possible loss of data
12> Interpreter Ops.c
2> iconbndl.cpp
2> helpbase.cpp
12>c:\users\rj\project64\source\rsp\opcode.h(43): warning C4201: nonstandard extension used : nameless struct/union
12>c:\users\rj\project64\source\rsp\opcode.h(50): warning C4201: nonstandard extension used : nameless struct/union
12>c:\users\rj\project64\source\rsp\opcode.h(55): warning C4201: nonstandard extension used : nameless struct/union
12>c:\users\rj\project64\source\rsp\opcode.h(64): warning C4201: nonstandard extension used : nameless struct/union
12>c:\users\rj\project64\source\rsp\opcode.h(73): warning C4201: nonstandard extension used : nameless struct/union
12>c:\users\rj\project64\source\rsp\opcode.h(75): warning C4201: nonstandard extension used : nameless struct/union
12>c:\users\rj\project64\source\rsp\x86.h(256): warning C4201: nonstandard extension used : nameless struct/union
12>c:\users\rj\project64\source\rsp\x86.h(258): warning C4201: nonstandard extension used : nameless struct/union
12>Interpreter Ops.c(46): warning C4055: 'type cast' : from data pointer 'void *' to function pointer 'void (__cdecl *)()'
12>Interpreter Ops.c(50): warning C4055: 'type cast' : from data pointer 'void *' to function pointer 'void (__cdecl *)()'
12>Interpreter Ops.c(155): warning C4055: 'type cast' : from data pointer 'void *' to function pointer 'void (__cdecl *)()'
12>Interpreter Ops.c(159): warning C4055: 'type cast' : from data pointer 'void *' to function pointer 'void (__cdecl *)()'
12>Interpreter Ops.c(207): warning C4055: 'type cast' : from data pointer 'void *' to function pointer 'void (__cdecl *)()'
12>Interpreter Ops.c(211): warning C4055: 'type cast' : from data pointer 'void *' to function pointer 'void (__cdecl *)()'
12>Interpreter Ops.c(530): warning C4055: 'type cast' : from data pointer 'void *' to function pointer 'void (__cdecl *)()'
12> Interpreter CPU.c
2> headerctrlcmn.cpp
12>c:\users\rj\project64\source\rsp\opcode.h(43): warning C4201: nonstandard extension used : nameless struct/union
12>c:\users\rj\project64\source\rsp\opcode.h(50): warning C4201: nonstandard extension used : nameless struct/union
12>c:\users\rj\project64\source\rsp\opcode.h(55): warning C4201: nonstandard extension used : nameless struct/union
12>c:\users\rj\project64\source\rsp\opcode.h(64): warning C4201: nonstandard extension used : nameless struct/union
12>c:\users\rj\project64\source\rsp\opcode.h(73): warning C4201: nonstandard extension used : nameless struct/union
12>c:\users\rj\project64\source\rsp\opcode.h(75): warning C4201: nonstandard extension used : nameless struct/union
12>Interpreter CPU.c(44): warning C4152: nonstandard extension, function/data pointer conversion in expression
12>Interpreter CPU.c(45): warning C4152: nonstandard extension, function/data pointer conversion in expression
12>Interpreter CPU.c(46): warning C4152: nonstandard extension, function/data pointer conversion in expression
12>Interpreter CPU.c(47): warning C4152: nonstandard extension, function/data pointer conversion in expression
12>Interpreter CPU.c(48): warning C4152: nonstandard extension, function/data pointer conversion in expression
12>Interpreter CPU.c(49): warning C4152: nonstandard extension, function/data pointer conversion in expression
12>Interpreter CPU.c(50): warning C4152: nonstandard extension, function/data pointer conversion in expression
12>Interpreter CPU.c(51): warning C4152: nonstandard extension, function/data pointer conversion in expression
12>Interpreter CPU.c(52): warning C4152: nonstandard extension, function/data pointer conversion in expression
12>Interpreter CPU.c(53): warning C4152: nonstandard extension, function/data pointer conversion in expression
12>Interpreter CPU.c(54): warning C4152: nonstandard extension, function/data pointer conversion in expression
12>Interpreter CPU.c(55): warning C4152: nonstandard extension, function/data pointer conversion in expression
12>Interpreter CPU.c(56): warning C4152: nonstandard extension, function/data pointer conversion in expression
12>Interpreter CPU.c(57): warning C4152: nonstandard extension, function/data pointer conversion in expression
12>Interpreter CPU.c(58): warning C4152: nonstandard extension, function/data pointer conversion in expression
12>Interpreter CPU.c(59): warning C4152: nonstandard extension, function/data pointer conversion in expression
12>Interpreter CPU.c(60): warning C4152: nonstandard extension, function/data pointer conversion in expression
12>Interpreter CPU.c(61): warning C4152: nonstandard extension, function/data pointer conversion in expression
12>Interpreter CPU.c(62): warning C4152: nonstandard extension, function/data pointer conversion in expression
12>Interpreter CPU.c(63): warning C4152: nonstandard extension, function/data pointer conversion in expression
12>Interpreter CPU.c(64): warning C4152: nonstandard extension, function/data pointer conversion in expression
12>Interpreter CPU.c(65): warning C4152: nonstandard extension, function/data pointer conversion in expression
12>Interpreter CPU.c(66): warning C4152: nonstandard extension, function/data pointer conversion in expression
12>Interpreter CPU.c(67): warning C4152: nonstandard extension, function/data pointer conversion in expression
12>Interpreter CPU.c(68): warning C4152: nonstandard extension, function/data pointer conversion in expression
12>Interpreter CPU.c(69): warning C4152: nonstandard extension, function/data pointer conversion in expression
12>Interpreter CPU.c(70): warning C4152: nonstandard extension, function/data pointer conversion in expression
12>Interpreter CPU.c(71): warning C4152: nonstandard extension, function/data pointer conversion in expression
12>Interpreter CPU.c(72): warning C4152: nonstandard extension, function/data pointer conversion in expression
12>Interpreter CPU.c(73): warning C4152: nonstandard extension, function/data pointer conversion in expression
12>Interpreter CPU.c(74): warning C4152: nonstandard extension, function/data pointer conversion in expression
12>Interpreter CPU.c(75): warning C4152: nonstandard extension, function/data pointer conversion in expression
12>Interpreter CPU.c(76): warning C4152: nonstandard extension, function/data pointer conversion in expression
12>Interpreter CPU.c(77): warning C4152: nonstandard extension, function/data pointer conversion in expression
12>Interpreter CPU.c(78): warning C4152: nonstandard extension, function/data pointer conversion in expression
12>Interpreter CPU.c(79): warning C4152: nonstandard extension, function/data pointer conversion in expression
12>Interpreter CPU.c(80): warning C4152: nonstandard extension, function/data pointer conversion in expression
12>Interpreter CPU.c(81): warning C4152: nonstandard extension, function/data pointer conversion in expression
12>Interpreter CPU.c(82): warning C4152: nonstandard extension, function/data pointer conversion in expression
12>Interpreter CPU.c(83): warning C4152: nonstandard extension, function/data pointer conversion in expression
12>Interpreter CPU.c(84): warning C4152: nonstandard extension, function/data pointer conversion in expression
12>Interpreter CPU.c(85): warning C4152: nonstandard extension, function/data pointer conversion in expression
12>Interpreter CPU.c(86): warning C4152: nonstandard extension, function/data pointer conversion in expression
12>Interpreter CPU.c(87): warning C4152: nonstandard extension, function/data pointer conversion in expression
12>Interpreter CPU.c(88): warning C4152: nonstandard extension, function/data pointer conversion in expression
12>Interpreter CPU.c(89): warning C4152: nonstandard extension, function/data pointer conversion in expression
12>Interpreter CPU.c(90): warning C4152: nonstandard extension, function/data pointer conversion in expression
12>Interpreter CPU.c(91): warning C4152: nonstandard extension, function/data pointer conversion in expression
12>Interpreter CPU.c(92): warning C4152: nonstandard extension, function/data pointer conversion in expression
12>Interpreter CPU.c(93): warning C4152: nonstandard extension, function/data pointer conversion in expression
12>Interpreter CPU.c(94): warning C4152: nonstandard extension, function/data pointer conversion in expression
12>Interpreter CPU.c(95): warning C4152: nonstandard extension, function/data pointer conversion in expression
12>Interpreter CPU.c(96): warning C4152: nonstandard extension, function/data pointer conversion in expression
12>Interpreter CPU.c(97): warning C4152: nonstandard extension, function/data pointer conversion in expression
12>Interpreter CPU.c(98): warning C4152: nonstandard extension, function/data pointer conversion in expression
12>Interpreter CPU.c(99): warning C4152: nonstandard extension, function/data pointer conversion in expression
12>Interpreter CPU.c(100): warning C4152: nonstandard extension, function/data pointer conversion in expression
12>Interpreter CPU.c(101): warning C4152: nonstandard extension, function/data pointer conversion in expression
12>Interpreter CPU.c(102): warning C4152: nonstandard extension, function/data pointer conversion in expression
12>Interpreter CPU.c(103): warning C4152: nonstandard extension, function/data pointer conversion in expression
12>Interpreter CPU.c(104): warning C4152: nonstandard extension, function/data pointer conversion in expression
12>Interpreter CPU.c(105): warning C4152: nonstandard extension, function/data pointer conversion in expression
12>Interpreter CPU.c(106): warning C4152: nonstandard extension, function/data pointer conversion in expression
12>Interpreter CPU.c(107): warning C4152: nonstandard extension, function/data pointer conversion in expression
12>Interpreter CPU.c(109): warning C4152: nonstandard extension, function/data pointer conversion in expression
12>Interpreter CPU.c(110): warning C4152: nonstandard extension, function/data pointer conversion in expression
12>Interpreter CPU.c(111): warning C4152: nonstandard extension, function/data pointer conversion in expression
12>Interpreter CPU.c(112): warning C4152: nonstandard extension, function/data pointer conversion in expression
12>Interpreter CPU.c(113): warning C4152: nonstandard extension, function/data pointer conversion in expression
12>Interpreter CPU.c(114): warning C4152: nonstandard extension, function/data pointer conversion in expression
12>Interpreter CPU.c(115): warning C4152: nonstandard extension, function/data pointer conversion in expression
12>Interpreter CPU.c(116): warning C4152: nonstandard extension, function/data pointer conversion in expression
12>Interpreter CPU.c(117): warning C4152: nonstandard extension, function/data pointer conversion in expression
12>Interpreter CPU.c(118): warning C4152: nonstandard extension, function/data pointer conversion in expression
12>Interpreter CPU.c(119): warning C4152: nonstandard extension, function/data pointer conversion in expression
12>Interpreter CPU.c(120): warning C4152: nonstandard extension, function/data pointer conversion in expression
12>Interpreter CPU.c(121): warning C4152: nonstandard extension, function/data pointer conversion in expression
12>Interpreter CPU.c(122): warning C4152: nonstandard extension, function/data pointer conversion in expression
12>Interpreter CPU.c(123): warning C4152: nonstandard extension, function/data pointer conversion in expression
12>Interpreter CPU.c(124): warning C4152: nonstandard extension, function/data pointer conversion in expression
12>Interpreter CPU.c(125): warning C4152: nonstandard extension, function/data pointer conversion in expression
12>Interpreter CPU.c(126): warning C4152: nonstandard extension, function/data pointer conversion in expression
12>Interpreter CPU.c(127): warning C4152: nonstandard extension, function/data pointer conversion in expression
12>Interpreter CPU.c(128): warning C4152: nonstandard extension, function/data pointer conversion in expression
12>Interpreter CPU.c(129): warning C4152: nonstandard extension, function/data pointer conversion in expression
12>Interpreter CPU.c(130): warning C4152: nonstandard extension, function/data pointer conversion in expression
12>Interpreter CPU.c(131): warning C4152: nonstandard extension, function/data pointer conversion in expression
12>Interpreter CPU.c(132): warning C4152: nonstandard extension, function/data pointer conversion in expression
12>Interpreter CPU.c(133): warning C4152: nonstandard extension, function/data pointer conversion in expression
12>Interpreter CPU.c(134): warning C4152: nonstandard extension, function/data pointer conversion in expression
12>Interpreter CPU.c(135): warning C4152: nonstandard extension, function/data pointer conversion in expression
12>Interpreter CPU.c(136): warning C4152: nonstandard extension, function/data pointer conversion in expression
12>Interpreter CPU.c(137): warning C4152: nonstandard extension, function/data pointer conversion in expression
12>Interpreter CPU.c(138): warning C4152: nonstandard extension, function/data pointer conversion in expression
12>Interpreter CPU.c(139): warning C4152: nonstandard extension, function/data pointer conversion in expression
12>Interpreter CPU.c(140): warning C4152: nonstandard extension, function/data pointer conversion in expression
12>Interpreter CPU.c(141): warning C4152: nonstandard extension, function/data pointer conversion in expression
12>Interpreter CPU.c(142): warning C4152: nonstandard extension, function/data pointer conversion in expression
12>Interpreter CPU.c(143): warning C4152: nonstandard extension, function/data pointer conversion in expression
12>Interpreter CPU.c(144): warning C4152: nonstandard extension, function/data pointer conversion in expression
12>Interpreter CPU.c(145): warning C4152: nonstandard extension, function/data pointer conversion in expression
12>Interpreter CPU.c(146): warning C4152: nonstandard extension, function/data pointer conversion in expression
12>Interpreter CPU.c(147): warning C4152: nonstandard extension, function/data pointer conversion in expression
12>Interpreter CPU.c(148): warning C4152: nonstandard extension, function/data pointer conversion in expression
12>Interpreter CPU.c(149): warning C4152: nonstandard extension, function/data pointer conversion in expression
12>Interpreter CPU.c(150): warning C4152: nonstandard extension, function/data pointer conversion in expression
12>Interpreter CPU.c(151): warning C4152: nonstandard extension, function/data pointer conversion in expression
12>Interpreter CPU.c(152): warning C4152: nonstandard extension, function/data pointer conversion in expression
12>Interpreter CPU.c(153): warning C4152: nonstandard extension, function/data pointer conversion in expression
12>Interpreter CPU.c(154): warning C4152: nonstandard extension, function/data pointer conversion in expression
12>Interpreter CPU.c(155): warning C4152: nonstandard extension, function/data pointer conversion in expression
12>Interpreter CPU.c(156): warning C4152: nonstandard extension, function/data pointer conversion in expression
12>Interpreter CPU.c(157): warning C4152: nonstandard extension, function/data pointer conversion in expression
12>Interpreter CPU.c(158): warning C4152: nonstandard extension, function/data pointer conversion in expression
12>Interpreter CPU.c(159): warning C4152: nonstandard extension, function/data pointer conversion in expression
12>Interpreter CPU.c(160): warning C4152: nonstandard extension, function/data pointer conversion in expression
12>Interpreter CPU.c(161): warning C4152: nonstandard extension, function/data pointer conversion in expression
12>Interpreter CPU.c(162): warning C4152: nonstandard extension, function/data pointer conversion in expression
12>Interpreter CPU.c(163): warning C4152: nonstandard extension, function/data pointer conversion in expression
12>Interpreter CPU.c(164): warning C4152: nonstandard extension, function/data pointer conversion in expression
12>Interpreter CPU.c(165): warning C4152: nonstandard extension, function/data pointer conversion in expression
12>Interpreter CPU.c(166): warning C4152: nonstandard extension, function/data pointer conversion in expression
12>Interpreter CPU.c(167): warning C4152: nonstandard extension, function/data pointer conversion in expression
12>Interpreter CPU.c(168): warning C4152: nonstandard extension, function/data pointer conversion in expression
12>Interpreter CPU.c(169): warning C4152: nonstandard extension, function/data pointer conversion in expression
12>Interpreter CPU.c(170): warning C4152: nonstandard extension, function/data pointer conversion in expression
12>Interpreter CPU.c(171): warning C4152: nonstandard extension, function/data pointer conversion in expression
12>Interpreter CPU.c(172): warning C4152: nonstandard extension, function/data pointer conversion in expression
12>Interpreter CPU.c(174): warning C4152: nonstandard extension, function/data pointer conversion in expression
12>Interpreter CPU.c(175): warning C4152: nonstandard extension, function/data pointer conversion in expression
12>Interpreter CPU.c(176): warning C4152: nonstandard extension, function/data pointer conversion in expression
12>Interpreter CPU.c(177): warning C4152: nonstandard extension, function/data pointer conversion in expression
12>Interpreter CPU.c(178): warning C4152: nonstandard extension, function/data pointer conversion in expression
12>Interpreter CPU.c(179): warning C4152: nonstandard extension, function/data pointer conversion in expression
12>Interpreter CPU.c(180): warning C4152: nonstandard extension, function/data pointer conversion in expression
12>Interpreter CPU.c(181): warning C4152: nonstandard extension, function/data pointer conversion in expression
12>Interpreter CPU.c(182): warning C4152: nonstandard extension, function/data pointer conversion in expression
12>Interpreter CPU.c(183): warning C4152: nonstandard extension, function/data pointer conversion in expression
12>Interpreter CPU.c(184): warning C4152: nonstandard extension, function/data pointer conversion in expression
12>Interpreter CPU.c(185): warning C4152: nonstandard extension, function/data pointer conversion in expression
12>Interpreter CPU.c(186): warning C4152: nonstandard extension, function/data pointer conversion in expression
12>Interpreter CPU.c(187): warning C4152: nonstandard extension, function/data pointer conversion in expression
12>Interpreter CPU.c(188): warning C4152: nonstandard extension, function/data pointer conversion in expression
12>Interpreter CPU.c(189): warning C4152: nonstandard extension, function/data pointer conversion in expression
12>Interpreter CPU.c(190): warning C4152: nonstandard extension, function/data pointer conversion in expression
12>Interpreter CPU.c(191): warning C4152: nonstandard extension, function/data pointer conversion in expression
12>Interpreter CPU.c(192): warning C4152: nonstandard extension, function/data pointer conversion in expression
12>Interpreter CPU.c(193): warning C4152: nonstandard extension, function/data pointer conversion in expression
12>Interpreter CPU.c(194): warning C4152: nonstandard extension, function/data pointer conversion in expression
12>Interpreter CPU.c(195): warning C4152: nonstandard extension, function/data pointer conversion in expression
12>Interpreter CPU.c(196): warning C4152: nonstandard extension, function/data pointer conversion in expression
12>Interpreter CPU.c(197): warning C4152: nonstandard extension, function/data pointer conversion in expression
12>Interpreter CPU.c(198): warning C4152: nonstandard extension, function/data pointer conversion in expression
12>Interpreter CPU.c(199): warning C4152: nonstandard extension, function/data pointer conversion in expression
12>Interpreter CPU.c(200): warning C4152: nonstandard extension, function/data pointer conversion in expression
12>Interpreter CPU.c(201): warning C4152: nonstandard extension, function/data pointer conversion in expression
12>Interpreter CPU.c(202): warning C4152: nonstandard extension, function/data pointer conversion in expression
12>Interpreter CPU.c(203): warning C4152: nonstandard extension, function/data pointer conversion in expression
12>Interpreter CPU.c(204): warning C4152: nonstandard extension, function/data pointer conversion in expression
12>Interpreter CPU.c(205): warning C4152: nonstandard extension, function/data pointer conversion in expression
12>Interpreter CPU.c(207): warning C4152: nonstandard extension, function/data pointer conversion in expression
12>Interpreter CPU.c(208): warning C4152: nonstandard extension, function/data pointer conversion in expression
12>Interpreter CPU.c(209): warning C4152: nonstandard extension, function/data pointer conversion in expression
12>Interpreter CPU.c(210): warning C4152: nonstandard extension, function/data pointer conversion in expression
12>Interpreter CPU.c(211): warning C4152: nonstandard extension, function/data pointer conversion in expression
12>Interpreter CPU.c(212): warning C4152: nonstandard extension, function/data pointer conversion in expression
12>Interpreter CPU.c(213): warning C4152: nonstandard extension, function/data pointer conversion in expression
12>Interpreter CPU.c(214): warning C4152: nonstandard extension, function/data pointer conversion in expression
12>Interpreter CPU.c(215): warning C4152: nonstandard extension, function/data pointer conversion in expression
12>Interpreter CPU.c(216): warning C4152: nonstandard extension, function/data pointer conversion in expression
12>Interpreter CPU.c(217): warning C4152: nonstandard extension, function/data pointer conversion in expression
12>Interpreter CPU.c(218): warning C4152: nonstandard extension, function/data pointer conversion in expression
12>Interpreter CPU.c(219): warning C4152: nonstandard extension, function/data pointer conversion in expression
12>Interpreter CPU.c(220): warning C4152: nonstandard extension, function/data pointer conversion in expression
12>Interpreter CPU.c(221): warning C4152: nonstandard extension, function/data pointer conversion in expression
12>Interpreter CPU.c(222): warning C4152: nonstandard extension, function/data pointer conversion in expression
12>Interpreter CPU.c(223): warning C4152: nonstandard extension, function/data pointer conversion in expression
12>Interpreter CPU.c(224): warning C4152: nonstandard extension, function/data pointer conversion in expression
12>Interpreter CPU.c(225): warning C4152: nonstandard extension, function/data pointer conversion in expression
12>Interpreter CPU.c(226): warning C4152: nonstandard extension, function/data pointer conversion in expression
12>Interpreter CPU.c(227): warning C4152: nonstandard extension, function/data pointer conversion in expression
12>Interpreter CPU.c(228): warning C4152: nonstandard extension, function/data pointer conversion in expression
12>Interpreter CPU.c(229): warning C4152: nonstandard extension, function/data pointer conversion in expression
12>Interpreter CPU.c(230): warning C4152: nonstandard extension, function/data pointer conversion in expression
12>Interpreter CPU.c(231): warning C4152: nonstandard extension, function/data pointer conversion in expression
12>Interpreter CPU.c(232): warning C4152: nonstandard extension, function/data pointer conversion in expression
12>Interpreter CPU.c(233): warning C4152: nonstandard extension, function/data pointer conversion in expression
12>Interpreter CPU.c(234): warning C4152: nonstandard extension, function/data pointer conversion in expression
12>Interpreter CPU.c(235): warning C4152: nonstandard extension, function/data pointer conversion in expression
12>Interpreter CPU.c(236): warning C4152: nonstandard extension, function/data pointer conversion in expression
12>Interpreter CPU.c(237): warning C4152: nonstandard extension, function/data pointer conversion in expression
12>Interpreter CPU.c(238): warning C4152: nonstandard extension, function/data pointer conversion in expression
12>Interpreter CPU.c(240): warning C4152: nonstandard extension, function/data pointer conversion in expression
12>Interpreter CPU.c(241): warning C4152: nonstandard extension, function/data pointer conversion in expression
12>Interpreter CPU.c(242): warning C4152: nonstandard extension, function/data pointer conversion in expression
12>Interpreter CPU.c(243): warning C4152: nonstandard extension, function/data pointer conversion in expression
12>Interpreter CPU.c(244): warning C4152: nonstandard extension, function/data pointer conversion in expression
12>Interpreter CPU.c(245): warning C4152: nonstandard extension, function/data pointer conversion in expression
12>Interpreter CPU.c(246): warning C4152: nonstandard extension, function/data pointer conversion in expression
12>Interpreter CPU.c(247): warning C4152: nonstandard extension, function/data pointer conversion in expression
12>Interpreter CPU.c(248): warning C4152: nonstandard extension, function/data pointer conversion in expression
12>Interpreter CPU.c(249): warning C4152: nonstandard extension, function/data pointer conversion in expression
12>Interpreter CPU.c(250): warning C4152: nonstandard extension, function/data pointer conversion in expression
12>Interpreter CPU.c(251): warning C4152: nonstandard extension, function/data pointer conversion in expression
12>Interpreter CPU.c(252): warning C4152: nonstandard extension, function/data pointer conversion in expression
12>Interpreter CPU.c(253): warning C4152: nonstandard extension, function/data pointer conversion in expression
12>Interpreter CPU.c(254): warning C4152: nonstandard extension, function/data pointer conversion in expression
12>Interpreter CPU.c(255): warning C4152: nonstandard extension, function/data pointer conversion in expression
12>Interpreter CPU.c(256): warning C4152: nonstandard extension, function/data pointer conversion in expression
12>Interpreter CPU.c(257): warning C4152: nonstandard extension, function/data pointer conversion in expression
12>Interpreter CPU.c(258): warning C4152: nonstandard extension, function/data pointer conversion in expression
12>Interpreter CPU.c(259): warning C4152: nonstandard extension, function/data pointer conversion in expression
12>Interpreter CPU.c(260): warning C4152: nonstandard extension, function/data pointer conversion in expression
12>Interpreter CPU.c(261): warning C4152: nonstandard extension, function/data pointer conversion in expression
12>Interpreter CPU.c(262): warning C4152: nonstandard extension, function/data pointer conversion in expression
12>Interpreter CPU.c(263): warning C4152: nonstandard extension, function/data pointer conversion in expression
12>Interpreter CPU.c(264): warning C4152: nonstandard extension, function/data pointer conversion in expression
12>Interpreter CPU.c(265): warning C4152: nonstandard extension, function/data pointer conversion in expression
12>Interpreter CPU.c(266): warning C4152: nonstandard extension, function/data pointer conversion in expression
12>Interpreter CPU.c(267): warning C4152: nonstandard extension, function/data pointer conversion in expression
12>Interpreter CPU.c(268): warning C4152: nonstandard extension, function/data pointer conversion in expression
12>Interpreter CPU.c(269): warning C4152: nonstandard extension, function/data pointer conversion in expression
12>Interpreter CPU.c(270): warning C4152: nonstandard extension, function/data pointer conversion in expression
12>Interpreter CPU.c(271): warning C4152: nonstandard extension, function/data pointer conversion in expression
12>Interpreter CPU.c(273): warning C4152: nonstandard extension, function/data pointer conversion in expression
12>Interpreter CPU.c(274): warning C4152: nonstandard extension, function/data pointer conversion in expression
12>Interpreter CPU.c(275): warning C4152: nonstandard extension, function/data pointer conversion in expression
12>Interpreter CPU.c(276): warning C4152: nonstandard extension, function/data pointer conversion in expression
12>Interpreter CPU.c(277): warning C4152: nonstandard extension, function/data pointer conversion in expression
12>Interpreter CPU.c(278): warning C4152: nonstandard extension, function/data pointer conversion in expression
12>Interpreter CPU.c(279): warning C4152: nonstandard extension, function/data pointer conversion in expression
12>Interpreter CPU.c(280): warning C4152: nonstandard extension, function/data pointer conversion in expression
12>Interpreter CPU.c(281): warning C4152: nonstandard extension, function/data pointer conversion in expression
12>Interpreter CPU.c(282): warning C4152: nonstandard extension, function/data pointer conversion in expression
12>Interpreter CPU.c(283): warning C4152: nonstandard extension, function/data pointer conversion in expression
12>Interpreter CPU.c(284): warning C4152: nonstandard extension, function/data pointer conversion in expression
12>Interpreter CPU.c(285): warning C4152: nonstandard extension, function/data pointer conversion in expression
12>Interpreter CPU.c(286): warning C4152: nonstandard extension, function/data pointer conversion in expression
12>Interpreter CPU.c(287): warning C4152: nonstandard extension, function/data pointer conversion in expression
12>Interpreter CPU.c(288): warning C4152: nonstandard extension, function/data pointer conversion in expression
12>Interpreter CPU.c(289): warning C4152: nonstandard extension, function/data pointer conversion in expression
12>Interpreter CPU.c(290): warning C4152: nonstandard extension, function/data pointer conversion in expression
12>Interpreter CPU.c(291): warning C4152: nonstandard extension, function/data pointer conversion in expression
12>Interpreter CPU.c(292): warning C4152: nonstandard extension, function/data pointer conversion in expression
12>Interpreter CPU.c(293): warning C4152: nonstandard extension, function/data pointer conversion in expression
12>Interpreter CPU.c(294): warning C4152: nonstandard extension, function/data pointer conversion in expression
12>Interpreter CPU.c(295): warning C4152: nonstandard extension, function/data pointer conversion in expression
12>Interpreter CPU.c(296): warning C4152: nonstandard extension, function/data pointer conversion in expression
12>Interpreter CPU.c(297): warning C4152: nonstandard extension, function/data pointer conversion in expression
12>Interpreter CPU.c(298): warning C4152: nonstandard extension, function/data pointer conversion in expression
12>Interpreter CPU.c(299): warning C4152: nonstandard extension, function/data pointer conversion in expression
12>Interpreter CPU.c(300): warning C4152: nonstandard extension, function/data pointer conversion in expression
12>Interpreter CPU.c(301): warning C4152: nonstandard extension, function/data pointer conversion in expression
12>Interpreter CPU.c(302): warning C4152: nonstandard extension, function/data pointer conversion in expression
12>Interpreter CPU.c(303): warning C4152: nonstandard extension, function/data pointer conversion in expression
12>Interpreter CPU.c(304): warning C4152: nonstandard extension, function/data pointer conversion in expression
12>Interpreter CPU.c(305): warning C4152: nonstandard extension, function/data pointer conversion in expression
12>Interpreter CPU.c(306): warning C4152: nonstandard extension, function/data pointer conversion in expression
12>Interpreter CPU.c(307): warning C4152: nonstandard extension, function/data pointer conversion in expression
12>Interpreter CPU.c(308): warning C4152: nonstandard extension, function/data pointer conversion in expression
12>Interpreter CPU.c(309): warning C4152: nonstandard extension, function/data pointer conversion in expression
12>Interpreter CPU.c(310): warning C4152: nonstandard extension, function/data pointer conversion in expression
12>Interpreter CPU.c(311): warning C4152: nonstandard extension, function/data pointer conversion in expression
12>Interpreter CPU.c(312): warning C4152: nonstandard extension, function/data pointer conversion in expression
12>Interpreter CPU.c(313): warning C4152: nonstandard extension, function/data pointer conversion in expression
12>Interpreter CPU.c(314): warning C4152: nonstandard extension, function/data pointer conversion in expression
12>Interpreter CPU.c(315): warning C4152: nonstandard extension, function/data pointer conversion in expression
12>Interpreter CPU.c(316): warning C4152: nonstandard extension, function/data pointer conversion in expression
12>Interpreter CPU.c(317): warning C4152: nonstandard extension, function/data pointer conversion in expression
12>Interpreter CPU.c(318): warning C4152: nonstandard extension, function/data pointer conversion in expression
12>Interpreter CPU.c(319): warning C4152: nonstandard extension, function/data pointer conversion in expression
12>Interpreter CPU.c(320): warning C4152: nonstandard extension, function/data pointer conversion in expression
12>Interpreter CPU.c(321): warning C4152: nonstandard extension, function/data pointer conversion in expression
12>Interpreter CPU.c(322): warning C4152: nonstandard extension, function/data pointer conversion in expression
12>Interpreter CPU.c(323): warning C4152: nonstandard extension, function/data pointer conversion in expression
12>Interpreter CPU.c(324): warning C4152: nonstandard extension, function/data pointer conversion in expression
12>Interpreter CPU.c(325): warning C4152: nonstandard extension, function/data pointer conversion in expression
12>Interpreter CPU.c(326): warning C4152: nonstandard extension, function/data pointer conversion in expression
12>Interpreter CPU.c(327): warning C4152: nonstandard extension, function/data pointer conversion in expression
12>Interpreter CPU.c(328): warning C4152: nonstandard extension, function/data pointer conversion in expression
12>Interpreter CPU.c(329): warning C4152: nonstandard extension, function/data pointer conversion in expression
12>Interpreter CPU.c(330): warning C4152: nonstandard extension, function/data pointer conversion in expression
12>Interpreter CPU.c(331): warning C4152: nonstandard extension, function/data pointer conversion in expression
12>Interpreter CPU.c(332): warning C4152: nonstandard extension, function/data pointer conversion in expression
12>Interpreter CPU.c(333): warning C4152: nonstandard extension, function/data pointer conversion in expression
12>Interpreter CPU.c(334): warning C4152: nonstandard extension, function/data pointer conversion in expression
12>Interpreter CPU.c(335): warning C4152: nonstandard extension, function/data pointer conversion in expression
12>Interpreter CPU.c(336): warning C4152: nonstandard extension, function/data pointer conversion in expression
12>Interpreter CPU.c(338): warning C4152: nonstandard extension, function/data pointer conversion in expression
12>Interpreter CPU.c(339): warning C4152: nonstandard extension, function/data pointer conversion in expression
12>Interpreter CPU.c(340): warning C4152: nonstandard extension, function/data pointer conversion in expression
12>Interpreter CPU.c(341): warning C4152: nonstandard extension, function/data pointer conversion in expression
12>Interpreter CPU.c(342): warning C4152: nonstandard extension, function/data pointer conversion in expression
12>Interpreter CPU.c(343): warning C4152: nonstandard extension, function/data pointer conversion in expression
12>Interpreter CPU.c(344): warning C4152: nonstandard extension, function/data pointer conversion in expression
12>Interpreter CPU.c(345): warning C4152: nonstandard extension, function/data pointer conversion in expression
12>Interpreter CPU.c(346): warning C4152: nonstandard extension, function/data pointer conversion in expression
12>Interpreter CPU.c(347): warning C4152: nonstandard extension, function/data pointer conversion in expression
12>Interpreter CPU.c(348): warning C4152: nonstandard extension, function/data pointer conversion in expression
12>Interpreter CPU.c(349): warning C4152: nonstandard extension, function/data pointer conversion in expression
12>Interpreter CPU.c(350): warning C4152: nonstandard extension, function/data pointer conversion in expression
12>Interpreter CPU.c(351): warning C4152: nonstandard extension, function/data pointer conversion in expression
12>Interpreter CPU.c(352): warning C4152: nonstandard extension, function/data pointer conversion in expression
12>Interpreter CPU.c(353): warning C4152: nonstandard extension, function/data pointer conversion in expression
12>Interpreter CPU.c(354): warning C4152: nonstandard extension, function/data pointer conversion in expression
12>Interpreter CPU.c(355): warning C4152: nonstandard extension, function/data pointer conversion in expression
12>Interpreter CPU.c(356): warning C4152: nonstandard extension, function/data pointer conversion in expression
12>Interpreter CPU.c(357): warning C4152: nonstandard extension, function/data pointer conversion in expression
12>Interpreter CPU.c(358): warning C4152: nonstandard extension, function/data pointer conversion in expression
12>Interpreter CPU.c(359): warning C4152: nonstandard extension, function/data pointer conversion in expression
12>Interpreter CPU.c(360): warning C4152: nonstandard extension, function/data pointer conversion in expression
12>Interpreter CPU.c(361): warning C4152: nonstandard extension, function/data pointer conversion in expression
12>Interpreter CPU.c(362): warning C4152: nonstandard extension, function/data pointer conversion in expression
12>Interpreter CPU.c(363): warning C4152: nonstandard extension, function/data pointer conversion in expression
12>Interpreter CPU.c(364): warning C4152: nonstandard extension, function/data pointer conversion in expression
12>Interpreter CPU.c(365): warning C4152: nonstandard extension, function/data pointer conversion in expression
12>Interpreter CPU.c(366): warning C4152: nonstandard extension, function/data pointer conversion in expression
12>Interpreter CPU.c(367): warning C4152: nonstandard extension, function/data pointer conversion in expression
12>Interpreter CPU.c(368): warning C4152: nonstandard extension, function/data pointer conversion in expression
12>Interpreter CPU.c(369): warning C4152: nonstandard extension, function/data pointer conversion in expression
12>Interpreter CPU.c(371): warning C4152: nonstandard extension, function/data pointer conversion in expression
12>Interpreter CPU.c(372): warning C4152: nonstandard extension, function/data pointer conversion in expression
12>Interpreter CPU.c(373): warning C4152: nonstandard extension, function/data pointer conversion in expression
12>Interpreter CPU.c(374): warning C4152: nonstandard extension, function/data pointer conversion in expression
12>Interpreter CPU.c(375): warning C4152: nonstandard extension, function/data pointer conversion in expression
12>Interpreter CPU.c(376): warning C4152: nonstandard extension, function/data pointer conversion in expression
12>Interpreter CPU.c(377): warning C4152: nonstandard extension, function/data pointer conversion in expression
12>Interpreter CPU.c(378): warning C4152: nonstandard extension, function/data pointer conversion in expression
12>Interpreter CPU.c(379): warning C4152: nonstandard extension, function/data pointer conversion in expression
12>Interpreter CPU.c(380): warning C4152: nonstandard extension, function/data pointer conversion in expression
12>Interpreter CPU.c(381): warning C4152: nonstandard extension, function/data pointer conversion in expression
12>Interpreter CPU.c(382): warning C4152: nonstandard extension, function/data pointer conversion in expression
12>Interpreter CPU.c(383): warning C4152: nonstandard extension, function/data pointer conversion in expression
12>Interpreter CPU.c(384): warning C4152: nonstandard extension, function/data pointer conversion in expression
12>Interpreter CPU.c(385): warning C4152: nonstandard extension, function/data pointer conversion in expression
12>Interpreter CPU.c(386): warning C4152: nonstandard extension, function/data pointer conversion in expression
12>Interpreter CPU.c(387): warning C4152: nonstandard extension, function/data pointer conversion in expression
12>Interpreter CPU.c(388): warning C4152: nonstandard extension, function/data pointer conversion in expression
12>Interpreter CPU.c(389): warning C4152: nonstandard extension, function/data pointer conversion in expression
12>Interpreter CPU.c(390): warning C4152: nonstandard extension, function/data pointer conversion in expression
12>Interpreter CPU.c(391): warning C4152: nonstandard extension, function/data pointer conversion in expression
12>Interpreter CPU.c(392): warning C4152: nonstandard extension, function/data pointer conversion in expression
12>Interpreter CPU.c(393): warning C4152: nonstandard extension, function/data pointer conversion in expression
12>Interpreter CPU.c(394): warning C4152: nonstandard extension, function/data pointer conversion in expression
12>Interpreter CPU.c(395): warning C4152: nonstandard extension, function/data pointer conversion in expression
12>Interpreter CPU.c(396): warning C4152: nonstandard extension, function/data pointer conversion in expression
12>Interpreter CPU.c(397): warning C4152: nonstandard extension, function/data pointer conversion in expression
12>Interpreter CPU.c(398): warning C4152: nonstandard extension, function/data pointer conversion in expression
12>Interpreter CPU.c(399): warning C4152: nonstandard extension, function/data pointer conversion in expression
12>Interpreter CPU.c(400): warning C4152: nonstandard extension, function/data pointer conversion in expression
12>Interpreter CPU.c(401): warning C4152: nonstandard extension, function/data pointer conversion in expression
12>Interpreter CPU.c(402): warning C4152: nonstandard extension, function/data pointer conversion in expression
12>Interpreter CPU.c(446): warning C4055: 'type cast' : from data pointer 'void *' to function pointer 'void (__cdecl *)()'
12> dma.c
2> headercolcmn.cpp
2> graphcmn.cpp
12> Cpu.c
12>c:\users\rj\project64\source\rsp\opcode.h(43): warning C4201: nonstandard extension used : nameless struct/union
12>c:\users\rj\project64\source\rsp\opcode.h(50): warning C4201: nonstandard extension used : nameless struct/union
12>c:\users\rj\project64\source\rsp\opcode.h(55): warning C4201: nonstandard extension used : nameless struct/union
12>c:\users\rj\project64\source\rsp\opcode.h(64): warning C4201: nonstandard extension used : nameless struct/union
12>c:\users\rj\project64\source\rsp\opcode.h(73): warning C4201: nonstandard extension used : nameless struct/union
12>c:\users\rj\project64\source\rsp\opcode.h(75): warning C4201: nonstandard extension used : nameless struct/union
12>c:\users\rj\project64\source\rsp\x86.h(256): warning C4201: nonstandard extension used : nameless struct/union
12>c:\users\rj\project64\source\rsp\x86.h(258): warning C4201: nonstandard extension used : nameless struct/union
12>Cpu.c(238): warning C4245: 'function' : conversion from 'int' to 'DWORD', signed/unsigned mismatch
12>Cpu.c(260): warning C4245: 'function' : conversion from 'int' to 'DWORD', signed/unsigned mismatch
12> breakpoint.c
2> gifdecod.cpp
2> geometry.cpp
12>c:\users\rj\project64\source\rsp\opcode.h(43): warning C4201: nonstandard extension used : nameless struct/union
12>c:\users\rj\project64\source\rsp\opcode.h(50): warning C4201: nonstandard extension used : nameless struct/union
12>c:\users\rj\project64\source\rsp\opcode.h(55): warning C4201: nonstandard extension used : nameless struct/union
12>c:\users\rj\project64\source\rsp\opcode.h(64): warning C4201: nonstandard extension used : nameless struct/union
12>c:\users\rj\project64\source\rsp\opcode.h(73): warning C4201: nonstandard extension used : nameless struct/union
12>c:\users\rj\project64\source\rsp\opcode.h(75): warning C4201: nonstandard extension used : nameless struct/union
12>breakpoint.c(92): warning C4100: 'rcBox' : unreferenced formal parameter
12> Generating Code...
2> gdicmn.cpp
12>c:\users\rj\project64\source\rsp\interpreter ops.c(561): warning C4701: potentially uninitialized local variable 'result' used
12>c:\users\rj\project64\source\rsp\interpreter ops.c(581): warning C4701: potentially uninitialized local variable 'result' used
12>c:\users\rj\project64\source\rsp\interpreter ops.c(598): warning C4701: potentially uninitialized local variable 'result' used
12>c:\users\rj\project64\source\rsp\interpreter ops.c(620): warning C4701: potentially uninitialized local variable 'result' used
12>c:\users\rj\project64\source\rsp\interpreter ops.c(642): warning C4701: potentially uninitialized local variable 'result' used
12>c:\users\rj\project64\source\rsp\interpreter ops.c(677): warning C4701: potentially uninitialized local variable 'result' used
12>c:\users\rj\project64\source\rsp\interpreter ops.c(722): warning C4701: potentially uninitialized local variable 'result' used
12>c:\users\rj\project64\source\rsp\interpreter ops.c(756): warning C4701: potentially uninitialized local variable 'result' used
12>c:\users\rj\project64\source\rsp\interpreter ops.c(800): warning C4701: potentially uninitialized local variable 'result' used
12>c:\users\rj\project64\source\rsp\interpreter ops.c(840): warning C4701: potentially uninitialized local variable 'result' used
12>c:\users\rj\project64\source\rsp\interpreter ops.c(884): warning C4701: potentially uninitialized local variable 'result' used
12>c:\users\rj\project64\source\rsp\interpreter ops.c(927): warning C4701: potentially uninitialized local variable 'result' used
12>c:\users\rj\project64\source\rsp\interpreter ops.c(961): warning C4701: potentially uninitialized local variable 'result' used
12>c:\users\rj\project64\source\rsp\interpreter ops.c(990): warning C4701: potentially uninitialized local variable 'result' used
12>c:\users\rj\project64\source\rsp\interpreter ops.c(1021): warning C4701: potentially uninitialized local variable 'result' used
12>c:\users\rj\project64\source\rsp\interpreter ops.c(1045): warning C4701: potentially uninitialized local variable 'result' used
12>c:\users\rj\project64\source\rsp\interpreter ops.c(1065): warning C4701: potentially uninitialized local variable 'result' used
12>c:\users\rj\project64\source\rsp\interpreter ops.c(1088): warning C4701: potentially uninitialized local variable 'result' used
12>c:\users\rj\project64\source\rsp\interpreter ops.c(1158): warning C4701: potentially uninitialized local variable 'result' used
12>c:\users\rj\project64\source\rsp\interpreter ops.c(1179): warning C4701: potentially uninitialized local variable 'result' used
12>c:\users\rj\project64\source\rsp\interpreter ops.c(1202): warning C4701: potentially uninitialized local variable 'result' used
12>c:\users\rj\project64\source\rsp\interpreter ops.c(1231): warning C4701: potentially uninitialized local variable 'result' used
12>c:\users\rj\project64\source\rsp\interpreter ops.c(1289): warning C4701: potentially uninitialized local variable 'result' used
12>c:\users\rj\project64\source\rsp\interpreter ops.c(1342): warning C4701: potentially uninitialized local variable 'result' used
12>c:\users\rj\project64\source\rsp\interpreter ops.c(1379): warning C4701: potentially uninitialized local variable 'result' used
12>c:\users\rj\project64\source\rsp\interpreter ops.c(1397): warning C4701: potentially uninitialized local variable 'result' used
12>c:\users\rj\project64\source\rsp\interpreter ops.c(1410): warning C4701: potentially uninitialized local variable 'result' used
12>c:\users\rj\project64\source\rsp\interpreter ops.c(1423): warning C4701: potentially uninitialized local variable 'result' used
12>c:\users\rj\project64\source\rsp\interpreter ops.c(1436): warning C4701: potentially uninitialized local variable 'result' used
12>c:\users\rj\project64\source\rsp\interpreter ops.c(1449): warning C4701: potentially uninitialized local variable 'result' used
12>c:\users\rj\project64\source\rsp\interpreter ops.c(1462): warning C4701: potentially uninitialized local variable 'result' used
12>c:\users\rj\project64\source\rsp\interpreter ops.c(1475): warning C4701: potentially uninitialized local variable 'result' used
12>c:\users\rj\project64\source\rsp\mmx.c(98): warning C4701: potentially uninitialized local variable 'x86Command' used
12>c:\users\rj\project64\source\rsp\mmx.c(119): warning C4701: potentially uninitialized local variable 'x86Command' used
12>c:\users\rj\project64\source\rsp\mmx.c(139): warning C4701: potentially uninitialized local variable 'x86Command' used
12>c:\users\rj\project64\source\rsp\mmx.c(169): warning C4701: potentially uninitialized local variable 'x86Command' used
12>c:\users\rj\project64\source\rsp\mmx.c(189): warning C4701: potentially uninitialized local variable 'x86Command' used
12>c:\users\rj\project64\source\rsp\mmx.c(219): warning C4701: potentially uninitialized local variable 'x86Command' used
12>c:\users\rj\project64\source\rsp\mmx.c(239): warning C4701: potentially uninitialized local variable 'x86Command' used
12>c:\users\rj\project64\source\rsp\mmx.c(268): warning C4701: potentially uninitialized local variable 'x86Command' used
12>c:\users\rj\project64\source\rsp\mmx.c(298): warning C4701: potentially uninitialized local variable 'x86Command' used
12>c:\users\rj\project64\source\rsp\mmx.c(319): warning C4701: potentially uninitialized local variable 'x86Command' used
12>c:\users\rj\project64\source\rsp\mmx.c(348): warning C4701: potentially uninitialized local variable 'x86Command' used
12>c:\users\rj\project64\source\rsp\mmx.c(377): warning C4701: potentially uninitialized local variable 'x86Command' used
12>c:\users\rj\project64\source\rsp\mmx.c(397): warning C4701: potentially uninitialized local variable 'x86Command' used
12>c:\users\rj\project64\source\rsp\mmx.c(426): warning C4701: potentially uninitialized local variable 'x86Command' used
12>c:\users\rj\project64\source\rsp\mmx.c(455): warning C4701: potentially uninitialized local variable 'x86Command' used
12>c:\users\rj\project64\source\rsp\mmx.c(477): warning C4701: potentially uninitialized local variable 'x86Command' used
12>c:\users\rj\project64\source\rsp\mmx.c(498): warning C4701: potentially uninitialized local variable 'x86Command' used
12>c:\users\rj\project64\source\rsp\mmx.c(519): warning C4701: potentially uninitialized local variable 'x86Command' used
12>c:\users\rj\project64\source\rsp\mmx.c(539): warning C4701: potentially uninitialized local variable 'x86Command' used
12>c:\users\rj\project64\source\rsp\mmx.c(568): warning C4701: potentially uninitialized local variable 'x86Command' used
12>c:\users\rj\project64\source\rsp\mmx.c(598): warning C4701: potentially uninitialized local variable 'x86Command' used
12>c:\users\rj\project64\source\rsp\mmx.c(619): warning C4701: potentially uninitialized local variable 'x86Command' used
12>c:\users\rj\project64\source\rsp\mmx.c(639): warning C4701: potentially uninitialized local variable 'x86Command' used
12>c:\users\rj\project64\source\rsp\mmx.c(668): warning C4701: potentially uninitialized local variable 'x86Command' used
12>c:\users\rj\project64\source\rsp\mmx.c(697): warning C4701: potentially uninitialized local variable 'x86Command' used
12>c:\users\rj\project64\source\rsp\mmx.c(726): warning C4701: potentially uninitialized local variable 'x86Command' used
12>c:\users\rj\project64\source\rsp\mmx.c(755): warning C4701: potentially uninitialized local variable 'x86Command' used
12>c:\users\rj\project64\source\rsp\recompiler analysis.c(1683): warning C4702: unreachable code
2> gbsizer.cpp
12>c:\users\rj\project64\source\rsp\sse.c(63): warning C4701: potentially uninitialized local variable 'x86Command' used
12>c:\users\rj\project64\source\rsp\sse.c(83): warning C4701: potentially uninitialized local variable 'x86Command' used
12>c:\users\rj\project64\source\rsp\sse.c(115): warning C4701: potentially uninitialized local variable 'x86Command' used
12>c:\users\rj\project64\source\rsp\sse.c(135): warning C4701: potentially uninitialized local variable 'x86Command' used
12>c:\users\rj\project64\source\rsp\sse.c(167): warning C4701: potentially uninitialized local variable 'x86Command' used
12>c:\users\rj\project64\source\rsp\sse.c(187): warning C4701: potentially uninitialized local variable 'x86Command' used
12>c:\users\rj\project64\source\rsp\sse.c(219): warning C4701: potentially uninitialized local variable 'x86Command' used
12>c:\users\rj\project64\source\rsp\sse.c(239): warning C4701: potentially uninitialized local variable 'x86Command' used
12>c:\users\rj\project64\source\rsp\sse.c(270): warning C4701: potentially uninitialized local variable 'x86Command' used
12>c:\users\rj\project64\source\rsp\sse.c(300): warning C4701: potentially uninitialized local variable 'x86Command' used
12>c:\users\rj\project64\source\rsp\sse.c(329): warning C4701: potentially uninitialized local variable 'x86Command' used
12>c:\users\rj\project64\source\rsp\x86.c(74): warning C4701: potentially uninitialized local variable 'x86Command' used
12>c:\users\rj\project64\source\rsp\x86.c(263): warning C4701: potentially uninitialized local variable 'x86Command' used
12>c:\users\rj\project64\source\rsp\x86.c(372): warning C4701: potentially uninitialized local variable 'x86Command' used
12>c:\users\rj\project64\source\rsp\x86.c(401): warning C4701: potentially uninitialized local variable 'x86Command' used
12>c:\users\rj\project64\source\rsp\x86.c(468): warning C4701: potentially uninitialized local variable 'x86Command' used
12>c:\users\rj\project64\source\rsp\x86.c(510): warning C4701: potentially uninitialized local variable 'x86Command' used
12>c:\users\rj\project64\source\rsp\x86.c(552): warning C4701: potentially uninitialized local variable 'x86Command' used
12>c:\users\rj\project64\source\rsp\x86.c(594): warning C4701: potentially uninitialized local variable 'x86Command' used
2> gaugecmn.cpp
12>c:\users\rj\project64\source\rsp\x86.c(636): warning C4701: potentially uninitialized local variable 'x86Command' used
12>c:\users\rj\project64\source\rsp\x86.c(678): warning C4701: potentially uninitialized local variable 'x86Command' used
12>c:\users\rj\project64\source\rsp\x86.c(790): warning C4701: potentially uninitialized local variable 'x86Command' used
12>c:\users\rj\project64\source\rsp\x86.c(891): warning C4701: potentially uninitialized local variable 'x86Command' used
12>c:\users\rj\project64\source\rsp\x86.c(1089): warning C4701: potentially uninitialized local variable 'x86Command' used
12>c:\users\rj\project64\source\rsp\x86.c(1241): warning C4701: potentially uninitialized local variable 'x86Amb' used
12>c:\users\rj\project64\source\rsp\x86.c(1273): warning C4701: potentially uninitialized local variable 'x86Amb' used
12>c:\users\rj\project64\source\rsp\x86.c(1306): warning C4701: potentially uninitialized local variable 'x86Amb' used
12>c:\users\rj\project64\source\rsp\x86.c(1339): warning C4701: potentially uninitialized local variable 'x86Amb' used
12>c:\users\rj\project64\source\rsp\x86.c(1372): warning C4701: potentially uninitialized local variable 'x86Amb' used
12>c:\users\rj\project64\source\rsp\x86.c(1404): warning C4701: potentially uninitialized local variable 'x86Amb' used
12>c:\users\rj\project64\source\rsp\x86.c(1435): warning C4701: potentially uninitialized local variable 'x86Command' used
12>c:\users\rj\project64\source\rsp\x86.c(1464): warning C4701: potentially uninitialized local variable 'x86Command' used
12>c:\users\rj\project64\source\rsp\x86.c(1492): warning C4701: potentially uninitialized local variable 'x86Command' used
12>c:\users\rj\project64\source\rsp\x86.c(1521): warning C4701: potentially uninitialized local variable 'x86Command' used
12>c:\users\rj\project64\source\rsp\x86.c(1548): warning C4701: potentially uninitialized local variable 'x86Command' used
12>c:\users\rj\project64\source\rsp\x86.c(1573): warning C4701: potentially uninitialized local variable 'x86Command' used
12>c:\users\rj\project64\source\rsp\x86.c(1601): warning C4701: potentially uninitialized local variable 'x86Command' used
12>c:\users\rj\project64\source\rsp\x86.c(1629): warning C4701: potentially uninitialized local variable 'x86Command' used
12>c:\users\rj\project64\source\rsp\x86.c(1752): warning C4701: potentially uninitialized local variable 'x86Command' used
12>c:\users\rj\project64\source\rsp\x86.c(1781): warning C4701: potentially uninitialized local variable 'x86Command' used
12>c:\users\rj\project64\source\rsp\x86.c(1811): warning C4701: potentially uninitialized local variable 'x86Command' used
12>c:\users\rj\project64\source\rsp\x86.c(1859): warning C4701: potentially uninitialized local variable 'x86Command' used
12>c:\users\rj\project64\source\rsp\x86.c(1888): warning C4701: potentially uninitialized local variable 'x86Command' used
12>c:\users\rj\project64\source\rsp\x86.c(1920): warning C4701: potentially uninitialized local variable 'x86Command' used
12>c:\users\rj\project64\source\rsp\x86.c(1950): warning C4701: potentially uninitialized local variable 'x86Command' used
12>c:\users\rj\project64\source\rsp\x86.c(1998): warning C4701: potentially uninitialized local variable 'x86Command' used
12>c:\users\rj\project64\source\rsp\x86.c(2027): warning C4701: potentially uninitialized local variable 'x86Command' used
12>c:\users\rj\project64\source\rsp\x86.c(2187): warning C4701: potentially uninitialized local variable 'x86Command' used
12>c:\users\rj\project64\source\rsp\x86.c(2644): warning C4701: potentially uninitialized local variable 'x86Command' used
12>c:\users\rj\project64\source\rsp\x86.c(2670): warning C4701: potentially uninitialized local variable 'x86Command' used
12>c:\users\rj\project64\source\rsp\x86.c(2720): warning C4701: potentially uninitialized local variable 'x86Command' used
12>c:\users\rj\project64\source\rsp\x86.c(2786): warning C4701: potentially uninitialized local variable 'x86Command' used
2> fs_mem.cpp
12> Profiling.cpp
2> framecmn.cpp
2> fontutilcmn.cpp
2> fontpickercmn.cpp
2> fontmap.cpp
2> Generating Code...
12>Profiling.cpp(157): warning C4389: '==' : signed/unsigned mismatch
12> Main.cpp
2> Compiling...
2> fontenumcmn.cpp
2> fontdata.cpp
2> fontcmn.cpp
2> fldlgcmn.cpp
2> filepickercmn.cpp
2> filehistorycmn.cpp
2> filectrlcmn.cpp
12>c:\users\rj\project64\source\rsp\opcode.h(43): warning C4201: nonstandard extension used : nameless struct/union
12>c:\users\rj\project64\source\rsp\opcode.h(50): warning C4201: nonstandard extension used : nameless struct/union
12>c:\users\rj\project64\source\rsp\opcode.h(55): warning C4201: nonstandard extension used : nameless struct/union
12>c:\users\rj\project64\source\rsp\opcode.h(64): warning C4201: nonstandard extension used : nameless struct/union
12>c:\users\rj\project64\source\rsp\opcode.h(73): warning C4201: nonstandard extension used : nameless struct/union
12>Main.cpp(170): warning C4100: 'lpvReserved' : unreferenced formal parameter
12>Main.cpp(170): warning C4100: 'fdwReason' : unreferenced formal parameter
12>Main.cpp(512): warning C4100: 'lParam' : unreferenced formal parameter
12>Main.cpp(591): warning C4100: 'lParam' : unreferenced formal parameter
12>Main.cpp(731): warning C4100: 'SettingID' : unreferenced formal parameter
12> log.cpp
2> fddlgcmn.cpp
2> event.cpp
2> effects.cpp
2> dseldlg.cpp
2> dpycmn.cpp
2> docview.cpp
12>log.cpp(166): warning C4189: 'Length' : local variable is initialized but not referenced
12>log.cpp(200): warning C4100: 'PC' : unreferenced formal parameter
12> Generating Code...
2> docmdi.cpp
2> dobjcmn.cpp
2> dndcmn.cpp
2> dlgcmn.cpp
12>MakeDirsForLink:
12> Creating directory "C:\Users\RJ\project64\Plugin\RSP".
12>C:\Program Files (x86)\MSBuild\Microsoft.Cpp\v4.0\Microsoft.CppBuild.targets(990,5): warning MSB8012: TargetPath(C:\Users\RJ\project64\bin/Debug\RSP.dll) does not match the Linker's OutputFile property value (C:\Users\RJ\project64\Plugin\RSP\RSP_d 1.7.dll). This may cause your project to build incorrectly. To correct this, please make sure that $(OutDir), $(TargetName) and $(TargetExt) property values match the value specified in %(Link.OutputFile).
12>C:\Program Files (x86)\MSBuild\Microsoft.Cpp\v4.0\Microsoft.CppBuild.targets(992,5): warning MSB8012: TargetName(RSP) does not match the Linker's OutputFile property value (RSP_d 1.7). This may cause your project to build incorrectly. To correct this, please make sure that $(OutDir), $(TargetName) and $(TargetExt) property values match the value specified in %(Link.OutputFile).
2> dirctrlcmn.cpp
12>Link:
12> Creating library C:\Users\RJ\project64\bin/Debug\RSP.lib and object C:\Users\RJ\project64\bin/Debug\RSP.exp
2> dcsvg.cpp
12> RSP.vcxproj -> C:\Users\RJ\project64\bin/Debug\RSP.dll
2> dcgraph.cpp
2> Generating Code...
12>FinalizeBuildStatus:
12> Deleting file "C:\Users\RJ\project64\build/Debug/RSP\RSP.unsuccessfulbuild".
12> Touching "C:\Users\RJ\project64\build/Debug/RSP\RSP.lastbuildstate".
12>
12>Build succeeded.
12>
12>Time Elapsed 00:00:17.27
13>------ Build started: Project: WTL, Configuration: Debug Win32 ------
13>Build started 1/19/2015 9:26:18 PM.
13>PrepareForBuild:
13> Creating directory "C:\Users\RJ\project64\Debug\".
13>InitializeBuildStatus:
13> Creating "Debug\WTL.unsuccessfulbuild" because "AlwaysCreate" was specified.
13>FinalizeBuildStatus:
13> Deleting file "Debug\WTL.unsuccessfulbuild".
13> Touching "Debug\WTL.lastbuildstate".
13>
13>Build succeeded.
13>
13>Time Elapsed 00:00:00.11
14>------ Build started: Project: NRage_Input_V2, Configuration: Debug Win32 ------
14>Build started 1/19/2015 9:26:19 PM.
2> Compiling...
2> dcbufcmn.cpp
14>InitializeBuildStatus:
14> Creating "C:\Users\RJ\project64\build/Debug/NRage_Input_V2\NRage_Input_V2.unsuccessfulbuild" because "AlwaysCreate" was specified.
14>ClCompile:
14> XInputController.cpp
2> dcbase.cpp
2> ctrlsub.cpp
2> ctrlcmn.cpp
2> cshelp.cpp
2> containr.cpp
2> combocmn.cpp
14>c:\users\rj\project64\source\nragev20\XInputController.h(157): error C2065: 'FILE' : undeclared identifier
14>c:\users\rj\project64\source\nragev20\XInputController.h(157): error C2065: 'file' : undeclared identifier
14>c:\users\rj\project64\source\nragev20\XInputController.h(157): error C2275: 'LPXCONTROLLER' : illegal use of this type as an expression
14> c:\users\rj\project64\source\nragev20\XInputController.h(103) : see declaration of 'LPXCONTROLLER'
14>c:\users\rj\project64\source\nragev20\XInputController.h(157): error C2146: syntax error : missing ')' before identifier 'gController'
14>c:\users\rj\project64\source\nragev20\XInputController.h(157): error C2182: 'SaveXInputConfigToFile' : illegal use of type 'void'
14>c:\users\rj\project64\source\nragev20\XInputController.h(157): error C2078: too many initializers
14>c:\users\rj\project64\source\nragev20\XInputController.h(157): error C2275: 'LPXCONTROLLER' : illegal use of this type as an expression
14> c:\users\rj\project64\source\nragev20\XInputController.h(103) : see declaration of 'LPXCONTROLLER'
14>c:\users\rj\project64\source\nragev20\XInputController.h(157): error C2059: syntax error : ')'
14>c:\users\rj\project64\source\nragev20\XInputController.h(158): error C2065: 'FILE' : undeclared identifier
14>c:\users\rj\project64\source\nragev20\XInputController.h(158): error C2065: 'file' : undeclared identifier
14>c:\users\rj\project64\source\nragev20\XInputController.h(158): error C2275: 'LPXCONTROLLER' : illegal use of this type as an expression
14> c:\users\rj\project64\source\nragev20\XInputController.h(103) : see declaration of 'LPXCONTROLLER'
14>c:\users\rj\project64\source\nragev20\XInputController.h(158): error C2146: syntax error : missing ')' before identifier 'gController'
14>c:\users\rj\project64\source\nragev20\XInputController.h(158): error C2182: 'LoadXInputConfigFromFile' : illegal use of type 'void'
14>c:\users\rj\project64\source\nragev20\XInputController.h(158): error C2078: too many initializers
14>c:\users\rj\project64\source\nragev20\XInputController.h(158): error C2275: 'LPXCONTROLLER' : illegal use of this type as an expression
14> c:\users\rj\project64\source\nragev20\XInputController.h(103) : see declaration of 'LPXCONTROLLER'
14>c:\users\rj\project64\source\nragev20\XInputController.h(158): error C2059: syntax error : ')'
2> colourdata.cpp
2> colourcmn.cpp
14>XInputController.cpp(143): warning C4244: 'initializing' : conversion from 'int' to 'float', possible loss of data
14>XInputController.cpp(293): warning C4244: '=' : conversion from 'int' to 'WORD', possible loss of data
14>XInputController.cpp(294): warning C4244: '=' : conversion from 'int' to 'WORD', possible loss of data
14>XInputController.cpp(316): error C2064: term does not evaluate to a function taking 2 arguments
14>XInputController.cpp(435): warning C4245: 'argument' : conversion from 'int' to 'WPARAM', signed/unsigned mismatch
14>XInputController.cpp(436): warning C4245: 'argument' : conversion from 'int' to 'WPARAM', signed/unsigned mismatch
14>XInputController.cpp(437): warning C4245: 'argument' : conversion from 'int' to 'WPARAM', signed/unsigned mismatch
14>XInputController.cpp(438): warning C4245: 'argument' : conversion from 'int' to 'WPARAM', signed/unsigned mismatch
14>XInputController.cpp(439): warning C4245: 'argument' : conversion from 'int' to 'WPARAM', signed/unsigned mismatch
14>XInputController.cpp(440): warning C4245: 'argument' : conversion from 'int' to 'WPARAM', signed/unsigned mismatch
2> cmndata.cpp
14>XInputController.cpp(441): warning C4245: 'argument' : conversion from 'int' to 'WPARAM', signed/unsigned mismatch
14>XInputController.cpp(442): warning C4245: 'argument' : conversion from 'int' to 'WPARAM', signed/unsigned mismatch
14>XInputController.cpp(443): warning C4245: 'argument' : conversion from 'int' to 'WPARAM', signed/unsigned mismatch
14>XInputController.cpp(444): warning C4245: 'argument' : conversion from 'int' to 'WPARAM', signed/unsigned mismatch
14>XInputController.cpp(446): warning C4245: 'argument' : conversion from 'int' to 'WPARAM', signed/unsigned mismatch
14>XInputController.cpp(447): warning C4245: 'argument' : conversion from 'int' to 'WPARAM', signed/unsigned mismatch
14>XInputController.cpp(449): warning C4245: 'argument' : conversion from 'int' to 'WPARAM', signed/unsigned mismatch
14>XInputController.cpp(450): warning C4245: 'argument' : conversion from 'int' to 'WPARAM', signed/unsigned mismatch
14>XInputController.cpp(451): warning C4245: 'argument' : conversion from 'int' to 'WPARAM', signed/unsigned mismatch
14>XInputController.cpp(658): error C2365: 'SaveXInputConfigToFile' : redefinition; previous definition was 'data variable'
14> c:\users\rj\project64\source\nragev20\XInputController.h(157) : see declaration of 'SaveXInputConfigToFile'
14>XInputController.cpp(685): error C2365: 'LoadXInputConfigFromFile' : redefinition; previous definition was 'data variable'
14> c:\users\rj\project64\source\nragev20\XInputController.h(158) : see declaration of 'LoadXInputConfigFromFile'
14> PakIO.cpp
2> cmdproc.cpp
2> clrpickercmn.cpp
2> clipcmn.cpp
2> choiccmn.cpp
2> checklstcmn.cpp
2> checkboxcmn.cpp
2> cairo.cpp
2> btncmn.cpp
2> bookctrl.cpp
2> bmpbtncmn.cpp
2> Generating Code...
14> Driver-fix for Rumble with Adaptoid enabled
14> Addresscheck for Pak-Reads active
14>PakIO.cpp(382): warning C4244: '=' : conversion from 'int' to 'BYTE', possible loss of data
14> Addresscheck for Pak-Writes active
14>PakIO.cpp(950): warning C4244: '=' : conversion from 'int' to 'BYTE', possible loss of data
14>PakIO.cpp(1469): warning C4100: 'dwTime' : unreferenced formal parameter
14>PakIO.cpp(1469): warning C4100: 'msg' : unreferenced formal parameter
14> NRagePluginV2.cpp
2> Compiling...
2> bmpbase.cpp
2> arttango.cpp
2> artstd.cpp
2> artprov.cpp
14>c:\users\rj\project64\source\nragev20\XInputController.h(157): error C2065: 'FILE' : undeclared identifier
14>c:\users\rj\project64\source\nragev20\XInputController.h(157): error C2065: 'file' : undeclared identifier
14>c:\users\rj\project64\source\nragev20\XInputController.h(157): error C2275: 'LPXCONTROLLER' : illegal use of this type as an expression
14> c:\users\rj\project64\source\nragev20\XInputController.h(103) : see declaration of 'LPXCONTROLLER'
14>c:\users\rj\project64\source\nragev20\XInputController.h(157): error C2146: syntax error : missing ')' before identifier 'gController'
14>c:\users\rj\project64\source\nragev20\XInputController.h(157): error C2182: 'SaveXInputConfigToFile' : illegal use of type 'void'
14>c:\users\rj\project64\source\nragev20\XInputController.h(157): error C2078: too many initializers
14>c:\users\rj\project64\source\nragev20\XInputController.h(157): error C2275: 'LPXCONTROLLER' : illegal use of this type as an expression
14> c:\users\rj\project64\source\nragev20\XInputController.h(103) : see declaration of 'LPXCONTROLLER'
14>c:\users\rj\project64\source\nragev20\XInputController.h(157): error C2059: syntax error : ')'
14>c:\users\rj\project64\source\nragev20\XInputController.h(158): error C2065: 'FILE' : undeclared identifier
14>c:\users\rj\project64\source\nragev20\XInputController.h(158): error C2065: 'file' : undeclared identifier
14>c:\users\rj\project64\source\nragev20\XInputController.h(158): error C2275: 'LPXCONTROLLER' : illegal use of this type as an expression
14> c:\users\rj\project64\source\nragev20\XInputController.h(103) : see declaration of 'LPXCONTROLLER'
14>c:\users\rj\project64\source\nragev20\XInputController.h(158): error C2146: syntax error : missing ')' before identifier 'gController'
14>c:\users\rj\project64\source\nragev20\XInputController.h(158): error C2182: 'LoadXInputConfigFromFile' : illegal use of type 'void'
14>c:\users\rj\project64\source\nragev20\XInputController.h(158): error C2078: too many initializers
14>c:\users\rj\project64\source\nragev20\XInputController.h(158): error C2275: 'LPXCONTROLLER' : illegal use of this type as an expression
14> c:\users\rj\project64\source\nragev20\XInputController.h(103) : see declaration of 'LPXCONTROLLER'
14>c:\users\rj\project64\source\nragev20\XInputController.h(158): error C2059: syntax error : ')'
2> appcmn.cpp
2> anidecod.cpp
14> Conforming to Zilmar Spec 1.0
2> affinematrix2d.cpp
14> International.cpp
2> accesscmn.cpp
2> accelcmn.cpp
2> Generating Code...
14>International.cpp(70): warning C4100: 'lpszName' : unreferenced formal parameter
14>International.cpp(70): warning C4100: 'lpszType' : unreferenced formal parameter
14>International.cpp(70): warning C4100: 'hModule' : unreferenced formal parameter
14>International.cpp(179): warning C4244: '=' : conversion from 'int' to 'LANGID', possible loss of data
14> Interface.cpp
2> printdlg.cpp
14>Interface.cpp(165): warning C4244: '=' : conversion from 'int' to 'BYTE', possible loss of data
14>Interface.cpp(815): warning C4100: 'lParam' : unreferenced formal parameter
14> Transferpak enabled in Interface
14> Voicepak enabled in Interface
14>Interface.cpp(1810): warning C4100: 'lParam' : unreferenced formal parameter
14>Interface.cpp(1991): warning C4100: 'lParam' : unreferenced formal parameter
14>Interface.cpp(1991): warning C4100: 'wParam' : unreferenced formal parameter
14>Interface.cpp(2693): warning C4100: 'lParam' : unreferenced formal parameter
14>Interface.cpp(2771): warning C4100: 'lParam' : unreferenced formal parameter
14>Interface.cpp(3013): warning C4100: 'lParam' : unreferenced formal parameter
14>Interface.cpp(3524): warning C4100: 'lpdwCounter' : unreferenced formal parameter
14> GBCart.cpp
14>c:\users\rj\project64\source\nragev20\XInputController.h(157): error C2065: 'FILE' : undeclared identifier
14>c:\users\rj\project64\source\nragev20\XInputController.h(157): error C2065: 'file' : undeclared identifier
14>c:\users\rj\project64\source\nragev20\XInputController.h(157): error C2275: 'LPXCONTROLLER' : illegal use of this type as an expression
14> c:\users\rj\project64\source\nragev20\XInputController.h(103) : see declaration of 'LPXCONTROLLER'
14>c:\users\rj\project64\source\nragev20\XInputController.h(157): error C2146: syntax error : missing ')' before identifier 'gController'
14>c:\users\rj\project64\source\nragev20\XInputController.h(157): error C2182: 'SaveXInputConfigToFile' : illegal use of type 'void'
14>c:\users\rj\project64\source\nragev20\XInputController.h(157): error C2078: too many initializers
14>c:\users\rj\project64\source\nragev20\XInputController.h(157): error C2275: 'LPXCONTROLLER' : illegal use of this type as an expression
14> c:\users\rj\project64\source\nragev20\XInputController.h(103) : see declaration of 'LPXCONTROLLER'
14>c:\users\rj\project64\source\nragev20\XInputController.h(157): error C2059: syntax error : ')'
14>c:\users\rj\project64\source\nragev20\XInputController.h(158): error C2065: 'FILE' : undeclared identifier
14>c:\users\rj\project64\source\nragev20\XInputController.h(158): error C2065: 'file' : undeclared identifier
14>c:\users\rj\project64\source\nragev20\XInputController.h(158): error C2275: 'LPXCONTROLLER' : illegal use of this type as an expression
14> c:\users\rj\project64\source\nragev20\XInputController.h(103) : see declaration of 'LPXCONTROLLER'
14>c:\users\rj\project64\source\nragev20\XInputController.h(158): error C2146: syntax error : missing ')' before identifier 'gController'
14>c:\users\rj\project64\source\nragev20\XInputController.h(158): error C2182: 'LoadXInputConfigFromFile' : illegal use of type 'void'
14>c:\users\rj\project64\source\nragev20\XInputController.h(158): error C2078: too many initializers
14>c:\users\rj\project64\source\nragev20\XInputController.h(158): error C2275: 'LPXCONTROLLER' : illegal use of this type as an expression
14> c:\users\rj\project64\source\nragev20\XInputController.h(103) : see declaration of 'LPXCONTROLLER'
14>c:\users\rj\project64\source\nragev20\XInputController.h(158): error C2059: syntax error : ')'
14>GBCart.cpp(57): warning C4244: '=' : conversion from 'time_t' to 'int', possible loss of data
14>GBCart.cpp(460): warning C4244: '=' : conversion from 'UINT' to 'BYTE', possible loss of data
14>GBCart.cpp(461): warning C4244: '=' : conversion from 'UINT' to 'BYTE', possible loss of data
14>GBCart.cpp(462): warning C4244: '=' : conversion from 'UINT' to 'BYTE', possible loss of data
14>GBCart.cpp(463): warning C4244: '=' : conversion from 'UINT' to 'BYTE', possible loss of data
14>GBCart.cpp(464): warning C4244: '=' : conversion from 'UINT' to 'BYTE', possible loss of data
14>GBCart.cpp(465): warning C4244: '=' : conversion from 'UINT' to 'BYTE', possible loss of data
14>GBCart.cpp(466): warning C4244: '=' : conversion from 'UINT' to 'BYTE', possible loss of data
14>GBCart.cpp(467): warning C4244: '=' : conversion from 'UINT' to 'BYTE', possible loss of data
14>GBCart.cpp(468): warning C4244: '=' : conversion from 'UINT' to 'BYTE', possible loss of data
14>GBCart.cpp(469): warning C4244: '=' : conversion from 'UINT' to 'BYTE', possible loss of data
14> FileAccess.cpp
14>FileAccess.cpp(91): warning C4244: '=' : conversion from 'int' to 'char', possible loss of data
14>FileAccess.cpp(133): warning C4244: '=' : conversion from 'int' to 'char', possible loss of data
14>FileAccess.cpp(202): warning C4244: '=' : conversion from 'int' to 'LANGID', possible loss of data
14>FileAccess.cpp(204): warning C4244: '=' : conversion from 'int' to 'LANGID', possible loss of data
14>FileAccess.cpp(270): warning C4244: '=' : conversion from 'int' to 'BYTE', possible loss of data
14>FileAccess.cpp(274): warning C4244: '=' : conversion from 'int' to 'BYTE', possible loss of data
14>FileAccess.cpp(298): warning C4244: '=' : conversion from 'int' to 'BYTE', possible loss of data
14>FileAccess.cpp(302): warning C4244: '=' : conversion from 'int' to 'WORD', possible loss of data
14>FileAccess.cpp(306): warning C4244: '=' : conversion from 'int' to 'WORD', possible loss of data
14>FileAccess.cpp(310): warning C4244: '=' : conversion from 'int' to 'BYTE', possible loss of data
14>FileAccess.cpp(314): warning C4244: '=' : conversion from 'int' to 'BYTE', possible loss of data
14>FileAccess.cpp(355): warning C4244: '=' : conversion from 'int' to 'BYTE', possible loss of data
14>FileAccess.cpp(414): warning C4244: '=' : conversion from 'unsigned int' to 'BYTE', possible loss of data
14>FileAccess.cpp(415): warning C4244: '=' : conversion from 'unsigned int' to 'BYTE', possible loss of data
14>FileAccess.cpp(416): warning C4244: '=' : conversion from 'unsigned int' to 'BYTE', possible loss of data
14>FileAccess.cpp(521): warning C4244: '=' : conversion from 'unsigned int' to 'BYTE', possible loss of data
14>FileAccess.cpp(522): warning C4244: '=' : conversion from 'unsigned int' to 'BYTE', possible loss of data
14>FileAccess.cpp(523): warning C4244: '=' : conversion from 'unsigned int' to 'BYTE', possible loss of data
14>FileAccess.cpp(524): warning C4244: '=' : conversion from 'unsigned int' to 'BYTE', possible loss of data
14>FileAccess.cpp(1593): warning C4100: 'strNull' : unreferenced formal parameter
14> DirectInput.cpp
14>c:\users\rj\project64\source\nragev20\XInputController.h(157): error C2065: 'FILE' : undeclared identifier
14>c:\users\rj\project64\source\nragev20\XInputController.h(157): error C2065: 'file' : undeclared identifier
14>c:\users\rj\project64\source\nragev20\XInputController.h(157): error C2275: 'LPXCONTROLLER' : illegal use of this type as an expression
14> c:\users\rj\project64\source\nragev20\XInputController.h(103) : see declaration of 'LPXCONTROLLER'
14>c:\users\rj\project64\source\nragev20\XInputController.h(157): error C2146: syntax error : missing ')' before identifier 'gController'
14>c:\users\rj\project64\source\nragev20\XInputController.h(157): error C2182: 'SaveXInputConfigToFile' : illegal use of type 'void'
14>c:\users\rj\project64\source\nragev20\XInputController.h(157): error C2078: too many initializers
14>c:\users\rj\project64\source\nragev20\XInputController.h(157): error C2275: 'LPXCONTROLLER' : illegal use of this type as an expression
14> c:\users\rj\project64\source\nragev20\XInputController.h(103) : see declaration of 'LPXCONTROLLER'
14>c:\users\rj\project64\source\nragev20\XInputController.h(157): error C2059: syntax error : ')'
14>c:\users\rj\project64\source\nragev20\XInputController.h(158): error C2065: 'FILE' : undeclared identifier
14>c:\users\rj\project64\source\nragev20\XInputController.h(158): error C2065: 'file' : undeclared identifier
14>c:\users\rj\project64\source\nragev20\XInputController.h(158): error C2275: 'LPXCONTROLLER' : illegal use of this type as an expression
14> c:\users\rj\project64\source\nragev20\XInputController.h(103) : see declaration of 'LPXCONTROLLER'
14>c:\users\rj\project64\source\nragev20\XInputController.h(158): error C2146: syntax error : missing ')' before identifier 'gController'
14>c:\users\rj\project64\source\nragev20\XInputController.h(158): error C2182: 'LoadXInputConfigFromFile' : illegal use of type 'void'
14>c:\users\rj\project64\source\nragev20\XInputController.h(158): error C2078: too many initializers
14>c:\users\rj\project64\source\nragev20\XInputController.h(158): error C2275: 'LPXCONTROLLER' : illegal use of this type as an expression
14> c:\users\rj\project64\source\nragev20\XInputController.h(103) : see declaration of 'LPXCONTROLLER'
14>c:\users\rj\project64\source\nragev20\XInputController.h(158): error C2059: syntax error : ')'
14>DirectInput.cpp(216): warning C4389: '!=' : signed/unsigned mismatch
14> Debug.cpp
2> oleutils.cpp
14>c:\users\rj\project64\source\nragev20\XInputController.h(157): error C2065: 'FILE' : undeclared identifier
14>c:\users\rj\project64\source\nragev20\XInputController.h(157): error C2065: 'file' : undeclared identifier
14>c:\users\rj\project64\source\nragev20\XInputController.h(157): error C2275: 'LPXCONTROLLER' : illegal use of this type as an expression
14> c:\users\rj\project64\source\nragev20\XInputController.h(103) : see declaration of 'LPXCONTROLLER'
14>c:\users\rj\project64\source\nragev20\XInputController.h(157): error C2146: syntax error : missing ')' before identifier 'gController'
14>c:\users\rj\project64\source\nragev20\XInputController.h(157): error C2182: 'SaveXInputConfigToFile' : illegal use of type 'void'
14>c:\users\rj\project64\source\nragev20\XInputController.h(157): error C2078: too many initializers
14>c:\users\rj\project64\source\nragev20\XInputController.h(157): error C2275: 'LPXCONTROLLER' : illegal use of this type as an expression
14> c:\users\rj\project64\source\nragev20\XInputController.h(103) : see declaration of 'LPXCONTROLLER'
14>c:\users\rj\project64\source\nragev20\XInputController.h(157): error C2059: syntax error : ')'
14>c:\users\rj\project64\source\nragev20\XInputController.h(158): error C2065: 'FILE' : undeclared identifier
14>c:\users\rj\project64\source\nragev20\XInputController.h(158): error C2065: 'file' : undeclared identifier
14>c:\users\rj\project64\source\nragev20\XInputController.h(158): error C2275: 'LPXCONTROLLER' : illegal use of this type as an expression
14> c:\users\rj\project64\source\nragev20\XInputController.h(103) : see declaration of 'LPXCONTROLLER'
14>c:\users\rj\project64\source\nragev20\XInputController.h(158): error C2146: syntax error : missing ')' before identifier 'gController'
14>c:\users\rj\project64\source\nragev20\XInputController.h(158): error C2182: 'LoadXInputConfigFromFile' : illegal use of type 'void'
14>c:\users\rj\project64\source\nragev20\XInputController.h(158): error C2078: too many initializers
14>c:\users\rj\project64\source\nragev20\XInputController.h(158): error C2275: 'LPXCONTROLLER' : illegal use of this type as an expression
14> c:\users\rj\project64\source\nragev20\XInputController.h(103) : see declaration of 'LPXCONTROLLER'
14>c:\users\rj\project64\source\nragev20\XInputController.h(158): error C2059: syntax error : ')'
14> Generating Code...
14>c:\users\rj\project64\source\nragev20\interface.cpp(921): warning C4701: potentially uninitialized local variable 'i' used
14>
14>Build FAILED.
14>
14>Time Elapsed 00:00:19.04
2> nonownedwnd.cpp
2> graphics.cpp
2> gdiplus.cpp
2> filedlg.cpp
2> dataobj.cpp
2> activex.cpp
2> Generating Code...
2>C:\Program Files (x86)\MSBuild\Microsoft.Cpp\v4.0\Microsoft.CppBuild.targets(1151,5): warning MSB8012: TargetPath(C:\Users\RJ\project64\bin/Debug\core.lib) does not match the Library's OutputFile property value (C:\Users\RJ\project64\bin\Debug\lib\wxmsw29d_core.lib). This may cause your project to build incorrectly. To correct this, please make sure that $(OutDir), $(TargetName) and $(TargetExt) property values match the value specified in %(Lib.OutputFile).
2>C:\Program Files (x86)\MSBuild\Microsoft.Cpp\v4.0\Microsoft.CppBuild.targets(1153,5): warning MSB8012: TargetName(core) does not match the Library's OutputFile property value (wxmsw29d_core). This may cause your project to build incorrectly. To correct this, please make sure that $(OutDir), $(TargetName) and $(TargetExt) property values match the value specified in %(Lib.OutputFile).
2>dummy.obj : warning LNK4221: This object file does not define any previously undefined public symbols, so it will not be used by any link operation that consumes this library
2> wx_core.vcxproj -> C:\Users\RJ\project64\bin/Debug\core.lib
2>FinalizeBuildStatus:
2> Deleting file "C:\Users\RJ\project64\build/Debug/core\core.unsuccessfulbuild".
2> Touching "C:\Users\RJ\project64\build/Debug/core\core.lastbuildstate".
2>
2>Build succeeded.
2>
2>Time Elapsed 00:02:47.50
15>------ Build started: Project: base, Configuration: Debug Win32 ------
15>Build started 1/19/2015 9:27:21 PM.
15>InitializeBuildStatus:
15> Creating "C:\Users\RJ\project64\build/Debug/base\base.unsuccessfulbuild" because "AlwaysCreate" was specified.
15>CustomBuild:
15> Creating lib\vc_lib\mswud\wx\setup.h
15> 1 file(s) copied.
15> Creating lib\vc_lib\mswud\wx\msw\rcdefs.h
15> genrcdefs.h
15>ClCompile:
15> dummy.cpp
15> fswatcherg.cpp
15> volume.cpp
15> utilsexc.cpp
15> timer.cpp
15> thread.cpp
15> stdpaths.cpp
15> stackwalk.cpp
15> snglinst.cpp
15> registry.cpp
15> regconf.cpp
15> power.cpp
15> mslu.cpp
15> mimetype.cpp
15> main.cpp
15> fswatcher.cpp
15> evtloop.cpp
15> dlmsw.cpp
15> dir.cpp
15> debughlp.cpp
15> dde.cpp
15> Generating Code...
15> Compiling...
15> crashrpt.cpp
15> basemsw.cpp
15> zstream.cpp
15> zipstrm.cpp
15> xtistrm.cpp
15> xti.cpp
15> xlocale.cpp
15> wxprintf.cpp
15> wxcrt.cpp
15> wfstream.cpp
15> variant.cpp
15> utilscmn.cpp
15> ustring.cpp
15> uri.cpp
15> unichar.cpp
15> txtstrm.cpp
15> translation.cpp
15> tokenzr.cpp
15> timerimpl.cpp
15> timercmn.cpp
15> Generating Code...
15> Compiling...
15> time.cpp
15> textfile.cpp
15> textbuf.cpp
15> tarstrm.cpp
15> sysopt.cpp
15> strvararg.cpp
15> stringops.cpp
15> stringimpl.cpp
15> string.cpp
15> stream.cpp
15> strconv.cpp
15> stopwatch.cpp
15> stdstream.cpp
15> stdpbase.cpp
15> sstream.cpp
15> regex.cpp
15> process.cpp
15> powercmn.cpp
15> platinfo.cpp
15> object.cpp
15> Generating Code...
15> Compiling...
15> numformatter.cpp
15> mstream.cpp
15> msgout.cpp
15> module.cpp
15> mimecmn.cpp
15> memory.cpp
15> longlong.cpp
15> log.cpp
15> list.cpp
15> languageinfo.cpp
15> ipcbase.cpp
15> intl.cpp
15> init.cpp
15> hashmap.cpp
15> hash.cpp
15> fswatchercmn.cpp
15> fs_mem.cpp
15> fs_filter.cpp
15> fs_arc.cpp
15> fmapbase.cpp
15> Generating Code...
15> Compiling...
15> filtfind.cpp
15> filtall.cpp
15> filesys.cpp
15> filename.cpp
15> filefn.cpp
15> fileconf.cpp
15> fileback.cpp
15> file.cpp
15> ffile.cpp
15> evtloopcmn.cpp
15> event.cpp
15> encconv.cpp
15> dynload.cpp
15> dynlib.cpp
15> dynarray.cpp
15> dircmn.cpp
15> datstrm.cpp
15> datetimefmt.cpp
15> datetime.cpp
15> convauto.cpp
15> Generating Code...
15> Compiling...
15> config.cpp
15> cmdline.cpp
15> clntdata.cpp
15> base64.cpp
15> arrstr.cpp
15> archive.cpp
15> arcfind.cpp
15> arcall.cpp
15> appbase.cpp
15> any.cpp
15> Generating Code...
15> extended.c
15> utils.cpp
15>C:\Program Files (x86)\MSBuild\Microsoft.Cpp\v4.0\Microsoft.CppBuild.targets(1151,5): warning MSB8012: TargetPath(C:\Users\RJ\project64\bin/Debug\base.lib) does not match the Library's OutputFile property value (C:\Users\RJ\project64\bin\Debug\lib\wxbase29d.lib). This may cause your project to build incorrectly. To correct this, please make sure that $(OutDir), $(TargetName) and $(TargetExt) property values match the value specified in %(Lib.OutputFile).
15>C:\Program Files (x86)\MSBuild\Microsoft.Cpp\v4.0\Microsoft.CppBuild.targets(1153,5): warning MSB8012: TargetName(base) does not match the Library's OutputFile property value (wxbase29d). This may cause your project to build incorrectly. To correct this, please make sure that $(OutDir), $(TargetName) and $(TargetExt) property values match the value specified in %(Lib.OutputFile).
15>wxmsw29d_core.lib(headerctrlg.obj) : warning LNK4221: This object file does not define any previously undefined public symbols, so it will not be used by any link operation that consumes this library
15>dummy.obj : warning LNK4221: This object file does not define any previously undefined public symbols, so it will not be used by any link operation that consumes this library
15> wx_base.vcxproj -> C:\Users\RJ\project64\bin/Debug\base.lib
15>FinalizeBuildStatus:
15> Deleting file "C:\Users\RJ\project64\build/Debug/base\base.unsuccessfulbuild".
15> Touching "C:\Users\RJ\project64\build/Debug/base\base.lastbuildstate".
15>
15>Build succeeded.
15>
15>Time Elapsed 00:00:45.56
16>------ Build started: Project: Glide64, Configuration: Debug Win32 ------
16>Build started 1/19/2015 9:28:07 PM.
16>InitializeBuildStatus:
16> Creating "C:\Users\RJ\project64\build/Debug/Glide64\Glide64.unsuccessfulbuild" because "AlwaysCreate" was specified.
16>ClCompile:
16> Util.cpp
16> TexBuffer.cpp
16>TexBuffer.cpp(708): warning C4389: '==' : signed/unsigned mismatch
16> rdp.cpp
16>rdp.cpp(1657): warning C4245: '=' : conversion from 'int' to 'wxUint32', signed/unsigned mismatch
16>rdp.cpp(1658): warning C4245: '=' : conversion from 'int' to 'wxUint32', signed/unsigned mismatch
16>rdp.cpp(1663): warning C4245: '=' : conversion from 'int' to 'wxUint32', signed/unsigned mismatch
16>rdp.cpp(1664): warning C4245: '=' : conversion from 'int' to 'wxUint32', signed/unsigned mismatch
16>rdp.cpp(3005): warning C4100: 'plist' : unreferenced formal parameter
16>rdp.cpp(3021): warning C4100: 'size' : unreferenced formal parameter
16> Main.cpp
16> Keys.cpp
16> FixedPoint.asm.cpp
16> FBtoScreen.cpp
16> Ext_TxFilter.cpp
16> DepthBufferRender.cpp
16> Debugger.cpp
16> Combine.cpp
16>Combine.cpp(15986): warning C4189: 'strAlphaCombineExt' : local variable is initialized but not referenced
16>Combine.cpp(15992): warning C4189: 'strConstantColorValueExt' : local variable is initialized but not referenced
16>Combine.cpp(15988): warning C4189: 'strTexColorCombineExt' : local variable is initialized but not referenced
16>Combine.cpp(15990): warning C4189: 'strTexAlphaCombineExt' : local variable is initialized but not referenced
16>Combine.cpp(15984): warning C4189: 'strColorCombineExt' : local variable is initialized but not referenced
16> 3dmathSIMD.asm.cpp
16> 3dmath.cpp
16> Config.cpp
16> Texture.asm.cpp
16> TexCache.cpp
16>c:\users\rj\project64\source\glide64\TexLoad.h(45): warning C4100: 'tile' : unreferenced formal parameter
16>c:\users\rj\project64\source\glide64\TexLoad.h(45): warning C4100: 'line' : unreferenced formal parameter
16>c:\users\rj\project64\source\glide64\TexLoad.h(45): warning C4100: 'height' : unreferenced formal parameter
16>c:\users\rj\project64\source\glide64\TexLoad.h(45): warning C4100: 'wid_64' : unreferenced formal parameter
16>c:\users\rj\project64\source\glide64\TexLoad.h(45): warning C4100: 'src' : unreferenced formal parameter
16>c:\users\rj\project64\source\glide64\TexLoad.h(45): warning C4100: 'dst' : unreferenced formal parameter
16> CRC.cpp
16> Generating Code...
16>c:\users\rj\project64\source\glide64\combine.cpp(15627): warning C4701: potentially uninitialized local variable 'current_combine' used
16>c:\users\rj\project64\source\glide64\combine.cpp(16102): warning C4701: potentially uninitialized local variable 'ext_local' used
16>c:\users\rj\project64\source\glide64\combine.cpp(16112): warning C4701: potentially uninitialized local variable 'ext_local_a' used
16>c:\users\rj\project64\source\glide64\combine.cpp(16122): warning C4701: potentially uninitialized local variable 'ext_other' used
16>c:\users\rj\project64\source\glide64\combine.cpp(16060): warning C4701: potentially uninitialized local variable 'ext_other_a' used
16>c:\users\rj\project64\source\glide64\combine.cpp(16491): warning C4701: potentially uninitialized local variable 'tc_ext_c' used
16>c:\users\rj\project64\source\glide64\combine.cpp(16492): warning C4701: potentially uninitialized local variable 'tc_ext_c_invert' used
16>c:\users\rj\project64\source\glide64\combine.cpp(16487): warning C4701: potentially uninitialized local variable 'tc_ext_a' used
16>c:\users\rj\project64\source\glide64\combine.cpp(16488): warning C4701: potentially uninitialized local variable 'tc_ext_a_mode' used
16>c:\users\rj\project64\source\glide64\combine.cpp(16489): warning C4701: potentially uninitialized local variable 'tc_ext_b' used
16>c:\users\rj\project64\source\glide64\combine.cpp(16490): warning C4701: potentially uninitialized local variable 'tc_ext_b_mode' used
16>c:\users\rj\project64\source\glide64\combine.cpp(16493): warning C4701: potentially uninitialized local variable 'tc_ext_d' used
16>c:\users\rj\project64\source\glide64\combine.cpp(16494): warning C4701: potentially uninitialized local variable 'tc_ext_d_invert' used
16>c:\users\rj\project64\source\glide64\combine.cpp(16638): warning C4701: potentially uninitialized local variable 'ta_ext_c' used
16>c:\users\rj\project64\source\glide64\combine.cpp(16639): warning C4701: potentially uninitialized local variable 'ta_ext_c_invert' used
16>c:\users\rj\project64\source\glide64\combine.cpp(16634): warning C4701: potentially uninitialized local variable 'ta_ext_a' used
16>c:\users\rj\project64\source\glide64\combine.cpp(16635): warning C4701: potentially uninitialized local variable 'ta_ext_a_mode' used
16>c:\users\rj\project64\source\glide64\combine.cpp(16636): warning C4701: potentially uninitialized local variable 'ta_ext_b' used
16>c:\users\rj\project64\source\glide64\combine.cpp(16637): warning C4701: potentially uninitialized local variable 'ta_ext_b_mode' used
16>c:\users\rj\project64\source\glide64\combine.cpp(16640): warning C4701: potentially uninitialized local variable 'ta_ext_d' used
16>c:\users\rj\project64\source\glide64\combine.cpp(16641): warning C4701: potentially uninitialized local variable 'ta_ext_d_invert' used
16>c:\users\rj\project64\source\glide64\ucode06.h(1620): warning C4701: potentially uninitialized local variable 'd' used
16>c:\users\rj\project64\source\glide64\ucode09.h(127): warning C4701: potentially uninitialized local variable 'vnum' used
16>c:\users\rj\project64\source\glide64\ucode09.h(289): warning C4701: potentially uninitialized local variable 'm' used
16>C:\Program Files (x86)\MSBuild\Microsoft.Cpp\v4.0\Microsoft.CppBuild.targets(990,5): warning MSB8012: TargetPath(C:\Users\RJ\project64\bin/Debug\Glide64.dll) does not match the Linker's OutputFile property value (C:\Users\RJ\project64\Plugin\GFX\PJ64Glide64_d.dll). This may cause your project to build incorrectly. To correct this, please make sure that $(OutDir), $(TargetName) and $(TargetExt) property values match the value specified in %(Link.OutputFile).
16>C:\Program Files (x86)\MSBuild\Microsoft.Cpp\v4.0\Microsoft.CppBuild.targets(992,5): warning MSB8012: TargetName(Glide64) does not match the Linker's OutputFile property value (PJ64Glide64_d). This may cause your project to build incorrectly. To correct this, please make sure that $(OutDir), $(TargetName) and $(TargetExt) property values match the value specified in %(Link.OutputFile).
16>Link:
16> Creating library C:\Users\RJ\project64\bin/Debug\Glide64.lib and object C:\Users\RJ\project64\bin/Debug\Glide64.exp
16> Glide64.vcxproj -> C:\Users\RJ\project64\bin/Debug\Glide64.dll
16>FinalizeBuildStatus:
16> Deleting file "C:\Users\RJ\project64\build/Debug/Glide64\Glide64.unsuccessfulbuild".
16> Touching "C:\Users\RJ\project64\build/Debug/Glide64\Glide64.lastbuildstate".
16>
16>Build succeeded.
16>
16>Time Elapsed 00:02:18.12
17>------ Build started: Project: Project64, Configuration: Debug Win32 ------
17>Build started 1/19/2015 9:30:25 PM.
17>InitializeBuildStatus:
17> Creating "C:\Users\RJ\project64\build/Debug/Project64\Project64.unsuccessfulbuild" because "AlwaysCreate" was specified.
17>ClCompile:
17> stdafx.cpp
17>c:\users\rj\project64\source\project64\User Interface.h(19): warning C4005: 'DECLARE_HANDLE' : macro redefinition
17> C:\Program Files (x86)\Microsoft SDKs\Windows\v7.0A\include\winnt.h(519) : see previous definition of 'DECLARE_HANDLE'
17> RSP Plugin.cpp
17> Plugin List.cpp
17> Plugin Class.cpp
17> GFX plugin.cpp
17> Controller Plugin.cpp
17> Audio Plugin.cpp
17> Interpreter Ops.cpp
17> Interpreter Ops 32.cpp
17> Interpreter CPU.cpp
17> X86ops.cpp
17> x86CodeLog.cpp
17> Section Info.cpp
17> Reg Info.cpp
17> Recompiler Ops.cpp
17> Recompiler Memory.cpp
17> Recompiler Class.cpp
17> Loop Analysis.cpp
17> Function Map Class.cpp
17> Function Info.cpp
17> Code Section.cpp
17> Generating Code...
17> Compiling...
17> Code Block.cpp
17> r4300i Commands.cpp
17> Logging.cpp
17> TLB class.cpp
17> System Timing.cpp
17> System Events.cpp
17> Sram.cpp
17> Register Class.cpp
17> Pif Ram.cpp
17> Mempak.cpp
17> Memory Virtual Mem.cpp
17> Memory Labels Class.cpp
17> FlashRam.cpp
17> Eeprom.cpp
17> Dma.cpp
17> Audio.cpp
17> System Globals.cpp
17> Speed Limitor Class.cpp
17> Rom Information Class.cpp
17> Profiling Class.cpp
17> Generating Code...
17> Compiling...
17> N64 Rom Class.cpp
17> N64 Class.cpp
17> Cheat Class.cpp
17> Language Class.cpp
17> Debugger.cpp
17> Debugger - View Memory.cpp
17> Debugger - TLB.cpp
17> Debugger - Memory Search.cpp
17> Debugger - Memory Dump.cpp
17> PartialGroupBox.cpp
17> ModifiedEditBox.cpp
17> Settings Page.cpp
17> Settings Page - Plugin.cpp
17> Settings Page - Options.cpp
17> Settings Page - Keyboard Shortcuts.cpp
17> Settings Page - Game Browser.cpp
17> Settings Page - Game - Status.cpp
17> Settings Page - Game - Recompiler.cpp
17> Settings Page - Game - Plugin.cpp
17> Settings Page - Game - General.cpp
17> Generating Code...
17> Compiling...
17> Settings Page - Directories.cpp
17> Settings Page - Advanced Options.cpp
17> Settings Config.cpp
17> Rom Browser Class.cpp
17> Notification Class.cpp
17> MenuShortCuts.cpp
17> Menu Class.cpp
17> Main Menu Class.cpp
17> Gui Class.cpp
17> Frame Per Second Class.cpp
17> SettingsType-TempString.cpp
17> SettingsType-TempNumber.cpp
17> SettingsType-TempBool.cpp
17> SettingsType-SelectedDirectory.cpp
17> SettingsType-RomDatabaseSetting.cpp
17>Settings\SettingType\SettingsType-RomDatabaseSetting.cpp(46): warning C4100: 'Value' : unreferenced formal parameter
17>Settings\SettingType\SettingsType-RomDatabaseSetting.cpp(46): warning C4100: 'Index' : unreferenced formal parameter
17>Settings\SettingType\SettingsType-RomDatabaseSetting.cpp(66): warning C4100: 'Value' : unreferenced formal parameter
17>Settings\SettingType\SettingsType-RomDatabaseSetting.cpp(66): warning C4100: 'Index' : unreferenced formal parameter
17>Settings\SettingType\SettingsType-RomDatabaseSetting.cpp(84): warning C4100: 'Value' : unreferenced formal parameter
17>Settings\SettingType\SettingsType-RomDatabaseSetting.cpp(110): warning C4100: 'Value' : unreferenced formal parameter
17>Settings\SettingType\SettingsType-RomDatabaseSetting.cpp(125): warning C4100: 'Value' : unreferenced formal parameter
17>Settings\SettingType\SettingsType-RomDatabaseSetting.cpp(140): warning C4100: 'Value' : unreferenced formal parameter
17>Settings\SettingType\SettingsType-RomDatabaseSetting.cpp(140): warning C4100: 'Index' : unreferenced formal parameter
17>Settings\SettingType\SettingsType-RomDatabaseSetting.cpp(161): warning C4100: 'Value' : unreferenced formal parameter
17>Settings\SettingType\SettingsType-RomDatabaseSetting.cpp(172): warning C4100: 'Value' : unreferenced formal parameter
17> SettingsType-RomDatabaseIndex.cpp
17> SettingsType-RomDatabase.cpp
17> SettingsType-RelativePath.cpp
17> SettingsType-RDBYesNo.cpp
17> SettingsType-RDBSaveChip.cpp
17> Generating Code...
17> Compiling...
17> SettingsType-RDBRamSize.cpp
17> SettingsType-RDBOnOff.cpp
17> SettingsType-RDBCpuType.cpp
17> SettingsType-GameSettingIndex.cpp
17> SettingsType-GameSetting.cpp
17> SettingsType-Cheats.cpp
17> SettingsType-ApplicationPath.cpp
17> SettingsType-ApplicationIndex.cpp
17> SettingsType-Application.cpp
17> Settings Class.cpp
17> Recompiler Settings.cpp
17> Notification Settings.cpp
17> N64System Settings.cpp
17> Gui Settings.cpp
17> Game Settings.cpp
17> Debug Settings.cpp
17> ValidateBinary.cpp
17> main.cpp
17> Generating Code...
17> Processor Info.cpp
17> 7zip.cpp
17> Generating Code...
17> zip.c
17> UNZIP.C
17> Generating Code...
17>LINK : fatal error LNK1295: '/FIXED' not compatible with '/DYNAMICBASE' specification; link without '/FIXED'
17>
17>Build FAILED.
17>
17>Time Elapsed 00:00:41.95
18>------ Skipped Build: Project: Project64Setup, Configuration: Debug Win32 ------
18>Project not selected to build for this solution configuration
========== Build: 15 succeeded, 2 failed, 0 up-to-date, 1 skipped ==========
Sign up for free to join this conversation on GitHub. Already have an account? Sign in to comment
You can’t perform that action at this time.