Skip to content

Instantly share code, notes, and snippets.

@dajoen dajoen/compile_with_patch
Last active Aug 29, 2015

Embed
What would you like to do?
[503] Jeroen@Nynke:~ $ rvm install 2.0.0 --patch https://bugs.ruby-lang.org/projects/ruby-200/repository/revisions/44905/diff/file.c?format=diff
ruby-2.0.0-p353 - #removing src.
Checking requirements for cygwin.
Requirements installation successful.
Installing Ruby from source to: /home/Jeroen/.rvm/rubies/ruby-2.0.0-p353, this may take a while depending on your cpu(s)...
ruby-2.0.0-p353 - #downloading ruby-2.0.0-p353, this may take a while depending on your connection...
ruby-2.0.0-p353 - #extracting ruby-2.0.0-p353 to /home/Jeroen/.rvm/src/ruby-2.0.0-p353.
Patch 'https://bugs.ruby-lang.org/projects/ruby-200/repository/revisions/44905/diff/file.c?format=diff' not found.
ruby-2.0.0-p353 - #applying patch /home/Jeroen/.rvm/patches/ruby/GH-488.patch.
There has been an error applying the specified patches. Halting the installation.
[504] Jeroen@Nynke:~ $ ls
1391263074_gitlab_backup.tar bin changeset_r44905.diff Downloads git Openbaar setup.log.full TestLab VirtualBox VMs
Afbeeldingen Bureaublad Documenten env.exe.stackdump Muziek setup.log Sjablonen Video's work
[505] Jeroen@Nynke:~ $ rvm install 2.0.0 --patch changeset_r44905.diff
ruby-2.0.0-p353 - #removing src.
Checking requirements for cygwin.
Requirements installation successful.
Installing Ruby from source to: /home/Jeroen/.rvm/rubies/ruby-2.0.0-p353, this may take a while depending on your cpu(s)...
ruby-2.0.0-p353 - #downloading ruby-2.0.0-p353, this may take a while depending on your connection...
ruby-2.0.0-p353 - #extracting ruby-2.0.0-p353 to /home/Jeroen/.rvm/src/ruby-2.0.0-p353.
ruby-2.0.0-p353 - #applying patch /home/Jeroen/changeset_r44905.diff..
Error running '__rvm_patch -F 25 -p1 -N -f -i /home/Jeroen/changeset_r44905.diff',
showing last 15 lines of /home/Jeroen/.rvm/log/1392118791_ruby-2.0.0-p353/patch.apply.changeset_r44905.diff.log
GEM_HOME=/home/Jeroen/.rvm/gems/ruby-2.1.0-rc1
PATH=/home/Jeroen/.rvm/gems/ruby-2.1.0-rc1/bin:/home/Jeroen/.rvm/gems/ruby-2.1.0-rc1@global/bin:/home/Jeroen/.rvm/rubies/ruby-2.1.0-rc1/bin:/home/Jeroen/bin:/usr/local/bin:/usr/bin:/cygdrive/c/Program Files (x86)/NVIDIA Corporation/PhysX/Common:/cygdrive/c/Program Files (x86)/Intel/iCLS Client:/cygdrive/c/Program Files/Intel/iCLS Client:/cygdrive/c/WINDOWS/system32:/cygdrive/c/WINDOWS:/cygdrive/c/WINDOWS/System32/Wbem:/cygdrive/c/WINDOWS/System32/WindowsPowerShell/v1.0:/cygdrive/c/Program Files (x86)/Intel/OpenCL SDK/2.0/bin/x86:/cygdrive/c/Program Files (x86)/Intel/OpenCL SDK/2.0/bin/x64:/cygdrive/c/Program Files/Intel/Intel(R) Management Engine Components/DAL:/cygdrive/c/Program Files/Intel/Intel(R) Management Engine Components/IPT:/cygdrive/c/Program Files (x86)/Intel/Intel(R) Management Engine Components/DAL:/cygdrive/c/Program Files (x86)/Intel/Intel(R) Management Engine Components/IPT:/cygdrive/c/Program Files (x86)/Common Files/Acronis/SnapAPI:/cygdrive/c/Program Files (x86)/Puppet Labs/Puppet Enterprise/bin:/cygdrive/c/Program Files (x86)/vim/bin:/cygdrive/d/HashiCorp/Vagrant/bin:/cygdrive/c/Ruby193/bin:/cygdrive/c/Program Files/Oracle/VirtualBox:/cygdrive/c/Chocolatey/bin:/cygdrive/c/HashiCorp/packer:/usr/lib/lapack:/home/Jeroen/.rvm/bin
GEM_PATH=/home/Jeroen/.rvm/gems/ruby-2.1.0-rc1:/home/Jeroen/.rvm/gems/ruby-2.1.0-rc1@global
command(8): __rvm_patch -F 25 -p1 -N -f -i /home/Jeroen/changeset_r44905.diff
can't find file to patch at input line 5
Perhaps you used the wrong -p or --strip option?
The text leading up to this was:
--------------------------
|Index: file.c
|===================================================================
|--- file.c (revision 44904)
|+++ file.c (revision 44905)
--------------------------
No file to patch. Skipping patch.
1 out of 1 hunk ignored
ruby-2.0.0-p353 - #applying patch /home/Jeroen/.rvm/patches/ruby/GH-488.patch.
ruby-2.0.0-p353 - #configuring.................................................
ruby-2.0.0-p353 - #post-configuration.
ruby-2.0.0-p353 - #compiling.....
Error running '__rvm_make -j2',
showing last 15 lines of /home/Jeroen/.rvm/log/1392118791_ruby-2.0.0-p353/make.log
compiling proc.c
compiling file.c
compiling gc.c
file.c:4184:47: fout: conflicting types for ‘GetLastError’
extern unsigned long __attribute__((stdcall)) GetLastError(void);
^
In file included from /usr/include/w32api/winbase.h:16:0,
from /usr/include/w32api/windows.h:70,
from file.c:18:
/usr/include/w32api/errhandlingapi.h:45:27: note: previous declaration of ‘GetLastError’ was here
WINBASEAPI DWORD WINAPI GetLastError (VOID);
^
Makefile:328: recept voor doel 'file.o' is mislukt
make: *** [file.o] Fout 1
make: *** Wachten op onvoltooide taken...
There has been an error while running make. Halting the installation.
[516] jverhoeven@Waalre:~ $ rvm install 2.0.0 --patch changeset_r44905.diff
Warning! PATH is not properly set up, '/home/jverhoeven/.rvm/gems/ruby-2.1.0-rc1/bin' is not at first place,
usually this is caused by shell initialization files - check them for 'PATH=...' entries,
it might also help to re-add RVM to your dotfiles: 'rvm get stable --auto-dotfiles',
to fix temporarily in this shell session run: 'rvm use ruby-2.1.0-rc1'.
ruby-2.0.0-p353 - #removing src.
Checking requirements for cygwin.
Requirements installation successful.
Installing Ruby from source to: /home/jverhoeven/.rvm/rubies/ruby-2.0.0-p353, this may take a while depending on your cpu(s)...
ruby-2.0.0-p353 - #downloading ruby-2.0.0-p353, this may take a while depending on your connection...
ruby-2.0.0-p353 - #extracting ruby-2.0.0-p353 to /home/jverhoeven/.rvm/src/ruby-2.0.0-p353.
ruby-2.0.0-p353 - #applying patch /home/jverhoeven/changeset_r44905.diff.
ruby-2.0.0-p353 - #applying patch /home/jverhoeven/.rvm/patches/ruby/GH-488.patch.
ruby-2.0.0-p353 - #configuring.................................................
ruby-2.0.0-p353 - #post-configuration.
ruby-2.0.0-p353 - #compiling....................................................
Error running '__rvm_make -j8',
content of log /home/jverhoeven/.rvm/log/1392200714_ruby-2.0.0-p353/make.log
[2014-02-12 11:38:27] __rvm_make
__rvm_make ()
{
\make "$@" || return $?
}
current path: /home/jverhoeven/.rvm/src/ruby-2.0.0-p353
GEM_HOME=/home/jverhoeven/.rvm/gems/ruby-2.1.0-rc1
PATH=/home/jverhoeven/bin:/home/jverhoeven/.rvm/gems/ruby-2.1.0-rc1/bin:/home/jverhoeven/.rvm/gems/ruby-2.1.0-rc1@global/bin:/home/jverhoeven/.rvm/rubies/ruby-2.1.0-rc1/bin:/usr/local/bin:/usr/bin:/cygdrive/c/Windows/system32:/cygdrive/c/Windows:/cygdrive/c/Windows/System32/Wbem:/cygdrive/c/Windows/System32/WindowsPowerShell/v1.0:/cygdrive/c/Program Files (x86)/Common Files/Acronis/SnapAPI:/cygdrive/c/Program Files/Oracle/VirtualBox:/cygdrive/c/Program Files (x86)/Puppet Labs/Puppet Enterprise/bin:/cygdrive/c/Program Files/TortoiseGit/bin:/cygdrive/c/Program Files (x86)/vim/bin:/cygdrive/d/HashiCorp/Vagrant/bin:/cygdrive/c/Program Files/WIDCOMM/Bluetooth Software:/cygdrive/c/Program Files/WIDCOMM/Bluetooth Software/syswow64:/cygdrive/c/Chocolatey/bin:/cygdrive/c/HashiCorp/packer:/usr/lib/lapack:/home/jverhoeven/.rvm/bin:/home/jverhoeven/.rvm/bin
GEM_PATH=/home/jverhoeven/.rvm/gems/ruby-2.1.0-rc1:/home/jverhoeven/.rvm/gems/ruby-2.1.0-rc1@global
command(2): __rvm_make -j8
CC = gcc
LD = ld
LDSHARED = gcc -shared
CFLAGS = -O3 -fno-fast-math -ggdb3 -Wall -Wextra -Wno-unused-parameter -Wno-parentheses -Wno-long-long -Wno-missing-field-initializers -Wunused-variable -Wpointer-arith -Wwrite-strings -Wdeclaration-after-statement -Wimplicit-function-declaration
XCFLAGS = -include ruby/config.h -include ruby/missing.h -D_FORTIFY_SOURCE=2 -fstack-protector -fno-strict-overflow -fvisibility=hidden -DRUBY_EXPORT
CPPFLAGS = -I. -I.ext/include/x86_64-cygwin -I./include -I.
DLDFLAGS = -Wl,--enable-auto-image-base,--enable-auto-import -Wl,--out-implib=libruby200.dll.a cygruby200.def -fstack-protector -Wl,--stack,0x00200000,--enable-auto-import
SOLIBS = cygruby200.res.o -lpthread -lrt -ldl -lcrypt
compiling main.c
compiling dmydln.c
compiling dmyencoding.c
compiling version.c
compiling miniprelude.c
copying dummy probes.h
compiling bignum.c
compiling class.c
compiling compar.c
compiling complex.c
compiling dir.c
compiling dln_find.c
compiling enum.c
compiling enumerator.c
compiling error.c
compiling eval.c
compiling load.c
compiling proc.c
compiling file.c
compiling gc.c
compiling hash.c
compiling inits.c
compiling io.c
compiling marshal.c
compiling math.c
compiling node.c
compiling numeric.c
compiling object.c
compiling pack.c
compiling parse.c
compiling process.c
compiling random.c
compiling range.c
compiling rational.c
compiling re.c
compiling regcomp.c
compiling regenc.c
compiling regerror.c
compiling regexec.c
compiling regparse.c
compiling regsyntax.c
compiling ruby.c
compiling safe.c
compiling signal.c
compiling sprintf.c
compiling st.c
compiling strftime.c
compiling string.c
compiling struct.c
compiling time.c
compiling transcode.c
compiling util.c
compiling variable.c
compiling compile.c
compiling debug.c
compiling iseq.c
compiling vm.c
compiling vm_dump.c
compiling vm_backtrace.c
compiling vm_trace.c
compiling thread.c
compiling cont.c
compiling ./enc/ascii.c
compiling ./enc/us_ascii.c
compiling ./enc/unicode.c
compiling ./enc/utf_8.c
compiling newline.c
compiling ./missing/langinfo.c
compiling ./missing/setproctitle.c
compiling dmyext.c
compiling dln.c
compiling encoding.c
compiling dmyversion.c
compiling array.c
In file included from vm.c:82:0:
vm_eval.c: In functie ‘rb_catch_obj.constprop.54’:
vm_eval.c:1816:20: let op: argument ‘tag’ might be clobbered by ‘longjmp’ or ‘vfork’ [-Wclobbered]
rb_catch_obj(VALUE tag, VALUE (*func)(), VALUE data)
^
linking miniruby.exe
generating encdb.h
rbconfig.rb updated
generating enc.mk
generating prelude.c
generating cygruby200.rc
encdb.h unchanged
compiling cygruby200.res.o
compiling prelude.c
making srcs under enc
make[1]: Map '/home/jverhoeven/.rvm/src/ruby-2.0.0-p353' wordt binnengegaan
make[1]: Er hoeft niets gedaan te worden voor 'srcs'.
make[1]: Map '/home/jverhoeven/.rvm/src/ruby-2.0.0-p353' wordt verlaten
generating transdb.h
linking static-library libruby200-static.a
verifying static-library libruby200-static.a
transdb.h unchanged
generating cygruby200.def
linking shared-library cygruby200.dll
making enc
making trans
generating makefile exts.mk
make[1]: Map '/home/jverhoeven/.rvm/src/ruby-2.0.0-p353' wordt binnengegaan
make[1]: Map '/home/jverhoeven/.rvm/src/ruby-2.0.0-p353' wordt binnengegaan
compiling ./enc/encdb.c
compiling ./enc/big5.c
compiling ./enc/trans/transdb.c
compiling ./enc/trans/big5.c
compiling ./enc/emacs_mule.c
compiling ./enc/trans/chinese.c
compiling ./enc/cp949.c
configuring -test-/array/resize
configuring -test-/bug-3571
compiling ./enc/trans/emoji.c
configuring -test-/bug-3662
configuring -test-/bug-5832
compiling ./enc/euc_jp.c
configuring -test-/debug
configuring -test-/exception
compiling ./enc/trans/emoji_iso2022_kddi.c
configuring -test-/fatal
compiling ./enc/trans/emoji_sjis_docomo.c
configuring -test-/funcall
configuring -test-/iter
configuring -test-/load/dot.dot
configuring -test-/marshal/compat
configuring -test-/marshal/usr
configuring -test-/method
configuring -test-/num2int
compiling ./enc/trans/emoji_sjis_kddi.c
configuring -test-/old_thread_select
compiling ./enc/euc_kr.c
compiling ./enc/euc_tw.c
compiling ./enc/trans/emoji_sjis_softbank.c
compiling ./enc/gb2312.c
configuring -test-/path_to_class
compiling ./enc/gb18030.c
configuring -test-/printf
compiling ./enc/gbk.c
configuring -test-/st/numhash
configuring -test-/st/update
configuring -test-/string
configuring -test-/symbol
configuring -test-/typeddata
configuring -test-/wait_for_single_fd
compiling ./enc/trans/escape.c
configuring -test-/win32/dln
Failed to configure -test-/win32/dln. It will not be installed.
compiling ./enc/iso_8859_1.c
configuring -test-/win32/fd_setsize
Failed to configure -test-/win32/fd_setsize. It will not be installed.
configuring bigdecimal
compiling ./enc/trans/gb18030.c
compiling ./enc/trans/gbk.c
compiling ./enc/iso_8859_2.c
compiling ./enc/trans/iso2022.c
compiling ./enc/iso_8859_3.c
compiling ./enc/iso_8859_4.c
compiling ./enc/iso_8859_5.c
compiling ./enc/trans/japanese.c
compiling ./enc/trans/japanese_euc.c
compiling ./enc/iso_8859_6.c
compiling ./enc/trans/japanese_sjis.c
compiling ./enc/trans/korean.c
compiling ./enc/iso_8859_7.c
configuring continuation
configuring coverage
configuring curses
compiling ./enc/iso_8859_8.c
compiling ./enc/iso_8859_9.c
compiling ./enc/iso_8859_10.c
compiling ./enc/trans/single_byte.c
compiling ./enc/iso_8859_11.c
compiling ./enc/iso_8859_13.c
compiling ./enc/trans/utf8_mac.c
compiling ./enc/iso_8859_14.c
compiling ./enc/iso_8859_15.c
compiling ./enc/trans/utf_16_32.c
compiling ./enc/iso_8859_16.c
compiling ./enc/koi8_r.c
compiling ./enc/koi8_u.c
linking transcoder transdb.so
compiling ./enc/shift_jis.c
linking transcoder chinese.so
compiling ./enc/utf_16be.c
linking transcoder emoji.so
compiling ./enc/utf_16le.c
compiling ./enc/utf_32be.c
linking transcoder emoji_iso2022_kddi.so
linking transcoder emoji_sjis_docomo.so
linking transcoder emoji_sjis_kddi.so
linking transcoder emoji_sjis_softbank.so
header: ncurses.h
library: ncursesw
compiling ./enc/utf_32le.c
compiling ./enc/windows_31j.c
compiling ./enc/windows_1251.c
linking transcoder escape.so
linking transcoder gb18030.so
linking encoding encdb.so
linking encoding big5.so
linking transcoder gbk.so
linking encoding cp949.so
linking encoding emacs_mule.so
linking transcoder iso2022.so
linking transcoder japanese.so
linking encoding euc_jp.so
linking transcoder japanese_euc.so
linking encoding euc_kr.so
linking transcoder japanese_sjis.so
linking encoding euc_tw.so
linking transcoder korean.so
linking encoding gb2312.so
linking transcoder single_byte.so
linking transcoder utf8_mac.so
linking encoding gb18030.so
linking encoding gbk.so
linking transcoder utf_16_32.so
linking encoding iso_8859_1.so
linking transcoder big5.so
linking encoding iso_8859_2.so
linking encoding iso_8859_3.so
linking encoding iso_8859_4.so
linking encoding iso_8859_5.so
linking encoding iso_8859_6.so
linking encoding iso_8859_7.so
linking encoding iso_8859_8.so
make[1]: Map '/home/jverhoeven/.rvm/src/ruby-2.0.0-p353' wordt verlaten
linking encoding iso_8859_9.so
linking encoding iso_8859_10.so
linking encoding iso_8859_11.so
linking encoding iso_8859_13.so
linking encoding iso_8859_14.so
linking encoding iso_8859_15.so
linking encoding iso_8859_16.so
linking encoding koi8_r.so
linking encoding koi8_u.so
linking encoding shift_jis.so
linking encoding utf_16be.so
linking encoding utf_16le.so
linking encoding utf_32be.so
linking encoding utf_32le.so
linking encoding windows_31j.so
linking encoding windows_1251.so
make[1]: Map '/home/jverhoeven/.rvm/src/ruby-2.0.0-p353' wordt verlaten
making encs
make[1]: Map '/home/jverhoeven/.rvm/src/ruby-2.0.0-p353' wordt binnengegaan
make[1]: Map '/home/jverhoeven/.rvm/src/ruby-2.0.0-p353' wordt verlaten
configuring date
configuring dbm
header: ndbm.h
library: gdbm_compat
configuring digest
configuring digest/bubblebabble
configuring digest/md5
configuring digest/rmd160
configuring digest/sha1
configuring digest/sha2
configuring dl
configuring dl/callback
configuring dl/win32
configuring etc
configuring fcntl
configuring fiber
configuring fiddle
configuring fiddle/win32
configuring gdbm
configuring io/console
configuring io/nonblock
configuring io/wait
configuring json
configuring json/generator
configuring json/parser
configuring mathn/complex
configuring mathn/rational
configuring nkf
configuring objspace
configuring openssl
configuring pathname
configuring psych
configuring pty
configuring racc/cparse
configuring readline
configuring ripper
configuring sdbm
configuring socket
configuring stringio
configuring strscan
configuring syslog
configuring tk/tkutil
Failed to configure tk/tkutil. It will not be installed.
configuring win32ole
configuring zlib
make[1]: Map '/home/jverhoeven/.rvm/src/ruby-2.0.0-p353' wordt binnengegaan
make[2]: Map '/home/jverhoeven/.rvm/src/ruby-2.0.0-p353/ext/-test-/array/resize' wordt binnengegaan
make[2]: Map '/home/jverhoeven/.rvm/src/ruby-2.0.0-p353/ext/-test-/bug-3571' wordt binnengegaan
compiling resize.c
make[2]: Map '/home/jverhoeven/.rvm/src/ruby-2.0.0-p353/ext/-test-/bug-3662' wordt binnengegaan
compiling bug.c
make[2]: Map '/home/jverhoeven/.rvm/src/ruby-2.0.0-p353/ext/-test-/bug-5832' wordt binnengegaan
make[2]: Map '/home/jverhoeven/.rvm/src/ruby-2.0.0-p353/ext/-test-/debug' wordt binnengegaan
make[2]: Map '/home/jverhoeven/.rvm/src/ruby-2.0.0-p353/ext/-test-/exception' wordt binnengegaan
compiling bug.c
make[2]: Map '/home/jverhoeven/.rvm/src/ruby-2.0.0-p353/ext/-test-/fatal' wordt binnengegaan
compiling enc_raise.c
compiling init.c
compiling bug.c
compiling rb_fatal.c
make[2]: Map '/home/jverhoeven/.rvm/src/ruby-2.0.0-p353/ext/-test-/funcall' wordt binnengegaan
compiling passing_block.c
compiling ensured.c
installing default bug libraries
linking shared-object -test-/bug-3571/bug.so
compiling inspector.c
installing default bug libraries
linking shared-object -test-/bug-5832/bug.so
installing default rb_fatal libraries
installing default bug libraries
installing default resize libraries
linking shared-object -test-/fatal/rb_fatal.so
linking shared-object -test-/bug-3662/bug.so
linking shared-object -test-/array/resize.so
installing default funcall libraries
linking shared-object -test-/funcall/funcall.so
compiling init.c
installing default debug libraries
make[2]: Map '/home/jverhoeven/.rvm/src/ruby-2.0.0-p353/ext/-test-/bug-3571' wordt verlaten
linking shared-object -test-/debug.so
make[2]: Map '/home/jverhoeven/.rvm/src/ruby-2.0.0-p353/ext/-test-/bug-5832' wordt verlaten
installing default exception libraries
make[2]: Map '/home/jverhoeven/.rvm/src/ruby-2.0.0-p353/ext/-test-/iter' wordt binnengegaan
compiling break.c
make[2]: Map '/home/jverhoeven/.rvm/src/ruby-2.0.0-p353/ext/-test-/array/resize' wordt verlaten
make[2]: Map '/home/jverhoeven/.rvm/src/ruby-2.0.0-p353/ext/-test-/load/dot.dot' wordt binnengegaan
compiling dot.dot.c
linking shared-object -test-/exception.so
make[2]: Map '/home/jverhoeven/.rvm/src/ruby-2.0.0-p353/ext/-test-/funcall' wordt verlaten
installing default break libraries
make[2]: Map '/home/jverhoeven/.rvm/src/ruby-2.0.0-p353/ext/-test-/bug-3662' wordt verlaten
installing default dot.dot libraries
make[2]: Map '/home/jverhoeven/.rvm/src/ruby-2.0.0-p353/ext/-test-/marshal/compat' wordt binnengegaan
make[2]: Map '/home/jverhoeven/.rvm/src/ruby-2.0.0-p353/ext/-test-/fatal' wordt verlaten
compiling usrcompat.c
make[2]: Map '/home/jverhoeven/.rvm/src/ruby-2.0.0-p353/ext/-test-/marshal/usr' wordt binnengegaan
compiling usrmarshal.c
make[2]: Map '/home/jverhoeven/.rvm/src/ruby-2.0.0-p353/ext/-test-/method' wordt binnengegaan
make[2]: Map '/home/jverhoeven/.rvm/src/ruby-2.0.0-p353/ext/-test-/debug' wordt verlaten
compiling arity.c
linking shared-object -test-/load/dot.dot/dot.dot.so
installing default usr libraries
make[2]: Map '/home/jverhoeven/.rvm/src/ruby-2.0.0-p353/ext/-test-/num2int' wordt binnengegaan
compiling init.c
compiling num2int.c
make[2]: Map '/home/jverhoeven/.rvm/src/ruby-2.0.0-p353/ext/-test-/exception' wordt verlaten
linking shared-object -test-/iter/break.so
installing default compat libraries
linking shared-object -test-/marshal/compat.so
linking shared-object -test-/marshal/usr.so
installing default num2int libraries
make[2]: Map '/home/jverhoeven/.rvm/src/ruby-2.0.0-p353/ext/-test-/old_thread_select' wordt binnengegaan
compiling old_thread_select.c
make[2]: Map '/home/jverhoeven/.rvm/src/ruby-2.0.0-p353/ext/-test-/load/dot.dot' wordt verlaten
make[2]: Map '/home/jverhoeven/.rvm/src/ruby-2.0.0-p353/ext/-test-/path_to_class' wordt binnengegaan
installing default method libraries
compiling path_to_class.c
linking shared-object -test-/method.so
linking shared-object -test-/num2int/num2int.so
make[2]: Map '/home/jverhoeven/.rvm/src/ruby-2.0.0-p353/ext/-test-/printf' wordt binnengegaan
compiling printf.c
make[2]: Map '/home/jverhoeven/.rvm/src/ruby-2.0.0-p353/ext/-test-/marshal/compat' wordt verlaten
make[2]: Map '/home/jverhoeven/.rvm/src/ruby-2.0.0-p353/ext/-test-/iter' wordt verlaten
installing default old_thread_select libraries
make[2]: Map '/home/jverhoeven/.rvm/src/ruby-2.0.0-p353/ext/-test-/marshal/usr' wordt verlaten
installing default path_to_class libraries
installing default printf libraries
linking shared-object -test-/path_to_class/path_to_class.so
make[2]: Map '/home/jverhoeven/.rvm/src/ruby-2.0.0-p353/ext/-test-/st/numhash' wordt binnengegaan
compiling numhash.c
make[2]: Map '/home/jverhoeven/.rvm/src/ruby-2.0.0-p353/ext/-test-/method' wordt verlaten
make[2]: Map '/home/jverhoeven/.rvm/src/ruby-2.0.0-p353/ext/-test-/st/update' wordt binnengegaan
make[2]: Map '/home/jverhoeven/.rvm/src/ruby-2.0.0-p353/ext/-test-/string' wordt binnengegaan
compiling update.c
compiling coderange.c
make[2]: Map '/home/jverhoeven/.rvm/src/ruby-2.0.0-p353/ext/-test-/num2int' wordt verlaten
linking shared-object -test-/old_thread_select/old_thread_select.so
make[2]: Map '/home/jverhoeven/.rvm/src/ruby-2.0.0-p353/ext/-test-/symbol' wordt binnengegaan
compiling init.c
linking shared-object -test-/printf.so
compiling cstr.c
make[2]: Map '/home/jverhoeven/.rvm/src/ruby-2.0.0-p353/ext/-test-/path_to_class' wordt verlaten
installing default numhash libraries
compiling intern.c
installing default update libraries
linking shared-object -test-/st/update.so
linking shared-object -test-/st/numhash.so
make[2]: Map '/home/jverhoeven/.rvm/src/ruby-2.0.0-p353/ext/-test-/printf' wordt verlaten
make[2]: Map '/home/jverhoeven/.rvm/src/ruby-2.0.0-p353/ext/-test-/typeddata' wordt binnengegaan
compiling ellipsize.c
compiling typeddata.c
compiling enc_associate.c
make[2]: Map '/home/jverhoeven/.rvm/src/ruby-2.0.0-p353/ext/-test-/wait_for_single_fd' wordt binnengegaan
make[2]: Map '/home/jverhoeven/.rvm/src/ruby-2.0.0-p353/ext/-test-/old_thread_select' wordt verlaten
compiling wait_for_single_fd.c
installing default symbol libraries
make[2]: Map '/home/jverhoeven/.rvm/src/ruby-2.0.0-p353/ext/-test-/st/update' wordt verlaten
make[2]: Map '/home/jverhoeven/.rvm/src/ruby-2.0.0-p353/ext/-test-/st/numhash' wordt verlaten
compiling enc_str_buf_cat.c
linking shared-object -test-/symbol/symbol.so
installing default typeddata libraries
compiling init.c
make[2]: Map '/home/jverhoeven/.rvm/src/ruby-2.0.0-p353/ext/-test-/win32/dln' wordt binnengegaan
make[2]: Er hoeft niets gedaan te worden voor 'all'.
make[2]: Map '/home/jverhoeven/.rvm/src/ruby-2.0.0-p353/ext/-test-/win32/dln' wordt verlaten
installing default wait_for_single_fd libraries
linking shared-object -test-/typeddata/typeddata.so
make[2]: Map '/home/jverhoeven/.rvm/src/ruby-2.0.0-p353/ext/-test-/win32/fd_setsize' wordt binnengegaan
make[2]: Er hoeft niets gedaan te worden voor 'all'.
make[2]: Map '/home/jverhoeven/.rvm/src/ruby-2.0.0-p353/ext/-test-/win32/fd_setsize' wordt verlaten
compiling modify.c
make[2]: Map '/home/jverhoeven/.rvm/src/ruby-2.0.0-p353/ext/bigdecimal' wordt binnengegaan
make[2]: Map '/home/jverhoeven/.rvm/src/ruby-2.0.0-p353/ext/continuation' wordt binnengegaan
compiling bigdecimal.c
linking shared-object -test-/wait_for_single_fd/wait_for_single_fd.so
compiling continuation.c
make[2]: Map '/home/jverhoeven/.rvm/src/ruby-2.0.0-p353/ext/-test-/symbol' wordt verlaten
compiling qsort.c
make[2]: Map '/home/jverhoeven/.rvm/src/ruby-2.0.0-p353/ext/-test-/typeddata' wordt verlaten
installing default continuation libraries
linking shared-object continuation.so
compiling set_len.c
make[2]: Map '/home/jverhoeven/.rvm/src/ruby-2.0.0-p353/ext/coverage' wordt binnengegaan
compiling coverage.c
make[2]: Map '/home/jverhoeven/.rvm/src/ruby-2.0.0-p353/ext/curses' wordt binnengegaan
compiling curses.c
make[2]: Map '/home/jverhoeven/.rvm/src/ruby-2.0.0-p353/ext/-test-/wait_for_single_fd' wordt verlaten
installing default bigdecimal libraries
make[2]: Map '/home/jverhoeven/.rvm/src/ruby-2.0.0-p353/ext/date' wordt binnengegaan
installing default coverage libraries
compiling date_core.c
installing default curses libraries
installing default string libraries
make[2]: Map '/home/jverhoeven/.rvm/src/ruby-2.0.0-p353/ext/dbm' wordt binnengegaan
compiling date_parse.c
linking shared-object -test-/string/string.so
compiling dbm.c
make[2]: Map '/home/jverhoeven/.rvm/src/ruby-2.0.0-p353/ext/continuation' wordt verlaten
linking shared-object coverage.so
compiling date_strftime.c
make[2]: Map '/home/jverhoeven/.rvm/src/ruby-2.0.0-p353/ext/-test-/string' wordt verlaten
make[2]: Map '/home/jverhoeven/.rvm/src/ruby-2.0.0-p353/ext/coverage' wordt verlaten
compiling date_strptime.c
make[2]: Map '/home/jverhoeven/.rvm/src/ruby-2.0.0-p353/ext/digest' wordt binnengegaan
compiling digest.c
installing default dbm libraries
linking shared-object dbm.so
linking shared-object digest.so
make[2]: Map '/home/jverhoeven/.rvm/src/ruby-2.0.0-p353/ext/dbm' wordt verlaten
make[2]: Map '/home/jverhoeven/.rvm/src/ruby-2.0.0-p353/ext/digest/bubblebabble' wordt binnengegaan
compiling bubblebabble.c
installing digest libraries
make[2]: Map '/home/jverhoeven/.rvm/src/ruby-2.0.0-p353/ext/digest/md5' wordt binnengegaan
compiling md5init.c
make[2]: Map '/home/jverhoeven/.rvm/src/ruby-2.0.0-p353/ext/digest/rmd160' wordt binnengegaan
compiling rmd160init.c
installing default digest libraries
make[2]: Map '/home/jverhoeven/.rvm/src/ruby-2.0.0-p353/ext/digest' wordt verlaten
compiling md5ossl.c
installing default bubblebabble libraries
linking shared-object digest/bubblebabble.so
compiling rmd160.c
installing default md5 libraries
linking shared-object digest/md5.so
make[2]: Map '/home/jverhoeven/.rvm/src/ruby-2.0.0-p353/ext/digest/sha1' wordt binnengegaan
compiling sha1init.c
make[2]: Map '/home/jverhoeven/.rvm/src/ruby-2.0.0-p353/ext/digest/bubblebabble' wordt verlaten
linking shared-object curses.so
compiling sha1ossl.c
make[2]: Map '/home/jverhoeven/.rvm/src/ruby-2.0.0-p353/ext/digest/md5' wordt verlaten
installing default rmd160 libraries
curses.o:curses.c:(.rdata$.refptr.COLOR_PAIRS[.refptr.COLOR_PAIRS]+0x0): undefined reference to `COLOR_PAIRS'
curses.o:curses.c:(.rdata$.refptr.COLORS[.refptr.COLORS]+0x0): undefined reference to `COLORS'
curses.o:curses.c:(.rdata$.refptr.ESCDELAY[.refptr.ESCDELAY]+0x0): undefined reference to `ESCDELAY'
curses.o:curses.c:(.rdata$.refptr.TABSIZE[.refptr.TABSIZE]+0x0): undefined reference to `TABSIZE'
curses.o:curses.c:(.rdata$.refptr.COLS[.refptr.COLS]+0x0): undefined reference to `COLS'
curses.o:curses.c:(.rdata$.refptr.LINES[.refptr.LINES]+0x0): undefined reference to `LINES'
curses.o:curses.c:(.rdata$.refptr.stdscr[.refptr.stdscr]+0x0): undefined reference to `stdscr'
collect2: fout: ld gaf exit-status 1 terug
Makefile:235: recept voor doel '../../.ext/x86_64-cygwin/curses.so' is mislukt
make[2]: *** [../../.ext/x86_64-cygwin/curses.so] Fout 1
make[2]: Map '/home/jverhoeven/.rvm/src/ruby-2.0.0-p353/ext/curses' wordt verlaten
exts.mk:116: recept voor doel 'ext/curses/all' is mislukt
make[1]: *** [ext/curses/all] Fout 2
make[1]: *** Wachten op onvoltooide taken...
make[2]: Map '/home/jverhoeven/.rvm/src/ruby-2.0.0-p353/ext/digest/sha2' wordt binnengegaan
compiling sha2init.c
installing default sha1 libraries
installing default date_core libraries
compiling sha2ossl.c
installing default sha2 libraries
linking shared-object digest/rmd160.so
linking shared-object digest/sha1.so
linking shared-object digest/sha2.so
make[2]: Map '/home/jverhoeven/.rvm/src/ruby-2.0.0-p353/ext/digest/rmd160' wordt verlaten
make[2]: Map '/home/jverhoeven/.rvm/src/ruby-2.0.0-p353/ext/digest/sha1' wordt verlaten
make[2]: Map '/home/jverhoeven/.rvm/src/ruby-2.0.0-p353/ext/digest/sha2' wordt verlaten
linking shared-object bigdecimal.so
make[2]: Map '/home/jverhoeven/.rvm/src/ruby-2.0.0-p353/ext/bigdecimal' wordt verlaten
linking shared-object date_core.so
make[2]: Map '/home/jverhoeven/.rvm/src/ruby-2.0.0-p353/ext/date' wordt verlaten
make[1]: Map '/home/jverhoeven/.rvm/src/ruby-2.0.0-p353' wordt verlaten
uncommon.mk:179: recept voor doel 'build-ext' is mislukt
make: *** [build-ext] Fout 2
There has been an error while running make. Halting the installation.
Sign up for free to join this conversation on GitHub. Already have an account? Sign in to comment
You can’t perform that action at this time.