Skip to content

Instantly share code, notes, and snippets.

Embed
What would you like to do?
daleharvey@DESKTOP-UELI0OF ~/src/gecko-dev
$ ./mach build
0:01.92 Clobber not needed.
0:01.99 Adding make options from None
MOZ_OBJDIR=c:/Users/daleharvey/src/gecko-dev/obj-i686-pc-mingw32
OBJDIR=c:/Users/daleharvey/src/gecko-dev/obj-i686-pc-mingw32
0:02.08 c:\mozilla-build\mozmake\mozmake.EXE -f client.mk -s configure
0:02.62 cd c:/Users/daleharvey/src/gecko-dev/obj-i686-pc-mingw32
0:02.82 c:/Users/daleharvey/src/gecko-dev/configure
0:03.07 Reexecuting in the virtualenv
0:03.42 checking for vcs source checkout... git
0:03.60 checking for a shell... C:/mozilla-build/msys/bin/sh.exe
0:04.10 checking for host system type... x86_64-pc-mingw64
0:04.14 checking for target system type... x86_64-pc-mingw64
0:04.14 checking for a shell... C:/mozilla-build/msys/bin/sh.exe
0:04.66 checking for host system type... x86_64-pc-mingw64
0:04.73 checking for target system type... x86_64-pc-mingw64
0:04.75 checking for vcs source checkout... git
0:04.75 checking whether cross compiling... no
0:04.85 checking for the target C compiler... 'C:/PROGRA~2/MICROS~1/2017/COMMUN~1/VC/Tools/MSVC/1413~1.261/bin/HostX64/x64/cl.exe'
0:04.93 checking whether the target C compiler can be used... yes
0:05.48 checking for Python 3... C:\mozilla-build\python3\python3.EXE (3.6.3)
0:05.50 checking for git... 'C:/PROGRA~1/Git/mingw64/bin/git.exe'
0:05.63 checking for Git version... 2.16.1.windows.4
0:05.65 checking for sparse checkout... no
0:05.68 checking for pkg_config... not found
0:05.71 checking for yasm... C:/mozilla-build/yasm/yasm.exe
0:05.77 checking yasm version... 1.3.0
0:05.80 checking the target C compiler version... 19.13.26129
0:05.88 checking the target C compiler works... yes
0:05.92 checking for the target C++ compiler... 'C:/PROGRA~2/MICROS~1/2017/COMMUN~1/VC/Tools/MSVC/1413~1.261/bin/HostX64/x64/cl.exe'
0:05.97 checking whether the target C++ compiler can be used... yes
0:05.98 checking the target C++ compiler version... 19.13.26129
0:06.05 checking the target C++ compiler works... yes
0:06.08 checking for the host C compiler... 'C:/PROGRA~2/MICROS~1/2017/COMMUN~1/VC/Tools/MSVC/1413~1.261/bin/HostX64/x64/cl.exe'
0:06.13 checking whether the host C compiler can be used... yes
0:06.13 checking the host C compiler version... 19.13.26129
0:06.19 checking the host C compiler works... yes
0:06.23 checking for the host C++ compiler... 'C:/PROGRA~2/MICROS~1/2017/COMMUN~1/VC/Tools/MSVC/1413~1.261/bin/HostX64/x64/cl.exe'
0:06.28 checking whether the host C++ compiler can be used... yes
0:06.28 checking the host C++ compiler version... 19.13.26129
0:06.35 checking the host C++ compiler works... yes
0:06.43 checking for 64-bit OS... yes
0:06.43 checking bindgen cflags... no
0:06.48 checking for Windows SDK... 0x0a00 in 'C:\Program Files (x86)\Windows Kits\10\'
0:06.52 checking for Universal CRT SDK... 10.0.16299.0 in 'C:\Program Files (x86)\Windows Kits\10\'
0:06.52 checking for the Debug Interface Access SDK... C:/PROGRA~2/MICROS~1/2017/COMMUN~1/DIA SDK
0:06.53 checking for mt... 'C:/PROGRA~2/WI3CF2~1/10/bin/100162~1.0/x64/mt.exe'
0:06.57 checking whether MT is really Microsoft Manifest Tool... yes
0:06.58 checking for linker... 'C:/PROGRA~1/Git/usr/bin/link.exe'
0:06.58 checking for makecab... C:/Windows/System32/makecab.exe
0:06.62 checking for fxc... 'C:/PROGRA~2/WI3CF2~1/10/bin/100162~1.0/x64/fxc.exe'
0:06.67 checking for stdint.h... yes
0:07.13 checking for inttypes.h... yes
0:07.21 checking for malloc.h... yes
0:07.29 checking for alloca.h... no
0:07.38 checking for perf_event_open system call... no
0:07.41 checking for rustc... C:/Users/daleharvey/.cargo/bin/rustc.exe
0:07.42 checking for cargo... C:/Users/daleharvey/.cargo/bin/cargo.exe
0:07.49 checking rustc version... 1.24.1
0:07.53 checking cargo version... 0.25.0
0:08.07 checking for tar... 'C:/PROGRA~1/Git/usr/bin/tar.exe'
0:08.20 checking for unzip... 'C:/PROGRA~1/Git/usr/bin/unzip.exe'
0:08.30 checking for zip... C:/mozilla-build/info-zip/zip.exe
0:08.37 checking for gn... not found
0:08.38 checking for the Mozilla API key... no
0:08.45 checking for the Google API key... no
0:08.47 checking for the Bing API key... no
0:08.47 checking for the Adjust SDK key... no
0:08.48 checking for the Leanplum SDK key... no
0:08.48 checking for the Pocket API key... no
0:08.48 checking for llvm-config... C:/Users/daleharvey/.mozbuild/clang/bin/llvm-config.exe
0:08.52 checking for awk... 'C:/PROGRA~1/Git/usr/bin/gawk.exe'
0:08.52 checking for perl... 'C:/PROGRA~1/Git/usr/bin/perl.exe'
0:08.54 checking for minimum required perl version >= 5.006... 5.026001
0:08.58 checking for full perl installation... yes
0:08.60 checking for gmake... c:/mozilla-build/mozmake/mozmake.EXE
0:08.62 checking for watchman... C:/mozilla-build/watchman/watchman.exe
0:08.62 checking for watchman version... 4.9.0
0:08.62 checking for xargs... 'C:/PROGRA~1/Git/usr/bin/xargs.exe'
0:08.63 checking for makensisu... C:/mozilla-build/nsis-3.01/makensis-3.01.exe
0:08.65 checking for NSIS version... 3.01
0:08.66 checking for 32-bit NSIS... yes
0:08.66 checking for 7z... C:/mozilla-build/7zip/7z.exe
0:08.67 checking for autoconf... C:/mozilla-build/msys/local/bin/autoconf-2.13
0:08.67 Refreshing c:/Users/daleharvey/src/gecko-dev/old-configure with C:/mozilla-build/msys/local/bin/autoconf-2.13
0:08.73 /usr/bin/sed: -e expression #1, char 10: unterminated `s' command
0:08.85 autoconf: Undefined macros:
0:08.91 /usr/bin/grep: nul: No such file or directory
0:08.95 /usr/bin/grep: nul: No such file or directory
0:08.99 /usr/bin/grep: nul: No such file or directory
0:09.02 /usr/bin/grep: nul: No such file or directory
0:09.04 /usr/bin/grep: nul: No such file or directory
0:09.08 /usr/bin/grep: nul: No such file or directory
0:09.11 /usr/bin/grep: nul: No such file or directory
0:09.13 /usr/bin/grep: nul: No such file or directory
0:09.16 /usr/bin/grep: nul: No such file or directory
0:09.20 /usr/bin/grep: nul: No such file or directory
0:09.24 /usr/bin/grep: nul: No such file or directory
0:09.26 /usr/bin/grep: nul: No such file or directory
0:09.32 /usr/bin/grep: nul: No such file or directory
0:09.35 /usr/bin/grep: nul: No such file or directory
0:09.40 /usr/bin/grep: nul: No such file or directory
0:09.43 /usr/bin/grep: nul: No such file or directory
0:09.46 /usr/bin/grep: nul: No such file or directory
0:09.51 /usr/bin/grep: nul: No such file or directory
0:09.56 /usr/bin/grep: nul: No such file or directory
0:09.59 /usr/bin/grep: nul: No such file or directory
0:09.62 /usr/bin/grep: nul: No such file or directory
0:09.65 /usr/bin/grep: nul: No such file or directory
0:09.69 /usr/bin/grep: nul: No such file or directory
0:09.72 /usr/bin/grep: nul: No such file or directory
0:09.75 /usr/bin/grep: nul: No such file or directory
0:09.79 /usr/bin/grep: nul: No such file or directory
0:09.83 /usr/bin/grep: nul: No such file or directory
0:09.86 /usr/bin/grep: nul: No such file or directory
0:09.90 /usr/bin/grep: nul: No such file or directory
0:09.94 /usr/bin/grep: nul: No such file or directory
0:09.98 /usr/bin/grep: nul: No such file or directory
0:10.01 /usr/bin/grep: nul: No such file or directory
0:10.05 /usr/bin/grep: nul: No such file or directory
0:10.08 /usr/bin/grep: nul: No such file or directory
0:10.11 /usr/bin/grep: nul: No such file or directory
0:10.15 /usr/bin/grep: nul: No such file or directory
0:10.18 /usr/bin/grep: nul: No such file or directory
0:10.21 /usr/bin/grep: nul: No such file or directory
0:10.25 /usr/bin/grep: nul: No such file or directory
0:10.28 /usr/bin/grep: nul: No such file or directory
0:10.32 /usr/bin/grep: nul: No such file or directory
0:10.35 /usr/bin/grep: nul: No such file or directory
0:10.38 /usr/bin/grep: nul: No such file or directory
0:10.41 /usr/bin/grep: nul: No such file or directory
0:10.44 /usr/bin/grep: nul: No such file or directory
0:10.47 /usr/bin/grep: nul: No such file or directory
0:10.51 /usr/bin/grep: nul: No such file or directory
0:10.54 /usr/bin/grep: nul: No such file or directory
0:10.58 /usr/bin/grep: nul: No such file or directory
0:10.61 /usr/bin/grep: nul: No such file or directory
0:10.64 /usr/bin/grep: nul: No such file or directory
0:10.67 /usr/bin/grep: nul: No such file or directory
0:10.72 /usr/bin/grep: nul: No such file or directory
0:10.74 /usr/bin/grep: nul: No such file or directory
0:10.77 /usr/bin/grep: nul: No such file or directory
0:10.82 /usr/bin/grep: nul: No such file or directory
0:10.85 /usr/bin/grep: nul: No such file or directory
0:10.89 /usr/bin/grep: nul: No such file or directory
0:10.95 /usr/bin/grep: nul: No such file or directory
0:11.00 /usr/bin/grep: nul: No such file or directory
0:11.03 /usr/bin/grep: nul: No such file or directory
0:11.07 /usr/bin/grep: nul: No such file or directory
0:11.10 /usr/bin/grep: nul: No such file or directory
0:11.13 /usr/bin/grep: nul: No such file or directory
0:11.17 /usr/bin/grep: nul: No such file or directory
0:11.21 /usr/bin/grep: nul: No such file or directory
0:11.24 /usr/bin/grep: nul: No such file or directory
0:11.27 /usr/bin/grep: nul: No such file or directory
0:11.29 c:/Users/daleharvey/src/gecko-dev/old-configure.in:1042: AC_MSG_ERROR([Using a Cygwin build environment is unsupported. Configure cannot check for presence of necessary headers. Please upgrade to MozillaBuild; see https://developer.mozilla.org/en/Windows_Build_Prerequisites.])
0:11.29 c:/Users/daleharvey/src/gecko-dev/old-configure.in:1114:AC_SUBST_LIST(MMX_FLAGS)
0:11.29 c:/Users/daleharvey/src/gecko-dev/old-configure.in:1115:AC_SUBST_LIST(SSE_FLAGS)
0:11.30 c:/Users/daleharvey/src/gecko-dev/old-configure.in:1116:AC_SUBST_LIST(SSE2_FLAGS)
0:11.30 c:/Users/daleharvey/src/gecko-dev/old-configure.in:1117:AC_SUBST_LIST(SSSE3_FLAGS)
0:11.31 c:/Users/daleharvey/src/gecko-dev/old-configure.in:1227: AC_MSG_ERROR([dtrace enabled but sys/sdt.h not found]);
0:11.33 c:/Users/daleharvey/src/gecko-dev/old-configure.in:1254:AC_CHECK_FUNCS(dladdr memmem)
0:11.34 c:/Users/daleharvey/src/gecko-dev/old-configure.in:1303:AC_SUBST_LIST(XCFLAGS)
0:11.35 c:/Users/daleharvey/src/gecko-dev/old-configure.in:1304:AC_SUBST_LIST(XLDFLAGS)
0:11.36 c:/Users/daleharvey/src/gecko-dev/old-configure.in:1305:AC_SUBST_LIST(XLIBS)
0:11.37 c:/Users/daleharvey/src/gecko-dev/old-configure.in:1306:AC_SUBST_LIST(XEXT_LIBS)
0:11.37 c:/Users/daleharvey/src/gecko-dev/old-configure.in:1307:AC_SUBST_LIST(XT_LIBS)
0:11.37 c:/Users/daleharvey/src/gecko-dev/old-configure.in:1339: AC_MSG_ERROR([ --with-pthreads specified for a system without pthread support ]);
0:11.40 c:/Users/daleharvey/src/gecko-dev/old-configure.in:1428:AC_CHECK_FUNCS(stat64 lstat64 truncate64 statvfs64 statvfs statfs64 statfs getpagesize gmtime_r localtime_r arc4random arc4random_buf mallinfo gettid lchown setpriority strerror syscall)
0:11.41 c:/Users/daleharvey/src/gecko-dev/old-configure.in:1456: AC_SUBST_LIST(REALTIME_LIBS)
0:11.42 c:/Users/daleharvey/src/gecko-dev/old-configure.in:168: AC_MSG_ERROR([\$(CC) test failed. You must have MS VC++ in your path to build.]) )
0:11.42 c:/Users/daleharvey/src/gecko-dev/old-configure.in:1738: AC_MSG_ERROR([event.h found, but is not in ${LIBEVENT_DIR}/include])
0:11.42 c:/Users/daleharvey/src/gecko-dev/old-configure.in:173: AC_MSG_ERROR([\$(CXX) test failed. You must have MS VC++ in your path to build.]) )
0:11.43 c:/Users/daleharvey/src/gecko-dev/old-configure.in:1740: AC_MSG_ERROR([--with-system-libevent requested but event.h not found]))
0:11.44 c:/Users/daleharvey/src/gecko-dev/old-configure.in:1763: AM_PATH_NSS(3.36, [MOZ_SYSTEM_NSS=1], [AC_MSG_ERROR([you don't have NSS installed or your version is too old])])
0:11.44 c:/Users/daleharvey/src/gecko-dev/old-configure.in:1775: AC_MSG_ERROR([building in-tree NSS is not supported on this platform. Use --with-system-nss])
0:11.44 c:/Users/daleharvey/src/gecko-dev/old-configure.in:1813: AC_MSG_ERROR([Insufficient JPEG library version for --with-system-jpeg]))
0:11.44 c:/Users/daleharvey/src/gecko-dev/old-configure.in:1878: AC_MSG_ERROR([--with-system-png requested but no working libpng found]))
0:11.45 c:/Users/daleharvey/src/gecko-dev/old-configure.in:1880: AC_MSG_ERROR([--with-system-png won't work because the system's libpng doesn't have APNG support]))
0:11.45 c:/Users/daleharvey/src/gecko-dev/old-configure.in:1893: AC_MSG_ERROR([--with-system-png requested but no working libpng found]))
0:11.45 c:/Users/daleharvey/src/gecko-dev/old-configure.in:1979: AC_MSG_ERROR([--with-android-distribution-directory does not contain assets/distribution;
0:11.46 c:/Users/daleharvey/src/gecko-dev/old-configure.in:2173: AC_MSG_ERROR([* * * Could not find startup-notification >= $STARTUP_NOTIFICATION_VERSION])
0:11.46 c:/Users/daleharvey/src/gecko-dev/old-configure.in:2187:AC_SUBST_LIST(TK_CFLAGS)
0:11.48 c:/Users/daleharvey/src/gecko-dev/old-configure.in:2188:AC_SUBST_LIST(TK_LIBS)
0:11.48 c:/Users/daleharvey/src/gecko-dev/old-configure.in:2203: AC_MSG_ERROR([You must specify MOZ_OFFICIAL_BRANDING_DIRECTORY to use --enable-official-branding.])
0:11.49 c:/Users/daleharvey/src/gecko-dev/old-configure.in:2270: AC_MSG_ERROR([* * * Could not find gconf-2.0 ])
0:11.49 c:/Users/daleharvey/src/gecko-dev/old-configure.in:2272: AC_MSG_WARN([Many automated tests will fail with --disable-gconf. See bug 1167201.])
0:11.51 c:/Users/daleharvey/src/gecko-dev/old-configure.in:227: AC_MSG_ERROR([Invalid Windows UCRT Redist directory: ${WIN_UCRT_REDIST_DIR}])
0:11.52 c:/Users/daleharvey/src/gecko-dev/old-configure.in:2346: AC_MSG_ERROR([MIDL could not be found. Building accessibility without MIDL is not supported.])
0:11.53 c:/Users/daleharvey/src/gecko-dev/old-configure.in:2348: AC_MSG_ERROR([You have accessibility enabled, but widl could not be found. Add --disable-accessibility to your mozconfig or install widl. See https://developer.mozilla.org/en-US/docs/Cross_Compile_Mozilla_for_Mingw32 for details.])
0:11.58 c:/Users/daleharvey/src/gecko-dev/old-configure.in:2360: AC_MSG_ERROR(["Accessibility is required for the linuxgl widget backend"])
0:11.58 c:/Users/daleharvey/src/gecko-dev/old-configure.in:2395:AC_SUBST_LIST(MOZ_WEBRTC_X11_LIBS)
0:11.58 c:/Users/daleharvey/src/gecko-dev/old-configure.in:240: AC_MSG_ERROR([Invalid Win32 Redist directory: ${WIN32_REDIST_DIR}])
0:11.60 c:/Users/daleharvey/src/gecko-dev/old-configure.in:2435: [AC_MSG_ERROR([MacOS X 10.7 SDK or later is required])])
0:11.60 c:/Users/daleharvey/src/gecko-dev/old-configure.in:2461: [AC_MSG_ERROR([Couldn't find vpx/vpx_decoder.h which is required for build with system libvpx. Use --without-system-libvpx to build with in-tree libvpx.])])
0:11.60 c:/Users/daleharvey/src/gecko-dev/old-configure.in:2464: [AC_MSG_ERROR([--with-system-libvpx requested but symbol vpx_codec_dec_init_ver not found])])
0:11.61 c:/Users/daleharvey/src/gecko-dev/old-configure.in:2467: [AC_CHECK_FUNC(vpx_mem_set_functions)])
0:11.61 c:/Users/daleharvey/src/gecko-dev/old-configure.in:2477:AC_SUBST_LIST(MOZ_LIBVPX_CFLAGS)
0:11.61 c:/Users/daleharvey/src/gecko-dev/old-configure.in:2478:AC_SUBST_LIST(MOZ_LIBVPX_LIBS)
0:11.62 c:/Users/daleharvey/src/gecko-dev/old-configure.in:2509: AC_MSG_ERROR([yasm 1.1 or greater is required to build libvpx on Win32, but it appears not to be installed. Install it (included in MozillaBuild 1.5.1 and newer) or configure with --disable-webm (which disables the WebM video format). See https://developer.mozilla.org/en/YASM for more details.])
0:11.62 c:/Users/daleharvey/src/gecko-dev/old-configure.in:2511: AC_MSG_ERROR([yasm 1.1 or greater is required to build libvpx on Win32, but you appear to have version $_YASM_MAJOR_VERSION.$_YASM_MINOR_VERSION. Upgrade to the newest version (included in MozillaBuild 1.5.1 and newer) or configure with --disable-webm (which disables the WebM video format). See https://developer.mozilla.org/en/YASM for more details.])
0:11.63 c:/Users/daleharvey/src/gecko-dev/old-configure.in:253: AC_MSG_ERROR([The linker major version, $_LD_FULL_VERSION, does not match the compiler suite version, $_CC_SUITE.])
0:11.63 c:/Users/daleharvey/src/gecko-dev/old-configure.in:2559: AC_MSG_ERROR([yasm is a required build tool for this architecture when webm is enabled. You may either install yasm or --disable-webm (which disables the WebM video format). See https://developer.mozilla.org/en/YASM for more details.])
0:11.63 c:/Users/daleharvey/src/gecko-dev/old-configure.in:2571: AC_MSG_WARN([No assembler or assembly support for libvpx. Using unoptimized C routines.])
0:11.64 c:/Users/daleharvey/src/gecko-dev/old-configure.in:2583: AC_MSG_ERROR([MOZ_VORBIS and MOZ_TREMOR are mutually exclusive! The build system should not allow them both to be set, but they are. Please file a bug at https://bugzilla.mozilla.org/])
0:11.64 c:/Users/daleharvey/src/gecko-dev/old-configure.in:2610: AC_MSG_ERROR([Need alsa for audio output on Linux. (On Ubuntu, you might try installing the package libasound2-dev.)])])
0:11.64 c:/Users/daleharvey/src/gecko-dev/old-configure.in:2637: AC_MSG_ERROR([pulseaudio audio backend requires libpulse development package])])
0:11.64 c:/Users/daleharvey/src/gecko-dev/old-configure.in:2652: AC_MSG_ERROR([negotiateauth is not supported on iOS.])
0:11.64 c:/Users/daleharvey/src/gecko-dev/old-configure.in:2725: AC_MSG_ERROR([Couldn't determine MOZ_D3D_CPU_SUFFIX.])
0:11.65 c:/Users/daleharvey/src/gecko-dev/old-configure.in:2749: AC_MSG_ERROR([Windows SDK at "$WINDOWSSDKDIR" appears broken. Try updating to MozillaBuild 1.9 final or higher.])
0:11.65 c:/Users/daleharvey/src/gecko-dev/old-configure.in:2757: AC_MSG_ERROR([Couldn't find Windows SDK 8.1 or higher needed for ANGLE.])
0:11.65 c:/Users/daleharvey/src/gecko-dev/old-configure.in:2783: AC_MSG_ERROR([Couldn't find an acceptable D3D compiler DLL.])
0:11.65 c:/Users/daleharvey/src/gecko-dev/old-configure.in:2808: AC_MSG_ERROR([Can't find header linux/joystick.h, needed for gamepad support. Please install Linux kernel headers.])
0:11.65 c:/Users/daleharvey/src/gecko-dev/old-configure.in:2853: AC_MSG_ERROR([Cannot --enable-crashreporter, as breakpad tools do not support compiling on $HOST_OS_ARCH while targeting $OS_ARCH.])
0:11.65 c:/Users/daleharvey/src/gecko-dev/old-configure.in:2889: AC_MSG_ERROR([cannot use --with-system-jpeg with --enable-libjpeg-turbo.])
0:11.65 c:/Users/daleharvey/src/gecko-dev/old-configure.in:2944: AC_MSG_ERROR([Yasm is required to build with libjpeg-turbo's optimized JPEG decoding routines, but you do not appear to have Yasm installed. Either install it or configure with --disable-libjpeg-turbo to use the pure C JPEG decoder. See https://developer.mozilla.org/en/YASM for more details.])
0:11.65 c:/Users/daleharvey/src/gecko-dev/old-configure.in:2951: AC_MSG_ERROR([Yasm 1.0.1 or greater is required to build with libjpeg-turbo's optimized JPEG decoding routines, but you appear to have version $_YASM_MAJOR_VERSION.$_YASM_MINOR_VERSION.$_YASM_RELEASE. Upgrade to the newest version or configure with --disable-libjpeg-turbo to use the pure C JPEG decoder. See https://developer.mozilla.org/en/YASM for more details.])
0:11.65 c:/Users/daleharvey/src/gecko-dev/old-configure.in:2955: AC_MSG_ERROR([Yasm 1.1 or greater is required to build with libjpeg-turbo's optimized JPEG decoding routines, but you appear to have version $_YASM_MAJOR_VERSION.$_YASM_MINOR_VERSION. Upgrade to the newest version or configure with --disable-libjpeg-turbo to use the pure C JPEG decoder. See https://developer.mozilla.org/en/YASM for more details.])
0:11.66 c:/Users/daleharvey/src/gecko-dev/old-configure.in:295: AC_MSG_ERROR([Gecko exception wrapping doesn't understand your your MSVC/SDK. Please file a bug describing this error and your build configuration.])
0:11.66 c:/Users/daleharvey/src/gecko-dev/old-configure.in:3001: AC_MSG_ERROR([libav's FFT routines are only available for 32-bit windows or 64-bit x86 based platforms.])
0:11.66 c:/Users/daleharvey/src/gecko-dev/old-configure.in:3011: AC_MSG_ERROR([Yasm is required to build with libav's optimized FFT routines, but you do not appear to have Yasm installed. See https://developer.mozilla.org/en/YASM for more details.])
0:11.66 c:/Users/daleharvey/src/gecko-dev/old-configure.in:3017: AC_MSG_ERROR([Yasm 1.0.1 or greater is required to build with libav's optimized FFT routines, but you do not appear to have Yasm installed. See https://developer.mozilla.org/en/YASM for more details.])
0:11.67 c:/Users/daleharvey/src/gecko-dev/old-configure.in:3021: AC_MSG_ERROR([Yasm 1.1 or greater is required to build with libav's optimized FFT routines, but you do not appear to have Yasm installed. See https://developer.mozilla.org/en/YASM for more details.])
0:11.67 c:/Users/daleharvey/src/gecko-dev/old-configure.in:3026: AC_MSG_WARN([No assembler or assembly support for libav-fft. Using unoptimized C routines.])
0:11.67 c:/Users/daleharvey/src/gecko-dev/old-configure.in:3072: AC_MSG_ERROR([--enable-extensions=$option is no longer supported.])
0:11.67 c:/Users/daleharvey/src/gecko-dev/old-configure.in:3090: AC_MSG_ERROR([Unrecognized extension provided to --enable-extensions: ${extension}.])
0:11.67 c:/Users/daleharvey/src/gecko-dev/old-configure.in:3104: AC_SUBST_LIST(CAIRO_FT_CFLAGS)
0:11.67 c:/Users/daleharvey/src/gecko-dev/old-configure.in:3123: AC_MSG_ERROR([Can only build with --enable-maintenance-service with a Windows target])
0:11.67 c:/Users/daleharvey/src/gecko-dev/old-configure.in:3168: AC_MSG_WARN([Cannot --enable-signmar with --disable-compile-environment])
0:11.67 c:/Users/daleharvey/src/gecko-dev/old-configure.in:317: AC_MSG_ERROR([w32api version $W32API_VERSION or higher required.])
0:11.67 c:/Users/daleharvey/src/gecko-dev/old-configure.in:3259: AC_MSG_ERROR([--enable-content-sandbox and --disable-sandbox are conflicting options])
0:11.68 c:/Users/daleharvey/src/gecko-dev/old-configure.in:3322: AC_MSG_ERROR([Cannot build Firefox with --disable-feeds.])
0:11.68 c:/Users/daleharvey/src/gecko-dev/old-configure.in:336: AC_MSG_ERROR([windres version $WINDRES_VERSION or higher is required to build.])
0:11.68 c:/Users/daleharvey/src/gecko-dev/old-configure.in:3370: AC_MSG_ERROR([System SQLite library is not compiled with SQLITE_SECURE_DELETE.])
0:11.68 c:/Users/daleharvey/src/gecko-dev/old-configure.in:3399: AC_MSG_ERROR([System SQLite library is not compiled with SQLITE_THREADSAFE.])
0:11.68 c:/Users/daleharvey/src/gecko-dev/old-configure.in:3428: AC_MSG_ERROR([System SQLite library is not compiled with SQLITE_ENABLE_FTS3.])
0:11.68 c:/Users/daleharvey/src/gecko-dev/old-configure.in:3457: AC_MSG_ERROR([System SQLite library is not compiled with SQLITE_ENABLE_UNLOCK_NOTIFY.])
0:11.69 c:/Users/daleharvey/src/gecko-dev/old-configure.in:3486: AC_MSG_ERROR([System SQLite library is not compiled with SQLITE_ENABLE_DBSTAT_VTAB.])
0:11.69 c:/Users/daleharvey/src/gecko-dev/old-configure.in:3493: AC_CHECK_FUNC(fdatasync)
0:11.69 c:/Users/daleharvey/src/gecko-dev/old-configure.in:3566: AC_MSG_ERROR([These compiler flags for C are invalid: $MOZ_OPTIMIZE_FLAGS])
0:11.69 c:/Users/daleharvey/src/gecko-dev/old-configure.in:3572:AC_SUBST_LIST(MOZ_FRAMEPTR_FLAGS)
0:11.69 c:/Users/daleharvey/src/gecko-dev/old-configure.in:3573:AC_SUBST_LIST(MOZ_OPTIMIZE_FLAGS)
0:11.70 c:/Users/daleharvey/src/gecko-dev/old-configure.in:3574:AC_SUBST_LIST(MOZ_OPTIMIZE_LDFLAGS)
0:11.70 c:/Users/daleharvey/src/gecko-dev/old-configure.in:3575:AC_SUBST_LIST(MOZ_PGO_OPTIMIZE_FLAGS)
0:11.70 c:/Users/daleharvey/src/gecko-dev/old-configure.in:3637: AC_MSG_WARN([When not building jemalloc, you need to set WIN32_REDIST_DIR to the path to the Visual C++ Redist (usually VCINSTALLDIR\redist\x86\Microsoft.VC80.CRT, for VC++ v8) if you intend to distribute your build.])
0:11.70 c:/Users/daleharvey/src/gecko-dev/old-configure.in:3659: AC_MSG_ERROR([Cannot specify more than one sub-sub-configure])
0:11.70 c:/Users/daleharvey/src/gecko-dev/old-configure.in:3672:AC_SUBST_LIST(MOZ_GLUE_WRAP_LDFLAGS)
0:11.70 c:/Users/daleharvey/src/gecko-dev/old-configure.in:3760: AC_CHECK_FUNCS(__cxa_demangle, HAVE_DEMANGLE=1, HAVE_DEMANGLE=)
0:11.70 c:/Users/daleharvey/src/gecko-dev/old-configure.in:3778: MOZ_CHECK_HEADER(unwind.h, AC_CHECK_FUNCS(_Unwind_Backtrace))
0:11.70 c:/Users/daleharvey/src/gecko-dev/old-configure.in:3813: AC_MSG_ERROR("Homedir must be single relative path.")
0:11.70 c:/Users/daleharvey/src/gecko-dev/old-configure.in:384:AC_SUBST_LIST(STL_FLAGS)
0:11.70 c:/Users/daleharvey/src/gecko-dev/old-configure.in:3882: AC_MSG_ERROR([Unable to parse cl -showIncludes prefix. This compiler's locale has an unsupported formatting.])
0:11.71 c:/Users/daleharvey/src/gecko-dev/old-configure.in:3885: AC_MSG_ERROR([Cannot find cl -showIncludes prefix.])
0:11.71 c:/Users/daleharvey/src/gecko-dev/old-configure.in:3940:AC_SUBST_LIST(GLIB_GMODULE_LIBS)
0:11.71 c:/Users/daleharvey/src/gecko-dev/old-configure.in:3971: AC_CHECK_FUNCS(FT_GlyphSlot_Embolden FT_Load_Sfnt_Table)
0:11.71 c:/Users/daleharvey/src/gecko-dev/old-configure.in:3980: [AC_MSG_ERROR(Can't find header fontconfig/fcfreetype.h.)], [#include <fontconfig/fontconfig.h>])
0:11.71 c:/Users/daleharvey/src/gecko-dev/old-configure.in:3998:AC_MSG_ERROR(--enable-system-cairo is not supported),
0:11.71 c:/Users/daleharvey/src/gecko-dev/old-configure.in:4098:AC_SUBST_LIST(MOZ_CAIRO_CFLAGS)
0:11.71 c:/Users/daleharvey/src/gecko-dev/old-configure.in:4099:AC_SUBST_LIST(MOZ_CAIRO_LIBS)
0:11.72 c:/Users/daleharvey/src/gecko-dev/old-configure.in:4100:AC_SUBST_LIST(MOZ_CAIRO_OSLIBS)
0:11.72 c:/Users/daleharvey/src/gecko-dev/old-configure.in:4104:AC_SUBST_TOML_LIST(BINDGEN_SYSTEM_FLAGS)
0:11.72 c:/Users/daleharvey/src/gecko-dev/old-configure.in:410: AC_MSG_WARN([You should only be using --with-macos-private-frameworks when cross-compiling.])
0:11.72 c:/Users/daleharvey/src/gecko-dev/old-configure.in:413: AC_MSG_ERROR([PrivateFrameworks directory not found.])
0:11.72 c:/Users/daleharvey/src/gecko-dev/old-configure.in:4155: AC_MSG_ERROR([Necko WiFi scanning needs DBus on your platform, remove --disable-dbus or use --disable-necko-wifi])
0:11.72 c:/Users/daleharvey/src/gecko-dev/old-configure.in:4186:AC_SUBST_LIST(ASFLAGS)
0:11.72 c:/Users/daleharvey/src/gecko-dev/old-configure.in:4195:AC_SUBST_LIST(MOZ_DEBUG_LDFLAGS)
0:11.72 c:/Users/daleharvey/src/gecko-dev/old-configure.in:4197:AC_SUBST_SET(MOZ_EXTENSIONS)
0:11.73 c:/Users/daleharvey/src/gecko-dev/old-configure.in:4227:AC_SUBST_LIST(MOZ_FIX_LINK_PATHS)
0:11.73 c:/Users/daleharvey/src/gecko-dev/old-configure.in:427: AC_MSG_ERROR([SDK not found. When using --with-macos-sdk, you must
0:11.73 c:/Users/daleharvey/src/gecko-dev/old-configure.in:4497:AC_SUBST_LIST(MOZ_JPEG_CFLAGS)
0:11.73 c:/Users/daleharvey/src/gecko-dev/old-configure.in:4498:AC_SUBST_LIST(MOZ_JPEG_LIBS)
0:11.73 c:/Users/daleharvey/src/gecko-dev/old-configure.in:4499:AC_SUBST_LIST(MOZ_BZ2_CFLAGS)
0:11.73 c:/Users/daleharvey/src/gecko-dev/old-configure.in:449: AC_MSG_ERROR([The selected compiler and Mac OS X SDK are incompatible.])
0:11.73 c:/Users/daleharvey/src/gecko-dev/old-configure.in:4500:AC_SUBST_LIST(MOZ_BZ2_LIBS)
0:11.73 c:/Users/daleharvey/src/gecko-dev/old-configure.in:4501:AC_SUBST_LIST(MOZ_PNG_CFLAGS)
0:11.73 c:/Users/daleharvey/src/gecko-dev/old-configure.in:4502:AC_SUBST_LIST(MOZ_PNG_LIBS)
0:11.73 c:/Users/daleharvey/src/gecko-dev/old-configure.in:4528:AC_SUBST_LIST(OS_CFLAGS)
0:11.73 c:/Users/daleharvey/src/gecko-dev/old-configure.in:4529:AC_SUBST_LIST(OS_CXXFLAGS)
0:11.74 c:/Users/daleharvey/src/gecko-dev/old-configure.in:4530:AC_SUBST_LIST(OS_CPPFLAGS)
0:11.74 c:/Users/daleharvey/src/gecko-dev/old-configure.in:4531:AC_SUBST_LIST(OS_COMPILE_CFLAGS)
0:11.74 c:/Users/daleharvey/src/gecko-dev/old-configure.in:4532:AC_SUBST_LIST(OS_COMPILE_CXXFLAGS)
0:11.74 c:/Users/daleharvey/src/gecko-dev/old-configure.in:4533:AC_SUBST_LIST(OS_LDFLAGS)
0:11.74 c:/Users/daleharvey/src/gecko-dev/old-configure.in:4538:AC_SUBST_LIST(HOST_CFLAGS)
0:11.74 c:/Users/daleharvey/src/gecko-dev/old-configure.in:4539:AC_SUBST_LIST(HOST_CPPFLAGS)
0:11.74 c:/Users/daleharvey/src/gecko-dev/old-configure.in:4540:AC_SUBST_LIST(HOST_CXXFLAGS)
0:11.74 c:/Users/daleharvey/src/gecko-dev/old-configure.in:4542:AC_SUBST_LIST(HOST_OPTIMIZE_FLAGS)
0:11.74 c:/Users/daleharvey/src/gecko-dev/old-configure.in:4557:AC_SUBST_LIST(DSO_CFLAGS)
0:11.74 c:/Users/daleharvey/src/gecko-dev/old-configure.in:4558:AC_SUBST_LIST(DSO_PIC_CFLAGS)
0:11.74 c:/Users/daleharvey/src/gecko-dev/old-configure.in:4571:AC_SUBST_LIST(FFVPX_ASFLAGS)
0:11.74 c:/Users/daleharvey/src/gecko-dev/old-configure.in:4573:AC_SUBST_LIST(VPX_ASFLAGS)
0:11.75 c:/Users/daleharvey/src/gecko-dev/old-configure.in:4578:AC_SUBST_LIST(LIBJPEG_TURBO_ASFLAGS)
0:11.75 c:/Users/daleharvey/src/gecko-dev/old-configure.in:4580:AC_SUBST_LIST(LIBAV_FFT_ASFLAGS)
0:11.75 c:/Users/daleharvey/src/gecko-dev/old-configure.in:4585:AC_SUBST_LIST(MOZ_FOLD_LIBS_FLAGS)
0:11.75 c:/Users/daleharvey/src/gecko-dev/old-configure.in:4595:AC_CHECK_FUNCS(posix_fadvise posix_fallocate)
0:11.75 c:/Users/daleharvey/src/gecko-dev/old-configure.in:4618: [ AC_MSG_ERROR([Can't find X headers (install libxt-dev (Debian/Ubuntu), libXt-devel (Fedora), or xorg-x11-libXt-devel (SuSE)).]) ])
0:11.75 c:/Users/daleharvey/src/gecko-dev/old-configure.in:4622: AC_MSG_ERROR([ Could not find the following X libraries: $MISSING_X ]);
0:11.75 c:/Users/daleharvey/src/gecko-dev/old-configure.in:4722: AC_OUTPUT_SUBDIRS_NOW("$_subconfigure_subdir",$cache_file)
0:11.75 c:/Users/daleharvey/src/gecko-dev/old-configure.in:665: AC_MSG_ERROR(
0:11.75 c:/Users/daleharvey/src/gecko-dev/old-configure.in:744: AC_MSG_ERROR([FIREFOX_VERSION is unexpectedly blank.])
0:11.75 c:/Users/daleharvey/src/gecko-dev/old-configure.in:748: AC_MSG_ERROR([FIREFOX_VERSION_DISPLAY is unexpectedly blank.])
0:11.75 c:/Users/daleharvey/src/gecko-dev/old-configure.in:776: AC_MSG_ERROR([targeting iOS but not using an iOS SDK?])
0:11.80 Traceback (most recent call last):
0:11.80 File "c:/Users/daleharvey/src/gecko-dev/configure.py", line 127, in <module>
0:11.80 sys.exit(main(sys.argv))
0:11.80 File "c:/Users/daleharvey/src/gecko-dev/configure.py", line 29, in main
0:11.80 sandbox.run(os.path.join(os.path.dirname(__file__), 'moz.configure'))
0:11.80 File "c:\Users\daleharvey\src\gecko-dev\python\mozbuild\mozbuild\configure\__init__.py", line 428, in run
0:11.80 func(*args)
0:11.81 File "c:\Users\daleharvey\src\gecko-dev\python\mozbuild\mozbuild\configure\__init__.py", line 474, in _value_for
0:11.81 return self._value_for_depends(obj, need_help_dependency)
0:11.81 File "c:\Users\daleharvey\src\gecko-dev\python\mozbuild\mozbuild\util.py", line 944, in method_call
0:11.81 cache[args] = self.func(instance, *args)
0:11.81 File "c:\Users\daleharvey\src\gecko-dev\python\mozbuild\mozbuild\configure\__init__.py", line 483, in _value_for_depends
0:11.81 return obj.result(need_help_dependency)
0:11.81 File "c:\Users\daleharvey\src\gecko-dev\python\mozbuild\mozbuild\util.py", line 944, in method_call
0:11.81 cache[args] = self.func(instance, *args)
0:11.81 File "c:\Users\daleharvey\src\gecko-dev\python\mozbuild\mozbuild\configure\__init__.py", line 123, in result
0:11.81 return self._func(*resolved_args)
0:11.81 File "c:\Users\daleharvey\src\gecko-dev\python\mozbuild\mozbuild\configure\__init__.py", line 1003, in wrapped
0:11.81 return new_func(*args, **kwargs)
0:11.82 File "c:/Users/daleharvey/src/gecko-dev/build/moz.configure/old.configure", line 110, in prepare_configure
0:11.82 old_configure + '.in'])
0:11.82 File "C:\mozilla-build\python\Lib\subprocess.py", line 219, in check_output
0:11.82 raise CalledProcessError(retcode, cmd, output=output)
0:11.82 subprocess.CalledProcessError: Command '[u'C:/mozilla-build/msys/bin/sh.exe', u'C:/mozilla-build/msys/local/bin/autoconf-2.13', u'--localdir=c:/Users/daleharvey/src/gecko-dev', u'c:/Users/daleharvey/src/gecko-dev/old-configure.in']' returned non-zero exit status 1
0:11.82 *** Fix above errors and then restart with\
0:11.82 "c:/mozilla-build/mozmake/mozmake.EXE -f client.mk build"
0:11.82 mozmake.EXE: *** [client.mk:149: configure] Error 1
daleharvey@DESKTOP-UELI0OF ~/src/gecko-dev
$ ./mach build
0:01.92 Clobber not needed.
0:01.99 Adding make options from None
MOZ_OBJDIR=c:/Users/daleharvey/src/gecko-dev/obj-i686-pc-mingw32
OBJDIR=c:/Users/daleharvey/src/gecko-dev/obj-i686-pc-mingw32
0:02.08 c:\mozilla-build\mozmake\mozmake.EXE -f client.mk -s configure
0:02.62 cd c:/Users/daleharvey/src/gecko-dev/obj-i686-pc-mingw32
0:02.82 c:/Users/daleharvey/src/gecko-dev/configure
0:03.07 Reexecuting in the virtualenv
0:03.42 checking for vcs source checkout... git
0:03.60 checking for a shell... C:/mozilla-build/msys/bin/sh.exe
0:04.10 checking for host system type... x86_64-pc-mingw64
0:04.14 checking for target system type... x86_64-pc-mingw64
0:04.14 checking for a shell... C:/mozilla-build/msys/bin/sh.exe
0:04.66 checking for host system type... x86_64-pc-mingw64
0:04.73 checking for target system type... x86_64-pc-mingw64
0:04.75 checking for vcs source checkout... git
0:04.75 checking whether cross compiling... no
0:04.85 checking for the target C compiler... 'C:/PROGRA~2/MICROS~1/2017/COMMUN~1/VC/Tools/MSVC/1413~1.261/bin/HostX64/x64/cl.exe'
0:04.93 checking whether the target C compiler can be used... yes
0:05.48 checking for Python 3... C:\mozilla-build\python3\python3.EXE (3.6.3)
0:05.50 checking for git... 'C:/PROGRA~1/Git/mingw64/bin/git.exe'
0:05.63 checking for Git version... 2.16.1.windows.4
0:05.65 checking for sparse checkout... no
0:05.68 checking for pkg_config... not found
0:05.71 checking for yasm... C:/mozilla-build/yasm/yasm.exe
0:05.77 checking yasm version... 1.3.0
0:05.80 checking the target C compiler version... 19.13.26129
0:05.88 checking the target C compiler works... yes
0:05.92 checking for the target C++ compiler... 'C:/PROGRA~2/MICROS~1/2017/COMMUN~1/VC/Tools/MSVC/1413~1.261/bin/HostX64/x64/cl.exe'
0:05.97 checking whether the target C++ compiler can be used... yes
0:05.98 checking the target C++ compiler version... 19.13.26129
0:06.05 checking the target C++ compiler works... yes
0:06.08 checking for the host C compiler... 'C:/PROGRA~2/MICROS~1/2017/COMMUN~1/VC/Tools/MSVC/1413~1.261/bin/HostX64/x64/cl.exe'
0:06.13 checking whether the host C compiler can be used... yes
0:06.13 checking the host C compiler version... 19.13.26129
0:06.19 checking the host C compiler works... yes
0:06.23 checking for the host C++ compiler... 'C:/PROGRA~2/MICROS~1/2017/COMMUN~1/VC/Tools/MSVC/1413~1.261/bin/HostX64/x64/cl.exe'
0:06.28 checking whether the host C++ compiler can be used... yes
0:06.28 checking the host C++ compiler version... 19.13.26129
0:06.35 checking the host C++ compiler works... yes
0:06.43 checking for 64-bit OS... yes
0:06.43 checking bindgen cflags... no
0:06.48 checking for Windows SDK... 0x0a00 in 'C:\Program Files (x86)\Windows Kits\10\'
0:06.52 checking for Universal CRT SDK... 10.0.16299.0 in 'C:\Program Files (x86)\Windows Kits\10\'
0:06.52 checking for the Debug Interface Access SDK... C:/PROGRA~2/MICROS~1/2017/COMMUN~1/DIA SDK
0:06.53 checking for mt... 'C:/PROGRA~2/WI3CF2~1/10/bin/100162~1.0/x64/mt.exe'
0:06.57 checking whether MT is really Microsoft Manifest Tool... yes
0:06.58 checking for linker... 'C:/PROGRA~1/Git/usr/bin/link.exe'
0:06.58 checking for makecab... C:/Windows/System32/makecab.exe
0:06.62 checking for fxc... 'C:/PROGRA~2/WI3CF2~1/10/bin/100162~1.0/x64/fxc.exe'
0:06.67 checking for stdint.h... yes
0:07.13 checking for inttypes.h... yes
0:07.21 checking for malloc.h... yes
0:07.29 checking for alloca.h... no
0:07.38 checking for perf_event_open system call... no
0:07.41 checking for rustc... C:/Users/daleharvey/.cargo/bin/rustc.exe
0:07.42 checking for cargo... C:/Users/daleharvey/.cargo/bin/cargo.exe
0:07.49 checking rustc version... 1.24.1
0:07.53 checking cargo version... 0.25.0
0:08.07 checking for tar... 'C:/PROGRA~1/Git/usr/bin/tar.exe'
0:08.20 checking for unzip... 'C:/PROGRA~1/Git/usr/bin/unzip.exe'
0:08.30 checking for zip... C:/mozilla-build/info-zip/zip.exe
0:08.37 checking for gn... not found
0:08.38 checking for the Mozilla API key... no
0:08.45 checking for the Google API key... no
0:08.47 checking for the Bing API key... no
0:08.47 checking for the Adjust SDK key... no
0:08.48 checking for the Leanplum SDK key... no
0:08.48 checking for the Pocket API key... no
0:08.48 checking for llvm-config... C:/Users/daleharvey/.mozbuild/clang/bin/llvm-config.exe
0:08.52 checking for awk... 'C:/PROGRA~1/Git/usr/bin/gawk.exe'
0:08.52 checking for perl... 'C:/PROGRA~1/Git/usr/bin/perl.exe'
0:08.54 checking for minimum required perl version >= 5.006... 5.026001
0:08.58 checking for full perl installation... yes
0:08.60 checking for gmake... c:/mozilla-build/mozmake/mozmake.EXE
0:08.62 checking for watchman... C:/mozilla-build/watchman/watchman.exe
0:08.62 checking for watchman version... 4.9.0
0:08.62 checking for xargs... 'C:/PROGRA~1/Git/usr/bin/xargs.exe'
0:08.63 checking for makensisu... C:/mozilla-build/nsis-3.01/makensis-3.01.exe
0:08.65 checking for NSIS version... 3.01
0:08.66 checking for 32-bit NSIS... yes
0:08.66 checking for 7z... C:/mozilla-build/7zip/7z.exe
0:08.67 checking for autoconf... C:/mozilla-build/msys/local/bin/autoconf-2.13
0:08.67 Refreshing c:/Users/daleharvey/src/gecko-dev/old-configure with C:/mozilla-build/msys/local/bin/autoconf-2.13
0:08.73 /usr/bin/sed: -e expression #1, char 10: unterminated `s' command
0:08.85 autoconf: Undefined macros:
0:08.91 /usr/bin/grep: nul: No such file or directory
0:08.95 /usr/bin/grep: nul: No such file or directory
0:08.99 /usr/bin/grep: nul: No such file or directory
0:09.02 /usr/bin/grep: nul: No such file or directory
0:09.04 /usr/bin/grep: nul: No such file or directory
0:09.08 /usr/bin/grep: nul: No such file or directory
0:09.11 /usr/bin/grep: nul: No such file or directory
0:09.13 /usr/bin/grep: nul: No such file or directory
0:09.16 /usr/bin/grep: nul: No such file or directory
0:09.20 /usr/bin/grep: nul: No such file or directory
0:09.24 /usr/bin/grep: nul: No such file or directory
0:09.26 /usr/bin/grep: nul: No such file or directory
0:09.32 /usr/bin/grep: nul: No such file or directory
0:09.35 /usr/bin/grep: nul: No such file or directory
0:09.40 /usr/bin/grep: nul: No such file or directory
0:09.43 /usr/bin/grep: nul: No such file or directory
0:09.46 /usr/bin/grep: nul: No such file or directory
0:09.51 /usr/bin/grep: nul: No such file or directory
0:09.56 /usr/bin/grep: nul: No such file or directory
0:09.59 /usr/bin/grep: nul: No such file or directory
0:09.62 /usr/bin/grep: nul: No such file or directory
0:09.65 /usr/bin/grep: nul: No such file or directory
0:09.69 /usr/bin/grep: nul: No such file or directory
0:09.72 /usr/bin/grep: nul: No such file or directory
0:09.75 /usr/bin/grep: nul: No such file or directory
0:09.79 /usr/bin/grep: nul: No such file or directory
0:09.83 /usr/bin/grep: nul: No such file or directory
0:09.86 /usr/bin/grep: nul: No such file or directory
0:09.90 /usr/bin/grep: nul: No such file or directory
0:09.94 /usr/bin/grep: nul: No such file or directory
0:09.98 /usr/bin/grep: nul: No such file or directory
0:10.01 /usr/bin/grep: nul: No such file or directory
0:10.05 /usr/bin/grep: nul: No such file or directory
0:10.08 /usr/bin/grep: nul: No such file or directory
0:10.11 /usr/bin/grep: nul: No such file or directory
0:10.15 /usr/bin/grep: nul: No such file or directory
0:10.18 /usr/bin/grep: nul: No such file or directory
0:10.21 /usr/bin/grep: nul: No such file or directory
0:10.25 /usr/bin/grep: nul: No such file or directory
0:10.28 /usr/bin/grep: nul: No such file or directory
0:10.32 /usr/bin/grep: nul: No such file or directory
0:10.35 /usr/bin/grep: nul: No such file or directory
0:10.38 /usr/bin/grep: nul: No such file or directory
0:10.41 /usr/bin/grep: nul: No such file or directory
0:10.44 /usr/bin/grep: nul: No such file or directory
0:10.47 /usr/bin/grep: nul: No such file or directory
0:10.51 /usr/bin/grep: nul: No such file or directory
0:10.54 /usr/bin/grep: nul: No such file or directory
0:10.58 /usr/bin/grep: nul: No such file or directory
0:10.61 /usr/bin/grep: nul: No such file or directory
0:10.64 /usr/bin/grep: nul: No such file or directory
0:10.67 /usr/bin/grep: nul: No such file or directory
0:10.72 /usr/bin/grep: nul: No such file or directory
0:10.74 /usr/bin/grep: nul: No such file or directory
0:10.77 /usr/bin/grep: nul: No such file or directory
0:10.82 /usr/bin/grep: nul: No such file or directory
0:10.85 /usr/bin/grep: nul: No such file or directory
0:10.89 /usr/bin/grep: nul: No such file or directory
0:10.95 /usr/bin/grep: nul: No such file or directory
0:11.00 /usr/bin/grep: nul: No such file or directory
0:11.03 /usr/bin/grep: nul: No such file or directory
0:11.07 /usr/bin/grep: nul: No such file or directory
0:11.10 /usr/bin/grep: nul: No such file or directory
0:11.13 /usr/bin/grep: nul: No such file or directory
0:11.17 /usr/bin/grep: nul: No such file or directory
0:11.21 /usr/bin/grep: nul: No such file or directory
0:11.24 /usr/bin/grep: nul: No such file or directory
0:11.27 /usr/bin/grep: nul: No such file or directory
0:11.29 c:/Users/daleharvey/src/gecko-dev/old-configure.in:1042: AC_MSG_ERROR([Using a Cygwin build environment is unsupported. Configure cannot check for presence of necessary headers. Please upgrade to MozillaBuild; see https://developer.mozilla.org/en/Windows_Build_Prerequisites.])
0:11.29 c:/Users/daleharvey/src/gecko-dev/old-configure.in:1114:AC_SUBST_LIST(MMX_FLAGS)
0:11.29 c:/Users/daleharvey/src/gecko-dev/old-configure.in:1115:AC_SUBST_LIST(SSE_FLAGS)
0:11.30 c:/Users/daleharvey/src/gecko-dev/old-configure.in:1116:AC_SUBST_LIST(SSE2_FLAGS)
0:11.30 c:/Users/daleharvey/src/gecko-dev/old-configure.in:1117:AC_SUBST_LIST(SSSE3_FLAGS)
0:11.31 c:/Users/daleharvey/src/gecko-dev/old-configure.in:1227: AC_MSG_ERROR([dtrace enabled but sys/sdt.h not found]);
0:11.33 c:/Users/daleharvey/src/gecko-dev/old-configure.in:1254:AC_CHECK_FUNCS(dladdr memmem)
0:11.34 c:/Users/daleharvey/src/gecko-dev/old-configure.in:1303:AC_SUBST_LIST(XCFLAGS)
0:11.35 c:/Users/daleharvey/src/gecko-dev/old-configure.in:1304:AC_SUBST_LIST(XLDFLAGS)
0:11.36 c:/Users/daleharvey/src/gecko-dev/old-configure.in:1305:AC_SUBST_LIST(XLIBS)
0:11.37 c:/Users/daleharvey/src/gecko-dev/old-configure.in:1306:AC_SUBST_LIST(XEXT_LIBS)
0:11.37 c:/Users/daleharvey/src/gecko-dev/old-configure.in:1307:AC_SUBST_LIST(XT_LIBS)
0:11.37 c:/Users/daleharvey/src/gecko-dev/old-configure.in:1339: AC_MSG_ERROR([ --with-pthreads specified for a system without pthread support ]);
0:11.40 c:/Users/daleharvey/src/gecko-dev/old-configure.in:1428:AC_CHECK_FUNCS(stat64 lstat64 truncate64 statvfs64 statvfs statfs64 statfs getpagesize gmtime_r localtime_r arc4random arc4random_buf mallinfo gettid lchown setpriority strerror syscall)
0:11.41 c:/Users/daleharvey/src/gecko-dev/old-configure.in:1456: AC_SUBST_LIST(REALTIME_LIBS)
0:11.42 c:/Users/daleharvey/src/gecko-dev/old-configure.in:168: AC_MSG_ERROR([\$(CC) test failed. You must have MS VC++ in your path to build.]) )
0:11.42 c:/Users/daleharvey/src/gecko-dev/old-configure.in:1738: AC_MSG_ERROR([event.h found, but is not in ${LIBEVENT_DIR}/include])
0:11.42 c:/Users/daleharvey/src/gecko-dev/old-configure.in:173: AC_MSG_ERROR([\$(CXX) test failed. You must have MS VC++ in your path to build.]) )
0:11.43 c:/Users/daleharvey/src/gecko-dev/old-configure.in:1740: AC_MSG_ERROR([--with-system-libevent requested but event.h not found]))
0:11.44 c:/Users/daleharvey/src/gecko-dev/old-configure.in:1763: AM_PATH_NSS(3.36, [MOZ_SYSTEM_NSS=1], [AC_MSG_ERROR([you don't have NSS installed or your version is too old])])
0:11.44 c:/Users/daleharvey/src/gecko-dev/old-configure.in:1775: AC_MSG_ERROR([building in-tree NSS is not supported on this platform. Use --with-system-nss])
0:11.44 c:/Users/daleharvey/src/gecko-dev/old-configure.in:1813: AC_MSG_ERROR([Insufficient JPEG library version for --with-system-jpeg]))
0:11.44 c:/Users/daleharvey/src/gecko-dev/old-configure.in:1878: AC_MSG_ERROR([--with-system-png requested but no working libpng found]))
0:11.45 c:/Users/daleharvey/src/gecko-dev/old-configure.in:1880: AC_MSG_ERROR([--with-system-png won't work because the system's libpng doesn't have APNG support]))
0:11.45 c:/Users/daleharvey/src/gecko-dev/old-configure.in:1893: AC_MSG_ERROR([--with-system-png requested but no working libpng found]))
0:11.45 c:/Users/daleharvey/src/gecko-dev/old-configure.in:1979: AC_MSG_ERROR([--with-android-distribution-directory does not contain assets/distribution;
0:11.46 c:/Users/daleharvey/src/gecko-dev/old-configure.in:2173: AC_MSG_ERROR([* * * Could not find startup-notification >= $STARTUP_NOTIFICATION_VERSION])
0:11.46 c:/Users/daleharvey/src/gecko-dev/old-configure.in:2187:AC_SUBST_LIST(TK_CFLAGS)
0:11.48 c:/Users/daleharvey/src/gecko-dev/old-configure.in:2188:AC_SUBST_LIST(TK_LIBS)
0:11.48 c:/Users/daleharvey/src/gecko-dev/old-configure.in:2203: AC_MSG_ERROR([You must specify MOZ_OFFICIAL_BRANDING_DIRECTORY to use --enable-official-branding.])
0:11.49 c:/Users/daleharvey/src/gecko-dev/old-configure.in:2270: AC_MSG_ERROR([* * * Could not find gconf-2.0 ])
0:11.49 c:/Users/daleharvey/src/gecko-dev/old-configure.in:2272: AC_MSG_WARN([Many automated tests will fail with --disable-gconf. See bug 1167201.])
0:11.51 c:/Users/daleharvey/src/gecko-dev/old-configure.in:227: AC_MSG_ERROR([Invalid Windows UCRT Redist directory: ${WIN_UCRT_REDIST_DIR}])
0:11.52 c:/Users/daleharvey/src/gecko-dev/old-configure.in:2346: AC_MSG_ERROR([MIDL could not be found. Building accessibility without MIDL is not supported.])
0:11.53 c:/Users/daleharvey/src/gecko-dev/old-configure.in:2348: AC_MSG_ERROR([You have accessibility enabled, but widl could not be found. Add --disable-accessibility to your mozconfig or install widl. See https://developer.mozilla.org/en-US/docs/Cross_Compile_Mozilla_for_Mingw32 for details.])
0:11.58 c:/Users/daleharvey/src/gecko-dev/old-configure.in:2360: AC_MSG_ERROR(["Accessibility is required for the linuxgl widget backend"])
0:11.58 c:/Users/daleharvey/src/gecko-dev/old-configure.in:2395:AC_SUBST_LIST(MOZ_WEBRTC_X11_LIBS)
0:11.58 c:/Users/daleharvey/src/gecko-dev/old-configure.in:240: AC_MSG_ERROR([Invalid Win32 Redist directory: ${WIN32_REDIST_DIR}])
0:11.60 c:/Users/daleharvey/src/gecko-dev/old-configure.in:2435: [AC_MSG_ERROR([MacOS X 10.7 SDK or later is required])])
0:11.60 c:/Users/daleharvey/src/gecko-dev/old-configure.in:2461: [AC_MSG_ERROR([Couldn't find vpx/vpx_decoder.h which is required for build with system libvpx. Use --without-system-libvpx to build with in-tree libvpx.])])
0:11.60 c:/Users/daleharvey/src/gecko-dev/old-configure.in:2464: [AC_MSG_ERROR([--with-system-libvpx requested but symbol vpx_codec_dec_init_ver not found])])
0:11.61 c:/Users/daleharvey/src/gecko-dev/old-configure.in:2467: [AC_CHECK_FUNC(vpx_mem_set_functions)])
0:11.61 c:/Users/daleharvey/src/gecko-dev/old-configure.in:2477:AC_SUBST_LIST(MOZ_LIBVPX_CFLAGS)
0:11.61 c:/Users/daleharvey/src/gecko-dev/old-configure.in:2478:AC_SUBST_LIST(MOZ_LIBVPX_LIBS)
0:11.62 c:/Users/daleharvey/src/gecko-dev/old-configure.in:2509: AC_MSG_ERROR([yasm 1.1 or greater is required to build libvpx on Win32, but it appears not to be installed. Install it (included in MozillaBuild 1.5.1 and newer) or configure with --disable-webm (which disables the WebM video format). See https://developer.mozilla.org/en/YASM for more details.])
0:11.62 c:/Users/daleharvey/src/gecko-dev/old-configure.in:2511: AC_MSG_ERROR([yasm 1.1 or greater is required to build libvpx on Win32, but you appear to have version $_YASM_MAJOR_VERSION.$_YASM_MINOR_VERSION. Upgrade to the newest version (included in MozillaBuild 1.5.1 and newer) or configure with --disable-webm (which disables the WebM video format). See https://developer.mozilla.org/en/YASM for more details.])
0:11.63 c:/Users/daleharvey/src/gecko-dev/old-configure.in:253: AC_MSG_ERROR([The linker major version, $_LD_FULL_VERSION, does not match the compiler suite version, $_CC_SUITE.])
0:11.63 c:/Users/daleharvey/src/gecko-dev/old-configure.in:2559: AC_MSG_ERROR([yasm is a required build tool for this architecture when webm is enabled. You may either install yasm or --disable-webm (which disables the WebM video format). See https://developer.mozilla.org/en/YASM for more details.])
0:11.63 c:/Users/daleharvey/src/gecko-dev/old-configure.in:2571: AC_MSG_WARN([No assembler or assembly support for libvpx. Using unoptimized C routines.])
0:11.64 c:/Users/daleharvey/src/gecko-dev/old-configure.in:2583: AC_MSG_ERROR([MOZ_VORBIS and MOZ_TREMOR are mutually exclusive! The build system should not allow them both to be set, but they are. Please file a bug at https://bugzilla.mozilla.org/])
0:11.64 c:/Users/daleharvey/src/gecko-dev/old-configure.in:2610: AC_MSG_ERROR([Need alsa for audio output on Linux. (On Ubuntu, you might try installing the package libasound2-dev.)])])
0:11.64 c:/Users/daleharvey/src/gecko-dev/old-configure.in:2637: AC_MSG_ERROR([pulseaudio audio backend requires libpulse development package])])
0:11.64 c:/Users/daleharvey/src/gecko-dev/old-configure.in:2652: AC_MSG_ERROR([negotiateauth is not supported on iOS.])
0:11.64 c:/Users/daleharvey/src/gecko-dev/old-configure.in:2725: AC_MSG_ERROR([Couldn't determine MOZ_D3D_CPU_SUFFIX.])
0:11.65 c:/Users/daleharvey/src/gecko-dev/old-configure.in:2749: AC_MSG_ERROR([Windows SDK at "$WINDOWSSDKDIR" appears broken. Try updating to MozillaBuild 1.9 final or higher.])
0:11.65 c:/Users/daleharvey/src/gecko-dev/old-configure.in:2757: AC_MSG_ERROR([Couldn't find Windows SDK 8.1 or higher needed for ANGLE.])
0:11.65 c:/Users/daleharvey/src/gecko-dev/old-configure.in:2783: AC_MSG_ERROR([Couldn't find an acceptable D3D compiler DLL.])
0:11.65 c:/Users/daleharvey/src/gecko-dev/old-configure.in:2808: AC_MSG_ERROR([Can't find header linux/joystick.h, needed for gamepad support. Please install Linux kernel headers.])
0:11.65 c:/Users/daleharvey/src/gecko-dev/old-configure.in:2853: AC_MSG_ERROR([Cannot --enable-crashreporter, as breakpad tools do not support compiling on $HOST_OS_ARCH while targeting $OS_ARCH.])
0:11.65 c:/Users/daleharvey/src/gecko-dev/old-configure.in:2889: AC_MSG_ERROR([cannot use --with-system-jpeg with --enable-libjpeg-turbo.])
0:11.65 c:/Users/daleharvey/src/gecko-dev/old-configure.in:2944: AC_MSG_ERROR([Yasm is required to build with libjpeg-turbo's optimized JPEG decoding routines, but you do not appear to have Yasm installed. Either install it or configure with --disable-libjpeg-turbo to use the pure C JPEG decoder. See https://developer.mozilla.org/en/YASM for more details.])
0:11.65 c:/Users/daleharvey/src/gecko-dev/old-configure.in:2951: AC_MSG_ERROR([Yasm 1.0.1 or greater is required to build with libjpeg-turbo's optimized JPEG decoding routines, but you appear to have version $_YASM_MAJOR_VERSION.$_YASM_MINOR_VERSION.$_YASM_RELEASE. Upgrade to the newest version or configure with --disable-libjpeg-turbo to use the pure C JPEG decoder. See https://developer.mozilla.org/en/YASM for more details.])
0:11.65 c:/Users/daleharvey/src/gecko-dev/old-configure.in:2955: AC_MSG_ERROR([Yasm 1.1 or greater is required to build with libjpeg-turbo's optimized JPEG decoding routines, but you appear to have version $_YASM_MAJOR_VERSION.$_YASM_MINOR_VERSION. Upgrade to the newest version or configure with --disable-libjpeg-turbo to use the pure C JPEG decoder. See https://developer.mozilla.org/en/YASM for more details.])
0:11.66 c:/Users/daleharvey/src/gecko-dev/old-configure.in:295: AC_MSG_ERROR([Gecko exception wrapping doesn't understand your your MSVC/SDK. Please file a bug describing this error and your build configuration.])
0:11.66 c:/Users/daleharvey/src/gecko-dev/old-configure.in:3001: AC_MSG_ERROR([libav's FFT routines are only available for 32-bit windows or 64-bit x86 based platforms.])
0:11.66 c:/Users/daleharvey/src/gecko-dev/old-configure.in:3011: AC_MSG_ERROR([Yasm is required to build with libav's optimized FFT routines, but you do not appear to have Yasm installed. See https://developer.mozilla.org/en/YASM for more details.])
0:11.66 c:/Users/daleharvey/src/gecko-dev/old-configure.in:3017: AC_MSG_ERROR([Yasm 1.0.1 or greater is required to build with libav's optimized FFT routines, but you do not appear to have Yasm installed. See https://developer.mozilla.org/en/YASM for more details.])
0:11.67 c:/Users/daleharvey/src/gecko-dev/old-configure.in:3021: AC_MSG_ERROR([Yasm 1.1 or greater is required to build with libav's optimized FFT routines, but you do not appear to have Yasm installed. See https://developer.mozilla.org/en/YASM for more details.])
0:11.67 c:/Users/daleharvey/src/gecko-dev/old-configure.in:3026: AC_MSG_WARN([No assembler or assembly support for libav-fft. Using unoptimized C routines.])
0:11.67 c:/Users/daleharvey/src/gecko-dev/old-configure.in:3072: AC_MSG_ERROR([--enable-extensions=$option is no longer supported.])
0:11.67 c:/Users/daleharvey/src/gecko-dev/old-configure.in:3090: AC_MSG_ERROR([Unrecognized extension provided to --enable-extensions: ${extension}.])
0:11.67 c:/Users/daleharvey/src/gecko-dev/old-configure.in:3104: AC_SUBST_LIST(CAIRO_FT_CFLAGS)
0:11.67 c:/Users/daleharvey/src/gecko-dev/old-configure.in:3123: AC_MSG_ERROR([Can only build with --enable-maintenance-service with a Windows target])
0:11.67 c:/Users/daleharvey/src/gecko-dev/old-configure.in:3168: AC_MSG_WARN([Cannot --enable-signmar with --disable-compile-environment])
0:11.67 c:/Users/daleharvey/src/gecko-dev/old-configure.in:317: AC_MSG_ERROR([w32api version $W32API_VERSION or higher required.])
0:11.67 c:/Users/daleharvey/src/gecko-dev/old-configure.in:3259: AC_MSG_ERROR([--enable-content-sandbox and --disable-sandbox are conflicting options])
0:11.68 c:/Users/daleharvey/src/gecko-dev/old-configure.in:3322: AC_MSG_ERROR([Cannot build Firefox with --disable-feeds.])
0:11.68 c:/Users/daleharvey/src/gecko-dev/old-configure.in:336: AC_MSG_ERROR([windres version $WINDRES_VERSION or higher is required to build.])
0:11.68 c:/Users/daleharvey/src/gecko-dev/old-configure.in:3370: AC_MSG_ERROR([System SQLite library is not compiled with SQLITE_SECURE_DELETE.])
0:11.68 c:/Users/daleharvey/src/gecko-dev/old-configure.in:3399: AC_MSG_ERROR([System SQLite library is not compiled with SQLITE_THREADSAFE.])
0:11.68 c:/Users/daleharvey/src/gecko-dev/old-configure.in:3428: AC_MSG_ERROR([System SQLite library is not compiled with SQLITE_ENABLE_FTS3.])
0:11.68 c:/Users/daleharvey/src/gecko-dev/old-configure.in:3457: AC_MSG_ERROR([System SQLite library is not compiled with SQLITE_ENABLE_UNLOCK_NOTIFY.])
0:11.69 c:/Users/daleharvey/src/gecko-dev/old-configure.in:3486: AC_MSG_ERROR([System SQLite library is not compiled with SQLITE_ENABLE_DBSTAT_VTAB.])
0:11.69 c:/Users/daleharvey/src/gecko-dev/old-configure.in:3493: AC_CHECK_FUNC(fdatasync)
0:11.69 c:/Users/daleharvey/src/gecko-dev/old-configure.in:3566: AC_MSG_ERROR([These compiler flags for C are invalid: $MOZ_OPTIMIZE_FLAGS])
0:11.69 c:/Users/daleharvey/src/gecko-dev/old-configure.in:3572:AC_SUBST_LIST(MOZ_FRAMEPTR_FLAGS)
0:11.69 c:/Users/daleharvey/src/gecko-dev/old-configure.in:3573:AC_SUBST_LIST(MOZ_OPTIMIZE_FLAGS)
0:11.70 c:/Users/daleharvey/src/gecko-dev/old-configure.in:3574:AC_SUBST_LIST(MOZ_OPTIMIZE_LDFLAGS)
0:11.70 c:/Users/daleharvey/src/gecko-dev/old-configure.in:3575:AC_SUBST_LIST(MOZ_PGO_OPTIMIZE_FLAGS)
0:11.70 c:/Users/daleharvey/src/gecko-dev/old-configure.in:3637: AC_MSG_WARN([When not building jemalloc, you need to set WIN32_REDIST_DIR to the path to the Visual C++ Redist (usually VCINSTALLDIR\redist\x86\Microsoft.VC80.CRT, for VC++ v8) if you intend to distribute your build.])
0:11.70 c:/Users/daleharvey/src/gecko-dev/old-configure.in:3659: AC_MSG_ERROR([Cannot specify more than one sub-sub-configure])
0:11.70 c:/Users/daleharvey/src/gecko-dev/old-configure.in:3672:AC_SUBST_LIST(MOZ_GLUE_WRAP_LDFLAGS)
0:11.70 c:/Users/daleharvey/src/gecko-dev/old-configure.in:3760: AC_CHECK_FUNCS(__cxa_demangle, HAVE_DEMANGLE=1, HAVE_DEMANGLE=)
0:11.70 c:/Users/daleharvey/src/gecko-dev/old-configure.in:3778: MOZ_CHECK_HEADER(unwind.h, AC_CHECK_FUNCS(_Unwind_Backtrace))
0:11.70 c:/Users/daleharvey/src/gecko-dev/old-configure.in:3813: AC_MSG_ERROR("Homedir must be single relative path.")
0:11.70 c:/Users/daleharvey/src/gecko-dev/old-configure.in:384:AC_SUBST_LIST(STL_FLAGS)
0:11.70 c:/Users/daleharvey/src/gecko-dev/old-configure.in:3882: AC_MSG_ERROR([Unable to parse cl -showIncludes prefix. This compiler's locale has an unsupported formatting.])
0:11.71 c:/Users/daleharvey/src/gecko-dev/old-configure.in:3885: AC_MSG_ERROR([Cannot find cl -showIncludes prefix.])
0:11.71 c:/Users/daleharvey/src/gecko-dev/old-configure.in:3940:AC_SUBST_LIST(GLIB_GMODULE_LIBS)
0:11.71 c:/Users/daleharvey/src/gecko-dev/old-configure.in:3971: AC_CHECK_FUNCS(FT_GlyphSlot_Embolden FT_Load_Sfnt_Table)
0:11.71 c:/Users/daleharvey/src/gecko-dev/old-configure.in:3980: [AC_MSG_ERROR(Can't find header fontconfig/fcfreetype.h.)], [#include <fontconfig/fontconfig.h>])
0:11.71 c:/Users/daleharvey/src/gecko-dev/old-configure.in:3998:AC_MSG_ERROR(--enable-system-cairo is not supported),
0:11.71 c:/Users/daleharvey/src/gecko-dev/old-configure.in:4098:AC_SUBST_LIST(MOZ_CAIRO_CFLAGS)
0:11.71 c:/Users/daleharvey/src/gecko-dev/old-configure.in:4099:AC_SUBST_LIST(MOZ_CAIRO_LIBS)
0:11.72 c:/Users/daleharvey/src/gecko-dev/old-configure.in:4100:AC_SUBST_LIST(MOZ_CAIRO_OSLIBS)
0:11.72 c:/Users/daleharvey/src/gecko-dev/old-configure.in:4104:AC_SUBST_TOML_LIST(BINDGEN_SYSTEM_FLAGS)
0:11.72 c:/Users/daleharvey/src/gecko-dev/old-configure.in:410: AC_MSG_WARN([You should only be using --with-macos-private-frameworks when cross-compiling.])
0:11.72 c:/Users/daleharvey/src/gecko-dev/old-configure.in:413: AC_MSG_ERROR([PrivateFrameworks directory not found.])
0:11.72 c:/Users/daleharvey/src/gecko-dev/old-configure.in:4155: AC_MSG_ERROR([Necko WiFi scanning needs DBus on your platform, remove --disable-dbus or use --disable-necko-wifi])
0:11.72 c:/Users/daleharvey/src/gecko-dev/old-configure.in:4186:AC_SUBST_LIST(ASFLAGS)
0:11.72 c:/Users/daleharvey/src/gecko-dev/old-configure.in:4195:AC_SUBST_LIST(MOZ_DEBUG_LDFLAGS)
0:11.72 c:/Users/daleharvey/src/gecko-dev/old-configure.in:4197:AC_SUBST_SET(MOZ_EXTENSIONS)
0:11.73 c:/Users/daleharvey/src/gecko-dev/old-configure.in:4227:AC_SUBST_LIST(MOZ_FIX_LINK_PATHS)
0:11.73 c:/Users/daleharvey/src/gecko-dev/old-configure.in:427: AC_MSG_ERROR([SDK not found. When using --with-macos-sdk, you must
0:11.73 c:/Users/daleharvey/src/gecko-dev/old-configure.in:4497:AC_SUBST_LIST(MOZ_JPEG_CFLAGS)
0:11.73 c:/Users/daleharvey/src/gecko-dev/old-configure.in:4498:AC_SUBST_LIST(MOZ_JPEG_LIBS)
0:11.73 c:/Users/daleharvey/src/gecko-dev/old-configure.in:4499:AC_SUBST_LIST(MOZ_BZ2_CFLAGS)
0:11.73 c:/Users/daleharvey/src/gecko-dev/old-configure.in:449: AC_MSG_ERROR([The selected compiler and Mac OS X SDK are incompatible.])
0:11.73 c:/Users/daleharvey/src/gecko-dev/old-configure.in:4500:AC_SUBST_LIST(MOZ_BZ2_LIBS)
0:11.73 c:/Users/daleharvey/src/gecko-dev/old-configure.in:4501:AC_SUBST_LIST(MOZ_PNG_CFLAGS)
0:11.73 c:/Users/daleharvey/src/gecko-dev/old-configure.in:4502:AC_SUBST_LIST(MOZ_PNG_LIBS)
0:11.73 c:/Users/daleharvey/src/gecko-dev/old-configure.in:4528:AC_SUBST_LIST(OS_CFLAGS)
0:11.73 c:/Users/daleharvey/src/gecko-dev/old-configure.in:4529:AC_SUBST_LIST(OS_CXXFLAGS)
0:11.74 c:/Users/daleharvey/src/gecko-dev/old-configure.in:4530:AC_SUBST_LIST(OS_CPPFLAGS)
0:11.74 c:/Users/daleharvey/src/gecko-dev/old-configure.in:4531:AC_SUBST_LIST(OS_COMPILE_CFLAGS)
0:11.74 c:/Users/daleharvey/src/gecko-dev/old-configure.in:4532:AC_SUBST_LIST(OS_COMPILE_CXXFLAGS)
0:11.74 c:/Users/daleharvey/src/gecko-dev/old-configure.in:4533:AC_SUBST_LIST(OS_LDFLAGS)
0:11.74 c:/Users/daleharvey/src/gecko-dev/old-configure.in:4538:AC_SUBST_LIST(HOST_CFLAGS)
0:11.74 c:/Users/daleharvey/src/gecko-dev/old-configure.in:4539:AC_SUBST_LIST(HOST_CPPFLAGS)
0:11.74 c:/Users/daleharvey/src/gecko-dev/old-configure.in:4540:AC_SUBST_LIST(HOST_CXXFLAGS)
0:11.74 c:/Users/daleharvey/src/gecko-dev/old-configure.in:4542:AC_SUBST_LIST(HOST_OPTIMIZE_FLAGS)
0:11.74 c:/Users/daleharvey/src/gecko-dev/old-configure.in:4557:AC_SUBST_LIST(DSO_CFLAGS)
0:11.74 c:/Users/daleharvey/src/gecko-dev/old-configure.in:4558:AC_SUBST_LIST(DSO_PIC_CFLAGS)
0:11.74 c:/Users/daleharvey/src/gecko-dev/old-configure.in:4571:AC_SUBST_LIST(FFVPX_ASFLAGS)
0:11.74 c:/Users/daleharvey/src/gecko-dev/old-configure.in:4573:AC_SUBST_LIST(VPX_ASFLAGS)
0:11.75 c:/Users/daleharvey/src/gecko-dev/old-configure.in:4578:AC_SUBST_LIST(LIBJPEG_TURBO_ASFLAGS)
0:11.75 c:/Users/daleharvey/src/gecko-dev/old-configure.in:4580:AC_SUBST_LIST(LIBAV_FFT_ASFLAGS)
0:11.75 c:/Users/daleharvey/src/gecko-dev/old-configure.in:4585:AC_SUBST_LIST(MOZ_FOLD_LIBS_FLAGS)
0:11.75 c:/Users/daleharvey/src/gecko-dev/old-configure.in:4595:AC_CHECK_FUNCS(posix_fadvise posix_fallocate)
0:11.75 c:/Users/daleharvey/src/gecko-dev/old-configure.in:4618: [ AC_MSG_ERROR([Can't find X headers (install libxt-dev (Debian/Ubuntu), libXt-devel (Fedora), or xorg-x11-libXt-devel (SuSE)).]) ])
0:11.75 c:/Users/daleharvey/src/gecko-dev/old-configure.in:4622: AC_MSG_ERROR([ Could not find the following X libraries: $MISSING_X ]);
0:11.75 c:/Users/daleharvey/src/gecko-dev/old-configure.in:4722: AC_OUTPUT_SUBDIRS_NOW("$_subconfigure_subdir",$cache_file)
0:11.75 c:/Users/daleharvey/src/gecko-dev/old-configure.in:665: AC_MSG_ERROR(
0:11.75 c:/Users/daleharvey/src/gecko-dev/old-configure.in:744: AC_MSG_ERROR([FIREFOX_VERSION is unexpectedly blank.])
0:11.75 c:/Users/daleharvey/src/gecko-dev/old-configure.in:748: AC_MSG_ERROR([FIREFOX_VERSION_DISPLAY is unexpectedly blank.])
0:11.75 c:/Users/daleharvey/src/gecko-dev/old-configure.in:776: AC_MSG_ERROR([targeting iOS but not using an iOS SDK?])
0:11.80 Traceback (most recent call last):
0:11.80 File "c:/Users/daleharvey/src/gecko-dev/configure.py", line 127, in <module>
0:11.80 sys.exit(main(sys.argv))
0:11.80 File "c:/Users/daleharvey/src/gecko-dev/configure.py", line 29, in main
0:11.80 sandbox.run(os.path.join(os.path.dirname(__file__), 'moz.configure'))
0:11.80 File "c:\Users\daleharvey\src\gecko-dev\python\mozbuild\mozbuild\configure\__init__.py", line 428, in run
0:11.80 func(*args)
0:11.81 File "c:\Users\daleharvey\src\gecko-dev\python\mozbuild\mozbuild\configure\__init__.py", line 474, in _value_for
0:11.81 return self._value_for_depends(obj, need_help_dependency)
0:11.81 File "c:\Users\daleharvey\src\gecko-dev\python\mozbuild\mozbuild\util.py", line 944, in method_call
0:11.81 cache[args] = self.func(instance, *args)
0:11.81 File "c:\Users\daleharvey\src\gecko-dev\python\mozbuild\mozbuild\configure\__init__.py", line 483, in _value_for_depends
0:11.81 return obj.result(need_help_dependency)
0:11.81 File "c:\Users\daleharvey\src\gecko-dev\python\mozbuild\mozbuild\util.py", line 944, in method_call
0:11.81 cache[args] = self.func(instance, *args)
0:11.81 File "c:\Users\daleharvey\src\gecko-dev\python\mozbuild\mozbuild\configure\__init__.py", line 123, in result
0:11.81 return self._func(*resolved_args)
0:11.81 File "c:\Users\daleharvey\src\gecko-dev\python\mozbuild\mozbuild\configure\__init__.py", line 1003, in wrapped
0:11.81 return new_func(*args, **kwargs)
0:11.82 File "c:/Users/daleharvey/src/gecko-dev/build/moz.configure/old.configure", line 110, in prepare_configure
0:11.82 old_configure + '.in'])
0:11.82 File "C:\mozilla-build\python\Lib\subprocess.py", line 219, in check_output
0:11.82 raise CalledProcessError(retcode, cmd, output=output)
0:11.82 subprocess.CalledProcessError: Command '[u'C:/mozilla-build/msys/bin/sh.exe', u'C:/mozilla-build/msys/local/bin/autoconf-2.13', u'--localdir=c:/Users/daleharvey/src/gecko-dev', u'c:/Users/daleharvey/src/gecko-dev/old-configure.in']' returned non-zero exit status 1
0:11.82 *** Fix above errors and then restart with\
0:11.82 "c:/mozilla-build/mozmake/mozmake.EXE -f client.mk build"
0:11.82 mozmake.EXE: *** [client.mk:149: configure] Error 1
Sign up for free to join this conversation on GitHub. Already have an account? Sign in to comment