Skip to content

Instantly share code, notes, and snippets.

Embed
What would you like to do?
error: npm http GET https://registry.npmjs.org/timespan
error: npm http 200 https://registry.npmjs.org/timespan
error: npm http GET https://registry.npmjs.org/timespan/-/timespan-2.2.0.tgz
error: npm http 200 https://registry.npmjs.org/timespan/-/timespan-2.2.0.tgz
error: npm WARN package.json mongodb@1.0.2 No README.md file found!
error: npm WARN package.json mongodb@0.9.9-7 No README.md file found!
error: id: cannot find name for user ID 501
error: npm http GET https://registry.npmjs.org/bson/0.0.4
error: npm http 200 https://registry.npmjs.org/bson/0.0.4
error: npm http GET https://registry.npmjs.org/bson/-/bson-0.0.4.tgz
error: npm http 200 https://registry.npmjs.org/bson/-/bson-0.0.4.tgz
error: npm http GET https://registry.npmjs.org/formidable
error: npm http 304 https://registry.npmjs.org/formidable
error: npm WARN package.json bson@0.0.4 No README.md file found!
error: npm http GET https://registry.npmjs.org/bson/0.0.6
error: npm http 200 https://registry.npmjs.org/bson/0.0.6
error: npm http GET https://registry.npmjs.org/bson/-/bson-0.0.6.tgz
error: npm http 200 https://registry.npmjs.org/bson/-/bson-0.0.6.tgz
error: npm WARN package.json bson@0.0.6 No README.md file found!
error: 'configure' finished successfully (48.014s)
error: Waf: Entering directory `/opt/haibu/apps/danielmahon/unitedagainstlungcancer.org/package/node_modules/zipfile/build'
error: ld: fatal: file /opt/local/lib/libz.so: wrong ELF class: ELFCLASS64
error: ld: fatal: file processing errors. No output written to zipcmp
error: collect2: ld returned 1 exit status
error: make[2]: *** [zipcmp] Error 1
error: make[1]: *** [all-recursive] Error 1
error: make: *** [all] Error 2
error: [1/3] cxx: src/_zipfile.cc -> build/Release/src/_zipfile_1.o
error: [2/3] cxx: src/node_zipfile.cpp -> build/Release/src/node_zipfile_1.o
error: [3/3] cxx_link: build/Release/src/_zipfile_1.o build/Release/src/node_zipfile_1.o -> build/Release/_zipfile.node
error: ld: warning: file ../deps/libzip-0.10/lib/.libs/libzip.a(zip_close.o): wrong ELF class: ELFCLASS32
error: Waf: Leaving directory `/opt/haibu/apps/danielmahon/unitedagainstlungcancer.org/package/node_modules/zipfile/build'
error: 'build' finished successfully (24.837s)
error: npm ERR!
error: npm ERR! Additional logging details can be found in:
error: npm ERR! /opt/haibu/apps/danielmahon/unitedagainstlungcancer.org/package/npm-debug.log
error: npm ERR! not ok code undefined
error: npm ERR! not ok code 1
Sign up for free to join this conversation on GitHub. Already have an account? Sign in to comment
You can’t perform that action at this time.