Create a gist now

Instantly share code, notes, and snippets.

@ddd /console.rb Secret
Created Oct 26, 2012

CFLAGS patch does not apply cleanly against 1.9.3-p286 with OR without falcon patch
∴ rvm reinstall 1.9.3-p286 --patch falcon,cflags
Removing /Users/me/.rvm/src/ruby-1.9.3-p286...
Removing /Users/me/.rvm/rubies/ruby-1.9.3-p286...
lipo: can't open input file: (No such file or directory)
Fetching yaml-0.1.4.tar.gz to /Users/me/.rvm/archives
Extracting yaml-0.1.4.tar.gz to /Users/me/.rvm/src
Configuring yaml in /Users/me/.rvm/src/yaml-0.1.4.
Compiling yaml in /Users/me/.rvm/src/yaml-0.1.4.
Installing yaml to /Users/me/.rvm/usr
Installing Ruby from source to: /Users/me/.rvm/rubies/ruby-1.9.3-p286, this may take a while depending on your cpu(s)...
ruby-1.9.3-p286 - #downloading ruby-1.9.3-p286, this may take a while depending on your connection...
ruby-1.9.3-p286 - #extracting ruby-1.9.3-p286 to /Users/me/.rvm/src/ruby-1.9.3-p286
ruby-1.9.3-p286 - #extracted to /Users/me/.rvm/src/ruby-1.9.3-p286
Applying patch /Users/me/.rvm/patches/ruby/1.9.3/p286/falcon.diff
Applying patch /Users/me/.rvm/patches/ruby/1.9.3/p286/cflags.patch
Applying patch /Users/me/.rvm/patches/ruby/1.9.3/p286/cflags.patch
Error running 'patch -F 25 -p1 -N -f -i /Users/me/.rvm/patches/ruby/1.9.3/p286/cflags.patch', please read /Users/me/.rvm/log/ruby-1.9.3-p286/patch.apply.cflags.log
There has been an error applying the specified patches. Halting the installation.
[2012-10-26 15:17:32] patch -F 25 -p1 -N -f -i /Users/me/.rvm/patches/ruby/1.9.3/p286/cflags.patch
patching file configure.in
Hunk #1 FAILED at 267.
Hunk #2 FAILED at 509.
2 out of 2 hunks FAILED -- saving rejects to file configure.in.rej
[2012-10-26 15:21:55] patch -F 25 -p1 -N -f -i /Users/me/.rvm/patches/ruby/1.9.3/p286/cflags.patch
patching file configure.in
Hunk #1 FAILED at 267.
Hunk #2 FAILED at 511.
2 out of 2 hunks FAILED -- saving rejects to file configure.in.rej
Sign up for free to join this conversation on GitHub. Already have an account? Sign in to comment