Skip to content

Embed URL

HTTPS clone URL

Subversion checkout URL

You can clone with
or
.
Download ZIP
Imagemagick failed to build on 10.6
imac-c02fptx0dh:imagemagick derek.augustine$ brew doctor
Your system is raring to brew.
This file contains any messages produced by compilers while
running configure, to aid debugging if configure makes a mistake.
It was created by ImageMagick configure 6.8.0-10, which was
generated by GNU Autoconf 2.69. Invocation command line was
$ ./configure --disable-osx-universal-binary --without-perl --prefix=/usr/local/Cellar/imagemagick/6.8.0-10 --disable-dependency-tracking --enable-shared --disable-static --without-pango --with-included-ltdl --with-modules --disable-openmp --without-gslib --with-gs-font-dir=/usr/local/share/ghostscript/fonts --without-magick-plus-plus --without-x --with-freetype=yes
## --------- ##
## Platform. ##
## --------- ##
hostname = imac-c02fptx0dh.ar.lan
uname -m = x86_64
uname -r = 10.8.0
uname -s = Darwin
uname -v = Darwin Kernel Version 10.8.0: Tue Jun 7 16:32:41 PDT 2011; root:xnu-1504.15.3~1/RELEASE_X86_64
/usr/bin/uname -p = i386
/bin/uname -X = unknown
/bin/arch = unknown
/usr/bin/arch -k = unknown
/usr/convex/getsysinfo = unknown
/usr/bin/hostinfo = Mach kernel version:
Darwin Kernel Version 10.8.0: Tue Jun 7 16:32:41 PDT 2011; root:xnu-1504.15.3~1/RELEASE_X86_64
Kernel configured for up to 4 processors.
4 processors are physically available.
4 processors are logically available.
Processor type: i486 (Intel 80486)
Processors active: 0 1 2 3
Primary memory available: 12.00 gigabytes
Default processor set: 161 tasks, 970 threads, 4 processors
Load average: 0.90, Mach factor: 3.10
/bin/machine = unknown
/usr/bin/oslevel = unknown
/bin/universe = unknown
PATH: /usr/local/share/npm/bin
PATH: /usr/local/share/npm/lib/node_modules
PATH: /usr/local/bin
PATH: /usr/bin
PATH: /bin
PATH: /usr/sbin
PATH: /sbin
PATH: /opt/local/bin
PATH: /usr/X11/bin
PATH: /usr/local/Library/Contributions/cmd
PATH: /usr/X11/bin
## ----------- ##
## Core tests. ##
## ----------- ##
configure:3508: checking build system type
configure:3522: result: x86_64-apple-darwin10.8.0
configure:3542: checking host system type
configure:3555: result: x86_64-apple-darwin10.8.0
configure:3575: checking target system type
configure:3588: result: x86_64-apple-darwin10.8.0
configure:3653: checking whether build environment is sane
configure:3708: result: yes
configure:3737: checking for a BSD-compatible install
configure:3805: result: /usr/bin/install -c
configure:3955: checking for a thread-safe mkdir -p
configure:3994: result: config/install-sh -c -d
configure:4001: checking for gawk
configure:4031: result: no
configure:4001: checking for mawk
configure:4031: result: no
configure:4001: checking for nawk
configure:4031: result: no
configure:4001: checking for awk
configure:4017: found /usr/bin/awk
configure:4028: result: awk
configure:4039: checking whether make sets $(MAKE)
configure:4061: result: yes
configure:4090: checking whether make supports nested variables
configure:4107: result: yes
configure:4199: checking whether make supports nested variables
configure:4216: result: yes
configure:4355: checking for style of include used by make
configure:4383: result: GNU
configure:4454: checking for gcc
configure:4481: result: /usr/bin/gcc-4.2
configure:4710: checking for C compiler version
configure:4719: /usr/bin/gcc-4.2 --version >&5
i686-apple-darwin10-gcc-4.2.1 (GCC) 4.2.1 (Apple Inc. build 5666) (dot 3)
Copyright (C) 2007 Free Software Foundation, Inc.
This is free software; see the source for copying conditions. There is NO
warranty; not even for MERCHANTABILITY or FITNESS FOR A PARTICULAR PURPOSE.
configure:4730: $? = 0
configure:4719: /usr/bin/gcc-4.2 -v >&5
Using built-in specs.
Target: i686-apple-darwin10
Configured with: /var/tmp/gcc/gcc-5666.3~6/src/configure --disable-checking --enable-werror --prefix=/usr --mandir=/share/man --enable-languages=c,objc,c++,obj-c++ --program-transform-name=/^[cg][^.-]*$/s/$/-4.2/ --with-slibdir=/usr/lib --build=i686-apple-darwin10 --program-prefix=i686-apple-darwin10- --host=x86_64-apple-darwin10 --target=i686-apple-darwin10 --with-gxx-include-dir=/include/c++/4.2.1
Thread model: posix
gcc version 4.2.1 (Apple Inc. build 5666) (dot 3)
configure:4730: $? = 0
configure:4719: /usr/bin/gcc-4.2 -V >&5
gcc-4.2: argument to `-V' is missing
configure:4730: $? = 1
configure:4719: /usr/bin/gcc-4.2 -qversion >&5
i686-apple-darwin10-gcc-4.2.1: no input files
configure:4730: $? = 1
configure:4750: checking whether the C compiler works
configure:4772: /usr/bin/gcc-4.2 -Os -w -pipe -march=core2 -msse4 -mmacosx-version-min=10.6 -I/usr/X11/include -L/usr/local/lib -L/usr/X11/lib conftest.c >&5
configure:4776: $? = 0
configure:4824: result: yes
configure:4827: checking for C compiler default output file name
configure:4829: result: a.out
configure:4835: checking for suffix of executables
configure:4842: /usr/bin/gcc-4.2 -o conftest -Os -w -pipe -march=core2 -msse4 -mmacosx-version-min=10.6 -I/usr/X11/include -L/usr/local/lib -L/usr/X11/lib conftest.c >&5
configure:4846: $? = 0
configure:4868: result:
configure:4890: checking whether we are cross compiling
configure:4898: /usr/bin/gcc-4.2 -o conftest -Os -w -pipe -march=core2 -msse4 -mmacosx-version-min=10.6 -I/usr/X11/include -L/usr/local/lib -L/usr/X11/lib conftest.c >&5
configure:4902: $? = 0
configure:4909: ./conftest
configure:4913: $? = 0
configure:4928: result: no
configure:4933: checking for suffix of object files
configure:4955: /usr/bin/gcc-4.2 -c -Os -w -pipe -march=core2 -msse4 -mmacosx-version-min=10.6 -I/usr/X11/include conftest.c >&5
configure:4959: $? = 0
configure:4980: result: o
configure:4984: checking whether we are using the GNU C compiler
configure:5003: /usr/bin/gcc-4.2 -c -Os -w -pipe -march=core2 -msse4 -mmacosx-version-min=10.6 -I/usr/X11/include conftest.c >&5
configure:5003: $? = 0
configure:5012: result: yes
configure:5021: checking whether /usr/bin/gcc-4.2 accepts -g
configure:5041: /usr/bin/gcc-4.2 -c -g -I/usr/X11/include conftest.c >&5
configure:5041: $? = 0
configure:5082: result: yes
configure:5099: checking for /usr/bin/gcc-4.2 option to accept ISO C89
configure:5162: /usr/bin/gcc-4.2 -c -Os -w -pipe -march=core2 -msse4 -mmacosx-version-min=10.6 -I/usr/X11/include conftest.c >&5
configure:5162: $? = 0
configure:5175: result: none needed
configure:5197: checking dependency style of /usr/bin/gcc-4.2
configure:5308: result: none
configure:5329: checking how to run the C preprocessor
configure:5360: /usr/bin/gcc-4.2 -E -I/usr/X11/include conftest.c
configure:5360: $? = 0
configure:5374: /usr/bin/gcc-4.2 -E -I/usr/X11/include conftest.c
conftest.c:14:28: error: ac_nonexistent.h: No such file or directory
configure:5374: $? = 1
configure: failed program was:
| /* confdefs.h */
| #define PACKAGE_NAME "ImageMagick"
| #define PACKAGE_TARNAME "ImageMagick"
| #define PACKAGE_VERSION "6.8.0-10"
| #define PACKAGE_STRING "ImageMagick 6.8.0-10"
| #define PACKAGE_BUGREPORT "http://www.imagemagick.org"
| #define PACKAGE_URL ""
| #define MAGICK_TARGET_CPU x86_64
| #define MAGICK_TARGET_VENDOR apple
| #define MAGICK_TARGET_OS darwin10.8.0
| #define PACKAGE "ImageMagick"
| #define VERSION "6.8.0-10"
| /* end confdefs.h. */
| #include <ac_nonexistent.h>
configure:5399: result: /usr/bin/gcc-4.2 -E
configure:5419: /usr/bin/gcc-4.2 -E -I/usr/X11/include conftest.c
configure:5419: $? = 0
configure:5433: /usr/bin/gcc-4.2 -E -I/usr/X11/include conftest.c
conftest.c:14:28: error: ac_nonexistent.h: No such file or directory
configure:5433: $? = 1
configure: failed program was:
| /* confdefs.h */
| #define PACKAGE_NAME "ImageMagick"
| #define PACKAGE_TARNAME "ImageMagick"
| #define PACKAGE_VERSION "6.8.0-10"
| #define PACKAGE_STRING "ImageMagick 6.8.0-10"
| #define PACKAGE_BUGREPORT "http://www.imagemagick.org"
| #define PACKAGE_URL ""
| #define MAGICK_TARGET_CPU x86_64
| #define MAGICK_TARGET_VENDOR apple
| #define MAGICK_TARGET_OS darwin10.8.0
| #define PACKAGE "ImageMagick"
| #define VERSION "6.8.0-10"
| /* end confdefs.h. */
| #include <ac_nonexistent.h>
configure:5462: checking for grep that handles long lines and -e
configure:5520: result: /usr/bin/grep
configure:5525: checking for egrep
configure:5587: result: /usr/bin/grep -E
configure:5592: checking for ANSI C header files
configure:5612: /usr/bin/gcc-4.2 -c -Os -w -pipe -march=core2 -msse4 -mmacosx-version-min=10.6 -I/usr/X11/include conftest.c >&5
configure:5612: $? = 0
configure:5685: /usr/bin/gcc-4.2 -o conftest -Os -w -pipe -march=core2 -msse4 -mmacosx-version-min=10.6 -I/usr/X11/include -L/usr/local/lib -L/usr/X11/lib conftest.c >&5
configure:5685: $? = 0
configure:5685: ./conftest
configure:5685: $? = 0
configure:5696: result: yes
configure:5709: checking for sys/types.h
configure:5709: /usr/bin/gcc-4.2 -c -Os -w -pipe -march=core2 -msse4 -mmacosx-version-min=10.6 -I/usr/X11/include conftest.c >&5
configure:5709: $? = 0
configure:5709: result: yes
configure:5709: checking for sys/stat.h
configure:5709: /usr/bin/gcc-4.2 -c -Os -w -pipe -march=core2 -msse4 -mmacosx-version-min=10.6 -I/usr/X11/include conftest.c >&5
configure:5709: $? = 0
configure:5709: result: yes
configure:5709: checking for stdlib.h
configure:5709: /usr/bin/gcc-4.2 -c -Os -w -pipe -march=core2 -msse4 -mmacosx-version-min=10.6 -I/usr/X11/include conftest.c >&5
configure:5709: $? = 0
configure:5709: result: yes
configure:5709: checking for string.h
configure:5709: /usr/bin/gcc-4.2 -c -Os -w -pipe -march=core2 -msse4 -mmacosx-version-min=10.6 -I/usr/X11/include conftest.c >&5
configure:5709: $? = 0
configure:5709: result: yes
configure:5709: checking for memory.h
configure:5709: /usr/bin/gcc-4.2 -c -Os -w -pipe -march=core2 -msse4 -mmacosx-version-min=10.6 -I/usr/X11/include conftest.c >&5
configure:5709: $? = 0
configure:5709: result: yes
configure:5709: checking for strings.h
configure:5709: /usr/bin/gcc-4.2 -c -Os -w -pipe -march=core2 -msse4 -mmacosx-version-min=10.6 -I/usr/X11/include conftest.c >&5
configure:5709: $? = 0
configure:5709: result: yes
configure:5709: checking for inttypes.h
configure:5709: /usr/bin/gcc-4.2 -c -Os -w -pipe -march=core2 -msse4 -mmacosx-version-min=10.6 -I/usr/X11/include conftest.c >&5
configure:5709: $? = 0
configure:5709: result: yes
configure:5709: checking for stdint.h
configure:5709: /usr/bin/gcc-4.2 -c -Os -w -pipe -march=core2 -msse4 -mmacosx-version-min=10.6 -I/usr/X11/include conftest.c >&5
configure:5709: $? = 0
configure:5709: result: yes
configure:5709: checking for unistd.h
configure:5709: /usr/bin/gcc-4.2 -c -Os -w -pipe -march=core2 -msse4 -mmacosx-version-min=10.6 -I/usr/X11/include conftest.c >&5
configure:5709: $? = 0
configure:5709: result: yes
configure:5722: checking minix/config.h usability
configure:5722: /usr/bin/gcc-4.2 -c -Os -w -pipe -march=core2 -msse4 -mmacosx-version-min=10.6 -I/usr/X11/include conftest.c >&5
conftest.c:57:26: error: minix/config.h: No such file or directory
configure:5722: $? = 1
configure: failed program was:
| /* confdefs.h */
| #define PACKAGE_NAME "ImageMagick"
| #define PACKAGE_TARNAME "ImageMagick"
| #define PACKAGE_VERSION "6.8.0-10"
| #define PACKAGE_STRING "ImageMagick 6.8.0-10"
| #define PACKAGE_BUGREPORT "http://www.imagemagick.org"
| #define PACKAGE_URL ""
| #define MAGICK_TARGET_CPU x86_64
| #define MAGICK_TARGET_VENDOR apple
| #define MAGICK_TARGET_OS darwin10.8.0
| #define PACKAGE "ImageMagick"
| #define VERSION "6.8.0-10"
| #define STDC_HEADERS 1
| #define HAVE_SYS_TYPES_H 1
| #define HAVE_SYS_STAT_H 1
| #define HAVE_STDLIB_H 1
| #define HAVE_STRING_H 1
| #define HAVE_MEMORY_H 1
| #define HAVE_STRINGS_H 1
| #define HAVE_INTTYPES_H 1
| #define HAVE_STDINT_H 1
| #define HAVE_UNISTD_H 1
| /* end confdefs.h. */
| #include <stdio.h>
| #ifdef HAVE_SYS_TYPES_H
| # include <sys/types.h>
| #endif
| #ifdef HAVE_SYS_STAT_H
| # include <sys/stat.h>
| #endif
| #ifdef STDC_HEADERS
| # include <stdlib.h>
| # include <stddef.h>
| #else
| # ifdef HAVE_STDLIB_H
| # include <stdlib.h>
| # endif
| #endif
| #ifdef HAVE_STRING_H
| # if !defined STDC_HEADERS && defined HAVE_MEMORY_H
| # include <memory.h>
| # endif
| # include <string.h>
| #endif
| #ifdef HAVE_STRINGS_H
| # include <strings.h>
| #endif
| #ifdef HAVE_INTTYPES_H
| # include <inttypes.h>
| #endif
| #ifdef HAVE_STDINT_H
| # include <stdint.h>
| #endif
| #ifdef HAVE_UNISTD_H
| # include <unistd.h>
| #endif
| #include <minix/config.h>
configure:5722: result: no
configure:5722: checking minix/config.h presence
configure:5722: /usr/bin/gcc-4.2 -E -I/usr/X11/include conftest.c
conftest.c:24:26: error: minix/config.h: No such file or directory
configure:5722: $? = 1
configure: failed program was:
| /* confdefs.h */
| #define PACKAGE_NAME "ImageMagick"
| #define PACKAGE_TARNAME "ImageMagick"
| #define PACKAGE_VERSION "6.8.0-10"
| #define PACKAGE_STRING "ImageMagick 6.8.0-10"
| #define PACKAGE_BUGREPORT "http://www.imagemagick.org"
| #define PACKAGE_URL ""
| #define MAGICK_TARGET_CPU x86_64
| #define MAGICK_TARGET_VENDOR apple
| #define MAGICK_TARGET_OS darwin10.8.0
| #define PACKAGE "ImageMagick"
| #define VERSION "6.8.0-10"
| #define STDC_HEADERS 1
| #define HAVE_SYS_TYPES_H 1
| #define HAVE_SYS_STAT_H 1
| #define HAVE_STDLIB_H 1
| #define HAVE_STRING_H 1
| #define HAVE_MEMORY_H 1
| #define HAVE_STRINGS_H 1
| #define HAVE_INTTYPES_H 1
| #define HAVE_STDINT_H 1
| #define HAVE_UNISTD_H 1
| /* end confdefs.h. */
| #include <minix/config.h>
configure:5722: result: no
configure:5722: checking for minix/config.h
configure:5722: result: no
configure:5743: checking whether it is safe to define __EXTENSIONS__
configure:5761: /usr/bin/gcc-4.2 -c -Os -w -pipe -march=core2 -msse4 -mmacosx-version-min=10.6 -I/usr/X11/include conftest.c >&5
configure:5761: $? = 0
configure:5768: result: yes
configure:5832: checking for gcc
configure:5859: result: /usr/bin/gcc-4.2
configure:6088: checking for C compiler version
configure:6097: /usr/bin/gcc-4.2 --version >&5
i686-apple-darwin10-gcc-4.2.1 (GCC) 4.2.1 (Apple Inc. build 5666) (dot 3)
Copyright (C) 2007 Free Software Foundation, Inc.
This is free software; see the source for copying conditions. There is NO
warranty; not even for MERCHANTABILITY or FITNESS FOR A PARTICULAR PURPOSE.
configure:6108: $? = 0
configure:6097: /usr/bin/gcc-4.2 -v >&5
Using built-in specs.
Target: i686-apple-darwin10
Configured with: /var/tmp/gcc/gcc-5666.3~6/src/configure --disable-checking --enable-werror --prefix=/usr --mandir=/share/man --enable-languages=c,objc,c++,obj-c++ --program-transform-name=/^[cg][^.-]*$/s/$/-4.2/ --with-slibdir=/usr/lib --build=i686-apple-darwin10 --program-prefix=i686-apple-darwin10- --host=x86_64-apple-darwin10 --target=i686-apple-darwin10 --with-gxx-include-dir=/include/c++/4.2.1
Thread model: posix
gcc version 4.2.1 (Apple Inc. build 5666) (dot 3)
configure:6108: $? = 0
configure:6097: /usr/bin/gcc-4.2 -V >&5
gcc-4.2: argument to `-V' is missing
configure:6108: $? = 1
configure:6097: /usr/bin/gcc-4.2 -qversion >&5
i686-apple-darwin10-gcc-4.2.1: no input files
configure:6108: $? = 1
configure:6112: checking whether we are using the GNU C compiler
configure:6140: result: yes
configure:6149: checking whether /usr/bin/gcc-4.2 accepts -g
configure:6210: result: yes
configure:6227: checking for /usr/bin/gcc-4.2 option to accept ISO C89
configure:6303: result: none needed
configure:6325: checking dependency style of /usr/bin/gcc-4.2
configure:6436: result: none
configure:6563: checking for C++ compiler version
configure:6572: /usr/bin/g++-4.2 --version >&5
i686-apple-darwin10-g++-4.2.1 (GCC) 4.2.1 (Apple Inc. build 5666) (dot 3)
Copyright (C) 2007 Free Software Foundation, Inc.
This is free software; see the source for copying conditions. There is NO
warranty; not even for MERCHANTABILITY or FITNESS FOR A PARTICULAR PURPOSE.
configure:6583: $? = 0
configure:6572: /usr/bin/g++-4.2 -v >&5
Using built-in specs.
Target: i686-apple-darwin10
Configured with: /var/tmp/gcc/gcc-5666.3~6/src/configure --disable-checking --enable-werror --prefix=/usr --mandir=/share/man --enable-languages=c,objc,c++,obj-c++ --program-transform-name=/^[cg][^.-]*$/s/$/-4.2/ --with-slibdir=/usr/lib --build=i686-apple-darwin10 --program-prefix=i686-apple-darwin10- --host=x86_64-apple-darwin10 --target=i686-apple-darwin10 --with-gxx-include-dir=/include/c++/4.2.1
Thread model: posix
gcc version 4.2.1 (Apple Inc. build 5666) (dot 3)
configure:6583: $? = 0
configure:6572: /usr/bin/g++-4.2 -V >&5
g++-4.2: argument to `-V' is missing
configure:6583: $? = 1
configure:6572: /usr/bin/g++-4.2 -qversion >&5
i686-apple-darwin10-g++-4.2.1: no input files
configure:6583: $? = 1
configure:6587: checking whether we are using the GNU C++ compiler
configure:6606: /usr/bin/g++-4.2 -c -Os -w -pipe -march=core2 -msse4 -mmacosx-version-min=10.6 -I/usr/X11/include conftest.cpp >&5
configure:6606: $? = 0
configure:6615: result: yes
configure:6624: checking whether /usr/bin/g++-4.2 accepts -g
configure:6644: /usr/bin/g++-4.2 -c -g -I/usr/X11/include conftest.cpp >&5
configure:6644: $? = 0
configure:6685: result: yes
configure:6710: checking dependency style of /usr/bin/g++-4.2
configure:6821: result: none
configure:6840: checking for /usr/bin/gcc-4.2 option to accept ISO C99
configure:6989: /usr/bin/gcc-4.2 -c -Os -w -pipe -march=core2 -msse4 -mmacosx-version-min=10.6 -I/usr/X11/include conftest.c >&5
conftest.c:79: error: expected ';', ',' or ')' before 'text'
conftest.c: In function 'main':
conftest.c:133: error: nested functions are disabled, use -fnested-functions to re-enable
conftest.c:133: error: expected '=', ',', ';', 'asm' or '__attribute__' before 'newvar'
conftest.c:133: error: 'newvar' undeclared (first use in this function)
conftest.c:133: error: (Each undeclared identifier is reported only once
conftest.c:133: error: for each function it appears in.)
conftest.c:143: error: 'for' loop initial declaration used outside C99 mode
configure:6989: $? = 1
configure: failed program was:
| /* confdefs.h */
| #define PACKAGE_NAME "ImageMagick"
| #define PACKAGE_TARNAME "ImageMagick"
| #define PACKAGE_VERSION "6.8.0-10"
| #define PACKAGE_STRING "ImageMagick 6.8.0-10"
| #define PACKAGE_BUGREPORT "http://www.imagemagick.org"
| #define PACKAGE_URL ""
| #define MAGICK_TARGET_CPU x86_64
| #define MAGICK_TARGET_VENDOR apple
| #define MAGICK_TARGET_OS darwin10.8.0
| #define PACKAGE "ImageMagick"
| #define VERSION "6.8.0-10"
| #define STDC_HEADERS 1
| #define HAVE_SYS_TYPES_H 1
| #define HAVE_SYS_STAT_H 1
| #define HAVE_STDLIB_H 1
| #define HAVE_STRING_H 1
| #define HAVE_MEMORY_H 1
| #define HAVE_STRINGS_H 1
| #define HAVE_INTTYPES_H 1
| #define HAVE_STDINT_H 1
| #define HAVE_UNISTD_H 1
| #define __EXTENSIONS__ 1
| #define _ALL_SOURCE 1
| #define _GNU_SOURCE 1
| #define _POSIX_PTHREAD_SEMANTICS 1
| #define _TANDEM_SOURCE 1
| /* end confdefs.h. */
| #include <stdarg.h>
| #include <stdbool.h>
| #include <stdlib.h>
| #include <wchar.h>
| #include <stdio.h>
|
| // Check varargs macros. These examples are taken from C99 6.10.3.5.
| #define debug(...) fprintf (stderr, __VA_ARGS__)
| #define showlist(...) puts (#__VA_ARGS__)
| #define report(test,...) ((test) ? puts (#test) : printf (__VA_ARGS__))
| static void
| test_varargs_macros (void)
| {
| int x = 1234;
| int y = 5678;
| debug ("Flag");
| debug ("X = %d\n", x);
| showlist (The first, second, and third items.);
| report (x>y, "x is %d but y is %d", x, y);
| }
|
| // Check long long types.
| #define BIG64 18446744073709551615ull
| #define BIG32 4294967295ul
| #define BIG_OK (BIG64 / BIG32 == 4294967297ull && BIG64 % BIG32 == 0)
| #if !BIG_OK
| your preprocessor is broken;
| #endif
| #if BIG_OK
| #else
| your preprocessor is broken;
| #endif
| static long long int bignum = -9223372036854775807LL;
| static unsigned long long int ubignum = BIG64;
|
| struct incomplete_array
| {
| int datasize;
| double data[];
| };
|
| struct named_init {
| int number;
| const wchar_t *name;
| double average;
| };
|
| typedef const char *ccp;
|
| static inline int
| test_restrict (ccp restrict text)
| {
| // See if C++-style comments work.
| // Iterate through items via the restricted pointer.
| // Also check for declarations in for loops.
| for (unsigned int i = 0; *(text+i) != '\0'; ++i)
| continue;
| return 0;
| }
|
| // Check varargs and va_copy.
| static void
| test_varargs (const char *format, ...)
| {
| va_list args;
| va_start (args, format);
| va_list args_copy;
| va_copy (args_copy, args);
|
| const char *str;
| int number;
| float fnumber;
|
| while (*format)
| {
| switch (*format++)
| {
| case 's': // string
| str = va_arg (args_copy, const char *);
| break;
| case 'd': // int
| number = va_arg (args_copy, int);
| break;
| case 'f': // float
| fnumber = va_arg (args_copy, double);
| break;
| default:
| break;
| }
| }
| va_end (args_copy);
| va_end (args);
| }
|
| int
| main ()
| {
|
| // Check bool.
| _Bool success = false;
|
| // Check restrict.
| if (test_restrict ("String literal") == 0)
| success = true;
| char *restrict newvar = "Another string";
|
| // Check varargs.
| test_varargs ("s, d' f .", "string", 65, 34.234);
| test_varargs_macros ();
|
| // Check flexible array members.
| struct incomplete_array *ia =
| malloc (sizeof (struct incomplete_array) + (sizeof (double) * 10));
| ia->datasize = 10;
| for (int i = 0; i < ia->datasize; ++i)
| ia->data[i] = i * 1.234;
|
| // Check named initializers.
| struct named_init ni = {
| .number = 34,
| .name = L"Test wide string",
| .average = 543.34343,
| };
|
| ni.number = 58;
|
| int dynamic_array[ni.number];
| dynamic_array[ni.number - 1] = 543;
|
| // work around unused variable warnings
| return (!success || bignum == 0LL || ubignum == 0uLL || newvar[0] == 'x'
| || dynamic_array[ni.number - 1] != 543);
|
| ;
| return 0;
| }
configure:6989: /usr/bin/gcc-4.2 -std=gnu99 -c -Os -w -pipe -march=core2 -msse4 -mmacosx-version-min=10.6 -I/usr/X11/include conftest.c >&5
configure:6989: $? = 0
configure:7009: result: -std=gnu99
configure:7110: checking for /usr/bin/gcc-4.2 -std=gnu99 option to accept ISO Standard C
configure:7124: result: -std=gnu99
configure:7133: checking how to run the C preprocessor
configure:7203: result: /usr/bin/gcc-4.2 -E
configure:7223: /usr/bin/gcc-4.2 -E -I/usr/X11/include conftest.c
configure:7223: $? = 0
configure:7237: /usr/bin/gcc-4.2 -E -I/usr/X11/include conftest.c
conftest.c:29:28: error: ac_nonexistent.h: No such file or directory
configure:7237: $? = 1
configure: failed program was:
| /* confdefs.h */
| #define PACKAGE_NAME "ImageMagick"
| #define PACKAGE_TARNAME "ImageMagick"
| #define PACKAGE_VERSION "6.8.0-10"
| #define PACKAGE_STRING "ImageMagick 6.8.0-10"
| #define PACKAGE_BUGREPORT "http://www.imagemagick.org"
| #define PACKAGE_URL ""
| #define MAGICK_TARGET_CPU x86_64
| #define MAGICK_TARGET_VENDOR apple
| #define MAGICK_TARGET_OS darwin10.8.0
| #define PACKAGE "ImageMagick"
| #define VERSION "6.8.0-10"
| #define STDC_HEADERS 1
| #define HAVE_SYS_TYPES_H 1
| #define HAVE_SYS_STAT_H 1
| #define HAVE_STDLIB_H 1
| #define HAVE_STRING_H 1
| #define HAVE_MEMORY_H 1
| #define HAVE_STRINGS_H 1
| #define HAVE_INTTYPES_H 1
| #define HAVE_STDINT_H 1
| #define HAVE_UNISTD_H 1
| #define __EXTENSIONS__ 1
| #define _ALL_SOURCE 1
| #define _GNU_SOURCE 1
| #define _POSIX_PTHREAD_SEMANTICS 1
| #define _TANDEM_SOURCE 1
| /* end confdefs.h. */
| #include <ac_nonexistent.h>
configure:7265: checking for a sed that does not truncate output
configure:7329: result: /usr/bin/sed
configure:7347: checking for fgrep
configure:7409: result: /usr/bin/grep -F
configure:7436: checking how to print strings
configure:7463: result: printf
configure:7496: checking for ld used by /usr/bin/gcc-4.2 -std=gnu99
configure:7563: result: /usr/libexec/gcc/i686-apple-darwin10/4.2.1/ld
configure:7570: checking if the linker (/usr/libexec/gcc/i686-apple-darwin10/4.2.1/ld) is GNU ld
configure:7585: result: no
configure:7598: checking for /usr/bin/gcc-4.2 -std=gnu99 option to accept ISO C99
configure:7767: result: -std=gnu99
configure:7776: checking whether /usr/bin/gcc-4.2 -std=gnu99 -std=gnu99 and cc understand -c and -o together
configure:7807: /usr/bin/gcc-4.2 -std=gnu99 -std=gnu99 -c conftest.c -o conftest2.o >&5
configure:7811: $? = 0
configure:7817: /usr/bin/gcc-4.2 -std=gnu99 -std=gnu99 -c conftest.c -o conftest2.o >&5
configure:7821: $? = 0
configure:7832: cc -c conftest.c >&5
configure:7836: $? = 0
configure:7844: cc -c conftest.c -o conftest2.o >&5
configure:7848: $? = 0
configure:7854: cc -c conftest.c -o conftest2.o >&5
configure:7858: $? = 0
configure:7876: result: yes
configure:7901: checking CFLAGS for maximum warnings
configure:7927: /usr/bin/gcc-4.2 -std=gnu99 -std=gnu99 -c -Os -w -pipe -march=core2 -msse4 -mmacosx-version-min=10.6 -pedantic -Wall -I/usr/X11/include conftest.c >&5
configure:7927: $? = 0
configure:7941: result: -Wall
configure:7954: : CFLAGS="$CFLAGS $ac_cv_cflags_warn_all"
configure:7957: $? = 0
configure:7966: checking whether make sets $(MAKE)
configure:7988: result: yes
configure:7997: checking whether ln -s works
configure:8001: result: yes
configure:8012: checking for gawk
configure:8039: result: awk
configure:8050: checking if malloc debugging is wanted
configure:8068: result: no
configure:8074: checking for __attribute__
configure:8096: /usr/bin/gcc-4.2 -std=gnu99 -std=gnu99 -c -Os -w -pipe -march=core2 -msse4 -mmacosx-version-min=10.6 -Wall -I/usr/X11/include conftest.c >&5
configure:8096: $? = 0
configure:8105: result: yes
configure:8125: checking for gcc architecture flag
configure:8127: result:
configure:8512: checking for gcc architecture flag
configure:8514: result: unknown
configure:8571: checking for pkg-config
configure:8589: found /usr/local/bin/pkg-config
configure:8601: result: /usr/local/bin/pkg-config
configure:8626: checking pkg-config is at least version 0.9.0
configure:8629: result: yes
configure:8647: checking if LD -Wl,--version-script works
configure:8665: /usr/bin/gcc-4.2 -std=gnu99 -std=gnu99 -o conftest -Os -w -pipe -march=core2 -msse4 -mmacosx-version-min=10.6 -Wall -I/usr/X11/include -L/usr/local/lib -L/usr/X11/lib -Wl,--version-script=conftest.map conftest.c >&5
ld: unknown option: --version-script=conftest.map
collect2: ld returned 1 exit status
configure:8665: $? = 1
configure: failed program was:
| /* confdefs.h */
| #define PACKAGE_NAME "ImageMagick"
| #define PACKAGE_TARNAME "ImageMagick"
| #define PACKAGE_VERSION "6.8.0-10"
| #define PACKAGE_STRING "ImageMagick 6.8.0-10"
| #define PACKAGE_BUGREPORT "http://www.imagemagick.org"
| #define PACKAGE_URL ""
| #define MAGICK_TARGET_CPU x86_64
| #define MAGICK_TARGET_VENDOR apple
| #define MAGICK_TARGET_OS darwin10.8.0
| #define PACKAGE "ImageMagick"
| #define VERSION "6.8.0-10"
| #define STDC_HEADERS 1
| #define HAVE_SYS_TYPES_H 1
| #define HAVE_SYS_STAT_H 1
| #define HAVE_STDLIB_H 1
| #define HAVE_STRING_H 1
| #define HAVE_MEMORY_H 1
| #define HAVE_STRINGS_H 1
| #define HAVE_INTTYPES_H 1
| #define HAVE_STDINT_H 1
| #define HAVE_UNISTD_H 1
| #define __EXTENSIONS__ 1
| #define _ALL_SOURCE 1
| #define _GNU_SOURCE 1
| #define _POSIX_PTHREAD_SEMANTICS 1
| #define _TANDEM_SOURCE 1
| #define HAVE___ATTRIBUTE__ 1
| /* end confdefs.h. */
|
| int
| main ()
| {
|
| ;
| return 0;
| }
configure:8693: /usr/bin/gcc-4.2 -std=gnu99 -std=gnu99 -o conftest -Os -w -pipe -march=core2 -msse4 -mmacosx-version-min=10.6 -Wall -I/usr/X11/include -L/usr/local/lib -L/usr/X11/lib -Wl,--version-script=conftest.map conftest.c >&5
ld: unknown option: --version-script=conftest.map
collect2: ld returned 1 exit status
configure:8693: $? = 1
configure: failed program was:
| /* confdefs.h */
| #define PACKAGE_NAME "ImageMagick"
| #define PACKAGE_TARNAME "ImageMagick"
| #define PACKAGE_VERSION "6.8.0-10"
| #define PACKAGE_STRING "ImageMagick 6.8.0-10"
| #define PACKAGE_BUGREPORT "http://www.imagemagick.org"
| #define PACKAGE_URL ""
| #define MAGICK_TARGET_CPU x86_64
| #define MAGICK_TARGET_VENDOR apple
| #define MAGICK_TARGET_OS darwin10.8.0
| #define PACKAGE "ImageMagick"
| #define VERSION "6.8.0-10"
| #define STDC_HEADERS 1
| #define HAVE_SYS_TYPES_H 1
| #define HAVE_SYS_STAT_H 1
| #define HAVE_STDLIB_H 1
| #define HAVE_STRING_H 1
| #define HAVE_MEMORY_H 1
| #define HAVE_STRINGS_H 1
| #define HAVE_INTTYPES_H 1
| #define HAVE_STDINT_H 1
| #define HAVE_UNISTD_H 1
| #define __EXTENSIONS__ 1
| #define _ALL_SOURCE 1
| #define _GNU_SOURCE 1
| #define _POSIX_PTHREAD_SEMANTICS 1
| #define _TANDEM_SOURCE 1
| #define HAVE___ATTRIBUTE__ 1
| /* end confdefs.h. */
|
| int
| main ()
| {
|
| ;
| return 0;
| }
configure:8705: result: no
configure:8821: checking for linker lazyload option
configure:8837: result: none
configure:9031: checking whether pthreads work with -pthread
configure:9119: /usr/bin/gcc-4.2 -std=gnu99 -std=gnu99 -o conftest -Os -w -pipe -march=core2 -msse4 -mmacosx-version-min=10.6 -Wall -pthread -I/usr/X11/include -L/usr/local/lib -L/usr/X11/lib conftest.c >&5
configure:9119: $? = 0
configure:9128: result: yes
configure:9147: checking for joinable pthread attribute
configure:9162: /usr/bin/gcc-4.2 -std=gnu99 -std=gnu99 -o conftest -Os -w -pipe -march=core2 -msse4 -mmacosx-version-min=10.6 -Wall -pthread -I/usr/X11/include -L/usr/local/lib -L/usr/X11/lib conftest.c >&5
configure:9162: $? = 0
configure:9168: result: PTHREAD_CREATE_JOINABLE
configure:9178: checking if more special flags are required for pthreads
configure:9185: result: -D_THREAD_SAFE
configure:9191: checking for PTHREAD_PRIO_INHERIT
configure:9209: /usr/bin/gcc-4.2 -std=gnu99 -std=gnu99 -o conftest -Os -w -pipe -march=core2 -msse4 -mmacosx-version-min=10.6 -Wall -pthread -I/usr/X11/include -L/usr/local/lib -L/usr/X11/lib conftest.c >&5
configure:9209: $? = 0
configure:9218: result: yes
configure:9420: checking for pthread_join in LIBS= with CFLAGS=-D_THREAD_SAFE -pthread
configure:9440: /usr/bin/gcc-4.2 -std=gnu99 -std=gnu99 -o conftest -Os -w -pipe -march=core2 -msse4 -mmacosx-version-min=10.6 -Wall -D_THREAD_SAFE -pthread -D_THREAD_SAFE -pthread -I/usr/X11/include -L/usr/local/lib -L/usr/X11/lib conftest.c >&5
configure:9440: $? = 0
configure:9445: result: yes
configure:9632: checking for joinable pthread attribute
configure:9647: /usr/bin/gcc-4.2 -std=gnu99 -std=gnu99 -o conftest -Os -w -pipe -march=core2 -msse4 -mmacosx-version-min=10.6 -Wall -D_THREAD_SAFE -pthread -D_THREAD_SAFE -pthread -I/usr/X11/include -L/usr/local/lib -L/usr/X11/lib conftest.c >&5
configure:9647: $? = 0
configure:9653: result: PTHREAD_CREATE_JOINABLE
configure:9663: checking if more special flags are required for pthreads
configure:9670: result: -D_THREAD_SAFE
configure:9676: checking for PTHREAD_PRIO_INHERIT
configure:9703: result: yes
configure:9803: checking whether we are using the Microsoft C compiler
configure:9822: /usr/bin/gcc-4.2 -std=gnu99 -std=gnu99 -c -Os -w -pipe -march=core2 -msse4 -mmacosx-version-min=10.6 -Wall -D_THREAD_SAFE -pthread -I/usr/X11/include conftest.c >&5
conftest.c: In function 'main':
conftest.c:40: error: 'choke' undeclared (first use in this function)
conftest.c:40: error: (Each undeclared identifier is reported only once
conftest.c:40: error: for each function it appears in.)
conftest.c:40: error: expected ';' before 'me'
configure:9822: $? = 1
configure: failed program was:
| /* confdefs.h */
| #define PACKAGE_NAME "ImageMagick"
| #define PACKAGE_TARNAME "ImageMagick"
| #define PACKAGE_VERSION "6.8.0-10"
| #define PACKAGE_STRING "ImageMagick 6.8.0-10"
| #define PACKAGE_BUGREPORT "http://www.imagemagick.org"
| #define PACKAGE_URL ""
| #define MAGICK_TARGET_CPU x86_64
| #define MAGICK_TARGET_VENDOR apple
| #define MAGICK_TARGET_OS darwin10.8.0
| #define PACKAGE "ImageMagick"
| #define VERSION "6.8.0-10"
| #define STDC_HEADERS 1
| #define HAVE_SYS_TYPES_H 1
| #define HAVE_SYS_STAT_H 1
| #define HAVE_STDLIB_H 1
| #define HAVE_STRING_H 1
| #define HAVE_MEMORY_H 1
| #define HAVE_STRINGS_H 1
| #define HAVE_INTTYPES_H 1
| #define HAVE_STDINT_H 1
| #define HAVE_UNISTD_H 1
| #define __EXTENSIONS__ 1
| #define _ALL_SOURCE 1
| #define _GNU_SOURCE 1
| #define _POSIX_PTHREAD_SEMANTICS 1
| #define _TANDEM_SOURCE 1
| #define HAVE___ATTRIBUTE__ 1
| #define HAVE_PTHREAD_PRIO_INHERIT 1
| #define HAVE_PTHREAD 1
| #define THREAD_SUPPORT 1
| #define HAVE_PTHREAD_PRIO_INHERIT 1
| #define HAVE_PTHREAD 1
| /* end confdefs.h. */
|
| int
| main ()
| {
| #ifndef _MSC_VER
| choke me
| #endif
|
| ;
| return 0;
| }
configure:9831: result: no
configure:9842: checking CL/cl.h usability
configure:9842: /usr/bin/gcc-4.2 -std=gnu99 -std=gnu99 -c -Os -w -pipe -march=core2 -msse4 -mmacosx-version-min=10.6 -Wall -D_THREAD_SAFE -pthread -D_THREAD_SAFE -D_THREAD_SAFE -pthread -I/usr/X11/include conftest.c >&5
conftest.c:68:19: error: CL/cl.h: No such file or directory
configure:9842: $? = 1
configure: failed program was:
| /* confdefs.h */
| #define PACKAGE_NAME "ImageMagick"
| #define PACKAGE_TARNAME "ImageMagick"
| #define PACKAGE_VERSION "6.8.0-10"
| #define PACKAGE_STRING "ImageMagick 6.8.0-10"
| #define PACKAGE_BUGREPORT "http://www.imagemagick.org"
| #define PACKAGE_URL ""
| #define MAGICK_TARGET_CPU x86_64
| #define MAGICK_TARGET_VENDOR apple
| #define MAGICK_TARGET_OS darwin10.8.0
| #define PACKAGE "ImageMagick"
| #define VERSION "6.8.0-10"
| #define STDC_HEADERS 1
| #define HAVE_SYS_TYPES_H 1
| #define HAVE_SYS_STAT_H 1
| #define HAVE_STDLIB_H 1
| #define HAVE_STRING_H 1
| #define HAVE_MEMORY_H 1
| #define HAVE_STRINGS_H 1
| #define HAVE_INTTYPES_H 1
| #define HAVE_STDINT_H 1
| #define HAVE_UNISTD_H 1
| #define __EXTENSIONS__ 1
| #define _ALL_SOURCE 1
| #define _GNU_SOURCE 1
| #define _POSIX_PTHREAD_SEMANTICS 1
| #define _TANDEM_SOURCE 1
| #define HAVE___ATTRIBUTE__ 1
| #define HAVE_PTHREAD_PRIO_INHERIT 1
| #define HAVE_PTHREAD 1
| #define THREAD_SUPPORT 1
| #define HAVE_PTHREAD_PRIO_INHERIT 1
| #define HAVE_PTHREAD 1
| /* end confdefs.h. */
| #include <stdio.h>
| #ifdef HAVE_SYS_TYPES_H
| # include <sys/types.h>
| #endif
| #ifdef HAVE_SYS_STAT_H
| # include <sys/stat.h>
| #endif
| #ifdef STDC_HEADERS
| # include <stdlib.h>
| # include <stddef.h>
| #else
| # ifdef HAVE_STDLIB_H
| # include <stdlib.h>
| # endif
| #endif
| #ifdef HAVE_STRING_H
| # if !defined STDC_HEADERS && defined HAVE_MEMORY_H
| # include <memory.h>
| # endif
| # include <string.h>
| #endif
| #ifdef HAVE_STRINGS_H
| # include <strings.h>
| #endif
| #ifdef HAVE_INTTYPES_H
| # include <inttypes.h>
| #endif
| #ifdef HAVE_STDINT_H
| # include <stdint.h>
| #endif
| #ifdef HAVE_UNISTD_H
| # include <unistd.h>
| #endif
| #include <CL/cl.h>
configure:9842: result: no
configure:9842: checking CL/cl.h presence
configure:9842: /usr/bin/gcc-4.2 -E -D_THREAD_SAFE -D_THREAD_SAFE -pthread -I/usr/X11/include conftest.c
conftest.c:35:19: error: CL/cl.h: No such file or directory
configure:9842: $? = 1
configure: failed program was:
| /* confdefs.h */
| #define PACKAGE_NAME "ImageMagick"
| #define PACKAGE_TARNAME "ImageMagick"
| #define PACKAGE_VERSION "6.8.0-10"
| #define PACKAGE_STRING "ImageMagick 6.8.0-10"
| #define PACKAGE_BUGREPORT "http://www.imagemagick.org"
| #define PACKAGE_URL ""
| #define MAGICK_TARGET_CPU x86_64
| #define MAGICK_TARGET_VENDOR apple
| #define MAGICK_TARGET_OS darwin10.8.0
| #define PACKAGE "ImageMagick"
| #define VERSION "6.8.0-10"
| #define STDC_HEADERS 1
| #define HAVE_SYS_TYPES_H 1
| #define HAVE_SYS_STAT_H 1
| #define HAVE_STDLIB_H 1
| #define HAVE_STRING_H 1
| #define HAVE_MEMORY_H 1
| #define HAVE_STRINGS_H 1
| #define HAVE_INTTYPES_H 1
| #define HAVE_STDINT_H 1
| #define HAVE_UNISTD_H 1
| #define __EXTENSIONS__ 1
| #define _ALL_SOURCE 1
| #define _GNU_SOURCE 1
| #define _POSIX_PTHREAD_SEMANTICS 1
| #define _TANDEM_SOURCE 1
| #define HAVE___ATTRIBUTE__ 1
| #define HAVE_PTHREAD_PRIO_INHERIT 1
| #define HAVE_PTHREAD 1
| #define THREAD_SUPPORT 1
| #define HAVE_PTHREAD_PRIO_INHERIT 1
| #define HAVE_PTHREAD 1
| /* end confdefs.h. */
| #include <CL/cl.h>
configure:9842: result: no
configure:9842: checking for CL/cl.h
configure:9842: result: no
configure:9842: checking OpenCL/cl.h usability
configure:9842: /usr/bin/gcc-4.2 -std=gnu99 -std=gnu99 -c -Os -w -pipe -march=core2 -msse4 -mmacosx-version-min=10.6 -Wall -D_THREAD_SAFE -pthread -D_THREAD_SAFE -D_THREAD_SAFE -pthread -I/usr/X11/include conftest.c >&5
configure:9842: $? = 0
configure:9842: result: yes
configure:9842: checking OpenCL/cl.h presence
configure:9842: /usr/bin/gcc-4.2 -E -D_THREAD_SAFE -D_THREAD_SAFE -pthread -I/usr/X11/include conftest.c
configure:9842: $? = 0
configure:9842: result: yes
configure:9842: checking for OpenCL/cl.h
configure:9842: result: yes
configure:9856: checking windows.h usability
configure:9856: /usr/bin/gcc-4.2 -std=gnu99 -std=gnu99 -c -Os -w -pipe -march=core2 -msse4 -mmacosx-version-min=10.6 -Wall -D_THREAD_SAFE -pthread -I/usr/X11/include conftest.c >&5
conftest.c:69:21: error: windows.h: No such file or directory
configure:9856: $? = 1
configure: failed program was:
| /* confdefs.h */
| #define PACKAGE_NAME "ImageMagick"
| #define PACKAGE_TARNAME "ImageMagick"
| #define PACKAGE_VERSION "6.8.0-10"
| #define PACKAGE_STRING "ImageMagick 6.8.0-10"
| #define PACKAGE_BUGREPORT "http://www.imagemagick.org"
| #define PACKAGE_URL ""
| #define MAGICK_TARGET_CPU x86_64
| #define MAGICK_TARGET_VENDOR apple
| #define MAGICK_TARGET_OS darwin10.8.0
| #define PACKAGE "ImageMagick"
| #define VERSION "6.8.0-10"
| #define STDC_HEADERS 1
| #define HAVE_SYS_TYPES_H 1
| #define HAVE_SYS_STAT_H 1
| #define HAVE_STDLIB_H 1
| #define HAVE_STRING_H 1
| #define HAVE_MEMORY_H 1
| #define HAVE_STRINGS_H 1
| #define HAVE_INTTYPES_H 1
| #define HAVE_STDINT_H 1
| #define HAVE_UNISTD_H 1
| #define __EXTENSIONS__ 1
| #define _ALL_SOURCE 1
| #define _GNU_SOURCE 1
| #define _POSIX_PTHREAD_SEMANTICS 1
| #define _TANDEM_SOURCE 1
| #define HAVE___ATTRIBUTE__ 1
| #define HAVE_PTHREAD_PRIO_INHERIT 1
| #define HAVE_PTHREAD 1
| #define THREAD_SUPPORT 1
| #define HAVE_PTHREAD_PRIO_INHERIT 1
| #define HAVE_PTHREAD 1
| #define HAVE_OPENCL_CL_H 1
| /* end confdefs.h. */
| #include <stdio.h>
| #ifdef HAVE_SYS_TYPES_H
| # include <sys/types.h>
| #endif
| #ifdef HAVE_SYS_STAT_H
| # include <sys/stat.h>
| #endif
| #ifdef STDC_HEADERS
| # include <stdlib.h>
| # include <stddef.h>
| #else
| # ifdef HAVE_STDLIB_H
| # include <stdlib.h>
| # endif
| #endif
| #ifdef HAVE_STRING_H
| # if !defined STDC_HEADERS && defined HAVE_MEMORY_H
| # include <memory.h>
| # endif
| # include <string.h>
| #endif
| #ifdef HAVE_STRINGS_H
| # include <strings.h>
| #endif
| #ifdef HAVE_INTTYPES_H
| # include <inttypes.h>
| #endif
| #ifdef HAVE_STDINT_H
| # include <stdint.h>
| #endif
| #ifdef HAVE_UNISTD_H
| # include <unistd.h>
| #endif
| #include <windows.h>
configure:9856: result: no
configure:9856: checking windows.h presence
configure:9856: /usr/bin/gcc-4.2 -E -I/usr/X11/include conftest.c
conftest.c:36:21: error: windows.h: No such file or directory
configure:9856: $? = 1
configure: failed program was:
| /* confdefs.h */
| #define PACKAGE_NAME "ImageMagick"
| #define PACKAGE_TARNAME "ImageMagick"
| #define PACKAGE_VERSION "6.8.0-10"
| #define PACKAGE_STRING "ImageMagick 6.8.0-10"
| #define PACKAGE_BUGREPORT "http://www.imagemagick.org"
| #define PACKAGE_URL ""
| #define MAGICK_TARGET_CPU x86_64
| #define MAGICK_TARGET_VENDOR apple
| #define MAGICK_TARGET_OS darwin10.8.0
| #define PACKAGE "ImageMagick"
| #define VERSION "6.8.0-10"
| #define STDC_HEADERS 1
| #define HAVE_SYS_TYPES_H 1
| #define HAVE_SYS_STAT_H 1
| #define HAVE_STDLIB_H 1
| #define HAVE_STRING_H 1
| #define HAVE_MEMORY_H 1
| #define HAVE_STRINGS_H 1
| #define HAVE_INTTYPES_H 1
| #define HAVE_STDINT_H 1
| #define HAVE_UNISTD_H 1
| #define __EXTENSIONS__ 1
| #define _ALL_SOURCE 1
| #define _GNU_SOURCE 1
| #define _POSIX_PTHREAD_SEMANTICS 1
| #define _TANDEM_SOURCE 1
| #define HAVE___ATTRIBUTE__ 1
| #define HAVE_PTHREAD_PRIO_INHERIT 1
| #define HAVE_PTHREAD 1
| #define THREAD_SUPPORT 1
| #define HAVE_PTHREAD_PRIO_INHERIT 1
| #define HAVE_PTHREAD 1
| #define HAVE_OPENCL_CL_H 1
| /* end confdefs.h. */
| #include <windows.h>
configure:9856: result: no
configure:9856: checking for windows.h
configure:9856: result: no
configure:9869: checking for OpenCL library
configure:9912: /usr/bin/gcc-4.2 -std=gnu99 -std=gnu99 -o conftest -Os -w -pipe -march=core2 -msse4 -mmacosx-version-min=10.6 -Wall -D_THREAD_SAFE -pthread -D_THREAD_SAFE -D_THREAD_SAFE -pthread -I/usr/X11/include -L/usr/local/lib -L/usr/X11/lib conftest.c -lOpenCL -lm >&5
ld: library not found for -lOpenCL
collect2: ld returned 1 exit status
configure:9912: $? = 1
configure: failed program was:
| /* confdefs.h */
| #define PACKAGE_NAME "ImageMagick"
| #define PACKAGE_TARNAME "ImageMagick"
| #define PACKAGE_VERSION "6.8.0-10"
| #define PACKAGE_STRING "ImageMagick 6.8.0-10"
| #define PACKAGE_BUGREPORT "http://www.imagemagick.org"
| #define PACKAGE_URL ""
| #define MAGICK_TARGET_CPU x86_64
| #define MAGICK_TARGET_VENDOR apple
| #define MAGICK_TARGET_OS darwin10.8.0
| #define PACKAGE "ImageMagick"
| #define VERSION "6.8.0-10"
| #define STDC_HEADERS 1
| #define HAVE_SYS_TYPES_H 1
| #define HAVE_SYS_STAT_H 1
| #define HAVE_STDLIB_H 1
| #define HAVE_STRING_H 1
| #define HAVE_MEMORY_H 1
| #define HAVE_STRINGS_H 1
| #define HAVE_INTTYPES_H 1
| #define HAVE_STDINT_H 1
| #define HAVE_UNISTD_H 1
| #define __EXTENSIONS__ 1
| #define _ALL_SOURCE 1
| #define _GNU_SOURCE 1
| #define _POSIX_PTHREAD_SEMANTICS 1
| #define _TANDEM_SOURCE 1
| #define HAVE___ATTRIBUTE__ 1
| #define HAVE_PTHREAD_PRIO_INHERIT 1
| #define HAVE_PTHREAD 1
| #define THREAD_SUPPORT 1
| #define HAVE_PTHREAD_PRIO_INHERIT 1
| #define HAVE_PTHREAD 1
| #define HAVE_OPENCL_CL_H 1
| /* end confdefs.h. */
|
| # if defined(HAVE_WINDOWS_H) && defined(_WIN32)
| # include <windows.h>
| # endif
| # ifdef HAVE_CL_CL_H
| # include <CL/cl.h>
| # elif defined(HAVE_OPENCL_CL_H)
| # include <OpenCL/cl.h>
| # else
| # error no CL.h
| # endif
| int
| main ()
| {
| clCreateContextFromType(0,0,0,0,0)
| ;
| return 0;
| }
configure:9937: /usr/bin/gcc-4.2 -std=gnu99 -std=gnu99 -o conftest -Os -w -pipe -march=core2 -msse4 -mmacosx-version-min=10.6 -Wall -D_THREAD_SAFE -pthread -D_THREAD_SAFE -D_THREAD_SAFE -pthread -I/usr/X11/include -L/usr/local/lib -L/usr/X11/lib conftest.c -lOpenCL -L/usr/lib64/nvidia -lm >&5
ld: library not found for -lOpenCL
collect2: ld returned 1 exit status
configure:9937: $? = 1
configure: failed program was:
| /* confdefs.h */
| #define PACKAGE_NAME "ImageMagick"
| #define PACKAGE_TARNAME "ImageMagick"
| #define PACKAGE_VERSION "6.8.0-10"
| #define PACKAGE_STRING "ImageMagick 6.8.0-10"
| #define PACKAGE_BUGREPORT "http://www.imagemagick.org"
| #define PACKAGE_URL ""
| #define MAGICK_TARGET_CPU x86_64
| #define MAGICK_TARGET_VENDOR apple
| #define MAGICK_TARGET_OS darwin10.8.0
| #define PACKAGE "ImageMagick"
| #define VERSION "6.8.0-10"
| #define STDC_HEADERS 1
| #define HAVE_SYS_TYPES_H 1
| #define HAVE_SYS_STAT_H 1
| #define HAVE_STDLIB_H 1
| #define HAVE_STRING_H 1
| #define HAVE_MEMORY_H 1
| #define HAVE_STRINGS_H 1
| #define HAVE_INTTYPES_H 1
| #define HAVE_STDINT_H 1
| #define HAVE_UNISTD_H 1
| #define __EXTENSIONS__ 1
| #define _ALL_SOURCE 1
| #define _GNU_SOURCE 1
| #define _POSIX_PTHREAD_SEMANTICS 1
| #define _TANDEM_SOURCE 1
| #define HAVE___ATTRIBUTE__ 1
| #define HAVE_PTHREAD_PRIO_INHERIT 1
| #define HAVE_PTHREAD 1
| #define THREAD_SUPPORT 1
| #define HAVE_PTHREAD_PRIO_INHERIT 1
| #define HAVE_PTHREAD 1
| #define HAVE_OPENCL_CL_H 1
| /* end confdefs.h. */
|
| # if defined(HAVE_WINDOWS_H) && defined(_WIN32)
| # include <windows.h>
| # endif
| # ifdef HAVE_CL_CL_H
| # include <CL/cl.h>
| # elif defined(HAVE_OPENCL_CL_H)
| # include <OpenCL/cl.h>
| # else
| # error no CL.h
| # endif
| int
| main ()
| {
| clCreateContextFromType(0,0,0,0,0)
| ;
| return 0;
| }
configure:9962: /usr/bin/gcc-4.2 -std=gnu99 -std=gnu99 -o conftest -Os -w -pipe -march=core2 -msse4 -mmacosx-version-min=10.6 -Wall -D_THREAD_SAFE -pthread -D_THREAD_SAFE -D_THREAD_SAFE -pthread -I/usr/X11/include -L/usr/local/lib -L/usr/X11/lib conftest.c -lOpenCL -Wl,-framework,OpenCL -L/System/Library/Frameworks/OpenCL.framework/Versions/A/Libraries -lm >&5
ld: library not found for -lOpenCL
collect2: ld returned 1 exit status
configure:9962: $? = 1
configure: failed program was:
| /* confdefs.h */
| #define PACKAGE_NAME "ImageMagick"
| #define PACKAGE_TARNAME "ImageMagick"
| #define PACKAGE_VERSION "6.8.0-10"
| #define PACKAGE_STRING "ImageMagick 6.8.0-10"
| #define PACKAGE_BUGREPORT "http://www.imagemagick.org"
| #define PACKAGE_URL ""
| #define MAGICK_TARGET_CPU x86_64
| #define MAGICK_TARGET_VENDOR apple
| #define MAGICK_TARGET_OS darwin10.8.0
| #define PACKAGE "ImageMagick"
| #define VERSION "6.8.0-10"
| #define STDC_HEADERS 1
| #define HAVE_SYS_TYPES_H 1
| #define HAVE_SYS_STAT_H 1
| #define HAVE_STDLIB_H 1
| #define HAVE_STRING_H 1
| #define HAVE_MEMORY_H 1
| #define HAVE_STRINGS_H 1
| #define HAVE_INTTYPES_H 1
| #define HAVE_STDINT_H 1
| #define HAVE_UNISTD_H 1
| #define __EXTENSIONS__ 1
| #define _ALL_SOURCE 1
| #define _GNU_SOURCE 1
| #define _POSIX_PTHREAD_SEMANTICS 1
| #define _TANDEM_SOURCE 1
| #define HAVE___ATTRIBUTE__ 1
| #define HAVE_PTHREAD_PRIO_INHERIT 1
| #define HAVE_PTHREAD 1
| #define THREAD_SUPPORT 1
| #define HAVE_PTHREAD_PRIO_INHERIT 1
| #define HAVE_PTHREAD 1
| #define HAVE_OPENCL_CL_H 1
| /* end confdefs.h. */
|
| # if defined(HAVE_WINDOWS_H) && defined(_WIN32)
| # include <windows.h>
| # endif
| # ifdef HAVE_CL_CL_H
| # include <CL/cl.h>
| # elif defined(HAVE_OPENCL_CL_H)
| # include <OpenCL/cl.h>
| # else
| # error no CL.h
| # endif
| int
| main ()
| {
| clCreateContextFromType(0,0,0,0,0)
| ;
| return 0;
| }
configure:9912: /usr/bin/gcc-4.2 -std=gnu99 -std=gnu99 -o conftest -Os -w -pipe -march=core2 -msse4 -mmacosx-version-min=10.6 -Wall -D_THREAD_SAFE -pthread -D_THREAD_SAFE -D_THREAD_SAFE -pthread -I/usr/X11/include -L/usr/local/lib -L/usr/X11/lib conftest.c -lCL -lm >&5
ld: library not found for -lCL
collect2: ld returned 1 exit status
configure:9912: $? = 1
configure: failed program was:
| /* confdefs.h */
| #define PACKAGE_NAME "ImageMagick"
| #define PACKAGE_TARNAME "ImageMagick"
| #define PACKAGE_VERSION "6.8.0-10"
| #define PACKAGE_STRING "ImageMagick 6.8.0-10"
| #define PACKAGE_BUGREPORT "http://www.imagemagick.org"
| #define PACKAGE_URL ""
| #define MAGICK_TARGET_CPU x86_64
| #define MAGICK_TARGET_VENDOR apple
| #define MAGICK_TARGET_OS darwin10.8.0
| #define PACKAGE "ImageMagick"
| #define VERSION "6.8.0-10"
| #define STDC_HEADERS 1
| #define HAVE_SYS_TYPES_H 1
| #define HAVE_SYS_STAT_H 1
| #define HAVE_STDLIB_H 1
| #define HAVE_STRING_H 1
| #define HAVE_MEMORY_H 1
| #define HAVE_STRINGS_H 1
| #define HAVE_INTTYPES_H 1
| #define HAVE_STDINT_H 1
| #define HAVE_UNISTD_H 1
| #define __EXTENSIONS__ 1
| #define _ALL_SOURCE 1
| #define _GNU_SOURCE 1
| #define _POSIX_PTHREAD_SEMANTICS 1
| #define _TANDEM_SOURCE 1
| #define HAVE___ATTRIBUTE__ 1
| #define HAVE_PTHREAD_PRIO_INHERIT 1
| #define HAVE_PTHREAD 1
| #define THREAD_SUPPORT 1
| #define HAVE_PTHREAD_PRIO_INHERIT 1
| #define HAVE_PTHREAD 1
| #define HAVE_OPENCL_CL_H 1
| /* end confdefs.h. */
|
| # if defined(HAVE_WINDOWS_H) && defined(_WIN32)
| # include <windows.h>
| # endif
| # ifdef HAVE_CL_CL_H
| # include <CL/cl.h>
| # elif defined(HAVE_OPENCL_CL_H)
| # include <OpenCL/cl.h>
| # else
| # error no CL.h
| # endif
| int
| main ()
| {
| clCreateContextFromType(0,0,0,0,0)
| ;
| return 0;
| }
configure:9937: /usr/bin/gcc-4.2 -std=gnu99 -std=gnu99 -o conftest -Os -w -pipe -march=core2 -msse4 -mmacosx-version-min=10.6 -Wall -D_THREAD_SAFE -pthread -D_THREAD_SAFE -D_THREAD_SAFE -pthread -I/usr/X11/include -L/usr/local/lib -L/usr/X11/lib conftest.c -lCL -L/usr/lib64/nvidia -lm >&5
ld: library not found for -lCL
collect2: ld returned 1 exit status
configure:9937: $? = 1
configure: failed program was:
| /* confdefs.h */
| #define PACKAGE_NAME "ImageMagick"
| #define PACKAGE_TARNAME "ImageMagick"
| #define PACKAGE_VERSION "6.8.0-10"
| #define PACKAGE_STRING "ImageMagick 6.8.0-10"
| #define PACKAGE_BUGREPORT "http://www.imagemagick.org"
| #define PACKAGE_URL ""
| #define MAGICK_TARGET_CPU x86_64
| #define MAGICK_TARGET_VENDOR apple
| #define MAGICK_TARGET_OS darwin10.8.0
| #define PACKAGE "ImageMagick"
| #define VERSION "6.8.0-10"
| #define STDC_HEADERS 1
| #define HAVE_SYS_TYPES_H 1
| #define HAVE_SYS_STAT_H 1
| #define HAVE_STDLIB_H 1
| #define HAVE_STRING_H 1
| #define HAVE_MEMORY_H 1
| #define HAVE_STRINGS_H 1
| #define HAVE_INTTYPES_H 1
| #define HAVE_STDINT_H 1
| #define HAVE_UNISTD_H 1
| #define __EXTENSIONS__ 1
| #define _ALL_SOURCE 1
| #define _GNU_SOURCE 1
| #define _POSIX_PTHREAD_SEMANTICS 1
| #define _TANDEM_SOURCE 1
| #define HAVE___ATTRIBUTE__ 1
| #define HAVE_PTHREAD_PRIO_INHERIT 1
| #define HAVE_PTHREAD 1
| #define THREAD_SUPPORT 1
| #define HAVE_PTHREAD_PRIO_INHERIT 1
| #define HAVE_PTHREAD 1
| #define HAVE_OPENCL_CL_H 1
| /* end confdefs.h. */
|
| # if defined(HAVE_WINDOWS_H) && defined(_WIN32)
| # include <windows.h>
| # endif
| # ifdef HAVE_CL_CL_H
| # include <CL/cl.h>
| # elif defined(HAVE_OPENCL_CL_H)
| # include <OpenCL/cl.h>
| # else
| # error no CL.h
| # endif
| int
| main ()
| {
| clCreateContextFromType(0,0,0,0,0)
| ;
| return 0;
| }
configure:9962: /usr/bin/gcc-4.2 -std=gnu99 -std=gnu99 -o conftest -Os -w -pipe -march=core2 -msse4 -mmacosx-version-min=10.6 -Wall -D_THREAD_SAFE -pthread -D_THREAD_SAFE -D_THREAD_SAFE -pthread -I/usr/X11/include -L/usr/local/lib -L/usr/X11/lib conftest.c -lCL -Wl,-framework,OpenCL -L/System/Library/Frameworks/OpenCL.framework/Versions/A/Libraries -lm >&5
ld: library not found for -lCL
collect2: ld returned 1 exit status
configure:9962: $? = 1
configure: failed program was:
| /* confdefs.h */
| #define PACKAGE_NAME "ImageMagick"
| #define PACKAGE_TARNAME "ImageMagick"
| #define PACKAGE_VERSION "6.8.0-10"
| #define PACKAGE_STRING "ImageMagick 6.8.0-10"
| #define PACKAGE_BUGREPORT "http://www.imagemagick.org"
| #define PACKAGE_URL ""
| #define MAGICK_TARGET_CPU x86_64
| #define MAGICK_TARGET_VENDOR apple
| #define MAGICK_TARGET_OS darwin10.8.0
| #define PACKAGE "ImageMagick"
| #define VERSION "6.8.0-10"
| #define STDC_HEADERS 1
| #define HAVE_SYS_TYPES_H 1
| #define HAVE_SYS_STAT_H 1
| #define HAVE_STDLIB_H 1
| #define HAVE_STRING_H 1
| #define HAVE_MEMORY_H 1
| #define HAVE_STRINGS_H 1
| #define HAVE_INTTYPES_H 1
| #define HAVE_STDINT_H 1
| #define HAVE_UNISTD_H 1
| #define __EXTENSIONS__ 1
| #define _ALL_SOURCE 1
| #define _GNU_SOURCE 1
| #define _POSIX_PTHREAD_SEMANTICS 1
| #define _TANDEM_SOURCE 1
| #define HAVE___ATTRIBUTE__ 1
| #define HAVE_PTHREAD_PRIO_INHERIT 1
| #define HAVE_PTHREAD 1
| #define THREAD_SUPPORT 1
| #define HAVE_PTHREAD_PRIO_INHERIT 1
| #define HAVE_PTHREAD 1
| #define HAVE_OPENCL_CL_H 1
| /* end confdefs.h. */
|
| # if defined(HAVE_WINDOWS_H) && defined(_WIN32)
| # include <windows.h>
| # endif
| # ifdef HAVE_CL_CL_H
| # include <CL/cl.h>
| # elif defined(HAVE_OPENCL_CL_H)
| # include <OpenCL/cl.h>
| # else
| # error no CL.h
| # endif
| int
| main ()
| {
| clCreateContextFromType(0,0,0,0,0)
| ;
| return 0;
| }
configure:9912: /usr/bin/gcc-4.2 -std=gnu99 -std=gnu99 -o conftest -Os -w -pipe -march=core2 -msse4 -mmacosx-version-min=10.6 -Wall -D_THREAD_SAFE -pthread -D_THREAD_SAFE -D_THREAD_SAFE -pthread -I/usr/X11/include -L/usr/local/lib -L/usr/X11/lib conftest.c -lclparser -lm >&5
ld: library not found for -lclparser
collect2: ld returned 1 exit status
configure:9912: $? = 1
configure: failed program was:
| /* confdefs.h */
| #define PACKAGE_NAME "ImageMagick"
| #define PACKAGE_TARNAME "ImageMagick"
| #define PACKAGE_VERSION "6.8.0-10"
| #define PACKAGE_STRING "ImageMagick 6.8.0-10"
| #define PACKAGE_BUGREPORT "http://www.imagemagick.org"
| #define PACKAGE_URL ""
| #define MAGICK_TARGET_CPU x86_64
| #define MAGICK_TARGET_VENDOR apple
| #define MAGICK_TARGET_OS darwin10.8.0
| #define PACKAGE "ImageMagick"
| #define VERSION "6.8.0-10"
| #define STDC_HEADERS 1
| #define HAVE_SYS_TYPES_H 1
| #define HAVE_SYS_STAT_H 1
| #define HAVE_STDLIB_H 1
| #define HAVE_STRING_H 1
| #define HAVE_MEMORY_H 1
| #define HAVE_STRINGS_H 1
| #define HAVE_INTTYPES_H 1
| #define HAVE_STDINT_H 1
| #define HAVE_UNISTD_H 1
| #define __EXTENSIONS__ 1
| #define _ALL_SOURCE 1
| #define _GNU_SOURCE 1
| #define _POSIX_PTHREAD_SEMANTICS 1
| #define _TANDEM_SOURCE 1
| #define HAVE___ATTRIBUTE__ 1
| #define HAVE_PTHREAD_PRIO_INHERIT 1
| #define HAVE_PTHREAD 1
| #define THREAD_SUPPORT 1
| #define HAVE_PTHREAD_PRIO_INHERIT 1
| #define HAVE_PTHREAD 1
| #define HAVE_OPENCL_CL_H 1
| /* end confdefs.h. */
|
| # if defined(HAVE_WINDOWS_H) && defined(_WIN32)
| # include <windows.h>
| # endif
| # ifdef HAVE_CL_CL_H
| # include <CL/cl.h>
| # elif defined(HAVE_OPENCL_CL_H)
| # include <OpenCL/cl.h>
| # else
| # error no CL.h
| # endif
| int
| main ()
| {
| clCreateContextFromType(0,0,0,0,0)
| ;
| return 0;
| }
configure:9937: /usr/bin/gcc-4.2 -std=gnu99 -std=gnu99 -o conftest -Os -w -pipe -march=core2 -msse4 -mmacosx-version-min=10.6 -Wall -D_THREAD_SAFE -pthread -D_THREAD_SAFE -D_THREAD_SAFE -pthread -I/usr/X11/include -L/usr/local/lib -L/usr/X11/lib conftest.c -lclparser -L/usr/lib64/nvidia -lm >&5
ld: library not found for -lclparser
collect2: ld returned 1 exit status
configure:9937: $? = 1
configure: failed program was:
| /* confdefs.h */
| #define PACKAGE_NAME "ImageMagick"
| #define PACKAGE_TARNAME "ImageMagick"
| #define PACKAGE_VERSION "6.8.0-10"
| #define PACKAGE_STRING "ImageMagick 6.8.0-10"
| #define PACKAGE_BUGREPORT "http://www.imagemagick.org"
| #define PACKAGE_URL ""
| #define MAGICK_TARGET_CPU x86_64
| #define MAGICK_TARGET_VENDOR apple
| #define MAGICK_TARGET_OS darwin10.8.0
| #define PACKAGE "ImageMagick"
| #define VERSION "6.8.0-10"
| #define STDC_HEADERS 1
| #define HAVE_SYS_TYPES_H 1
| #define HAVE_SYS_STAT_H 1
| #define HAVE_STDLIB_H 1
| #define HAVE_STRING_H 1
| #define HAVE_MEMORY_H 1
| #define HAVE_STRINGS_H 1
| #define HAVE_INTTYPES_H 1
| #define HAVE_STDINT_H 1
| #define HAVE_UNISTD_H 1
| #define __EXTENSIONS__ 1
| #define _ALL_SOURCE 1
| #define _GNU_SOURCE 1
| #define _POSIX_PTHREAD_SEMANTICS 1
| #define _TANDEM_SOURCE 1
| #define HAVE___ATTRIBUTE__ 1
| #define HAVE_PTHREAD_PRIO_INHERIT 1
| #define HAVE_PTHREAD 1
| #define THREAD_SUPPORT 1
| #define HAVE_PTHREAD_PRIO_INHERIT 1
| #define HAVE_PTHREAD 1
| #define HAVE_OPENCL_CL_H 1
| /* end confdefs.h. */
|
| # if defined(HAVE_WINDOWS_H) && defined(_WIN32)
| # include <windows.h>
| # endif
| # ifdef HAVE_CL_CL_H
| # include <CL/cl.h>
| # elif defined(HAVE_OPENCL_CL_H)
| # include <OpenCL/cl.h>
| # else
| # error no CL.h
| # endif
| int
| main ()
| {
| clCreateContextFromType(0,0,0,0,0)
| ;
| return 0;
| }
configure:9962: /usr/bin/gcc-4.2 -std=gnu99 -std=gnu99 -o conftest -Os -w -pipe -march=core2 -msse4 -mmacosx-version-min=10.6 -Wall -D_THREAD_SAFE -pthread -D_THREAD_SAFE -D_THREAD_SAFE -pthread -I/usr/X11/include -L/usr/local/lib -L/usr/X11/lib conftest.c -lclparser -Wl,-framework,OpenCL -L/System/Library/Frameworks/OpenCL.framework/Versions/A/Libraries -lm >&5
configure:9962: $? = 0
configure:10008: result: -lclparser -Wl,-framework,OpenCL -L/System/Library/Frameworks/OpenCL.framework/Versions/A/Libraries
configure:10050: checking for special C compiler options needed for large files
configure:10095: result: no
configure:10101: checking for _FILE_OFFSET_BITS value needed for large files
configure:10126: /usr/bin/gcc-4.2 -std=gnu99 -std=gnu99 -c -D_THREAD_SAFE -D_THREAD_SAFE -pthread -Os -w -pipe -march=core2 -msse4 -mmacosx-version-min=10.6 -Wall -D_THREAD_SAFE -pthread -I/usr/X11/include conftest.c >&5
configure:10126: $? = 0
configure:10158: result: no
configure:10243: checking for _LARGEFILE_SOURCE value needed for large files
configure:10262: /usr/bin/gcc-4.2 -std=gnu99 -std=gnu99 -o conftest -D_THREAD_SAFE -D_THREAD_SAFE -pthread -Os -w -pipe -march=core2 -msse4 -mmacosx-version-min=10.6 -Wall -D_THREAD_SAFE -pthread -I/usr/X11/include -L/usr/local/lib -L/usr/X11/lib conftest.c -lclparser -Wl,-framework,OpenCL -L/System/Library/Frameworks/OpenCL.framework/Versions/A/Libraries -lm >&5
configure:10262: $? = 0
configure:10290: result: no
configure:10414: checking for BSD- or MS-compatible name lister (nm)
configure:10463: result: /usr/bin/nm
configure:10593: checking the name lister (/usr/bin/nm) interface
configure:10600: /usr/bin/gcc-4.2 -std=gnu99 -std=gnu99 -c -D_THREAD_SAFE -D_THREAD_SAFE -pthread -Os -w -pipe -march=core2 -msse4 -mmacosx-version-min=10.6 -Wall -D_THREAD_SAFE -pthread -I/usr/X11/include conftest.c >&5
configure:10603: /usr/bin/nm "conftest.o"
configure:10606: output
0000000000000000 D _some_variable
configure:10613: result: BSD nm
configure:10617: checking the maximum length of command line arguments
configure:10747: result: 196608
configure:10764: checking whether the shell understands some XSI constructs
configure:10774: result: yes
configure:10778: checking whether the shell understands "+="
configure:10784: result: yes
configure:10819: checking how to convert x86_64-apple-darwin10.8.0 file names to x86_64-apple-darwin10.8.0 format
configure:10859: result: func_convert_file_noop
configure:10866: checking how to convert x86_64-apple-darwin10.8.0 file names to toolchain format
configure:10886: result: func_convert_file_noop
configure:10893: checking for /usr/libexec/gcc/i686-apple-darwin10/4.2.1/ld option to reload object files
configure:10900: result: -r
configure:10974: checking for objdump
configure:11004: result: no
configure:11030: checking how to recognize dependent libraries
configure:11232: result: pass_all
configure:11317: checking for dlltool
configure:11347: result: no
configure:11374: checking how to associate runtime and link libraries
configure:11401: result: printf %s\n
configure:11461: checking for ar
configure:11477: found /usr/bin/ar
configure:11488: result: ar
configure:11525: checking for archiver @FILE support
configure:11542: /usr/bin/gcc-4.2 -std=gnu99 -std=gnu99 -c -D_THREAD_SAFE -D_THREAD_SAFE -pthread -Os -w -pipe -march=core2 -msse4 -mmacosx-version-min=10.6 -Wall -D_THREAD_SAFE -pthread -I/usr/X11/include conftest.c >&5
configure:11542: $? = 0
configure:11545: ar cru libconftest.a @conftest.lst >&5
ar: @conftest.lst: No such file or directory
configure:11548: $? = 1
configure:11568: result: no
configure:11626: checking for strip
configure:11642: found /usr/bin/strip
configure:11653: result: strip
configure:11725: checking for ranlib
configure:11741: found /usr/bin/ranlib
configure:11752: result: ranlib
configure:11854: checking command to parse /usr/bin/nm output from /usr/bin/gcc-4.2 -std=gnu99 -std=gnu99 object
configure:11974: /usr/bin/gcc-4.2 -std=gnu99 -std=gnu99 -c -D_THREAD_SAFE -D_THREAD_SAFE -pthread -Os -w -pipe -march=core2 -msse4 -mmacosx-version-min=10.6 -Wall -D_THREAD_SAFE -pthread -I/usr/X11/include conftest.c >&5
configure:11977: $? = 0
configure:11981: /usr/bin/nm conftest.o \| sed -n -e 's/^.*[ ]\([BCDEGRST][BCDEGRST]*\)[ ][ ]*\([_A-Za-z][_A-Za-z0-9]*\)$/\1 \2 \2/p' | sed '/ __gnu_lto/d' \> conftest.nm
configure:11984: $? = 0
cannot find nm_test_var in conftest.nm
configure:11974: /usr/bin/gcc-4.2 -std=gnu99 -std=gnu99 -c -D_THREAD_SAFE -D_THREAD_SAFE -pthread -Os -w -pipe -march=core2 -msse4 -mmacosx-version-min=10.6 -Wall -D_THREAD_SAFE -pthread -I/usr/X11/include conftest.c >&5
configure:11977: $? = 0
configure:11981: /usr/bin/nm conftest.o \| sed -n -e 's/^.*[ ]\([BCDEGRST][BCDEGRST]*\)[ ][ ]*_\([_A-Za-z][_A-Za-z0-9]*\)$/\1 _\2 \2/p' | sed '/ __gnu_lto/d' \> conftest.nm
configure:11984: $? = 0
configure:12050: /usr/bin/gcc-4.2 -std=gnu99 -std=gnu99 -o conftest -D_THREAD_SAFE -D_THREAD_SAFE -pthread -Os -w -pipe -march=core2 -msse4 -mmacosx-version-min=10.6 -Wall -D_THREAD_SAFE -pthread -I/usr/X11/include -L/usr/local/lib -L/usr/X11/lib conftest.c conftstm.o >&5
configure:12053: $? = 0
configure:12091: result: ok
configure:12128: checking for sysroot
configure:12158: result: no
configure:12414: checking for mt
configure:12444: result: no
configure:12464: checking if : is a manifest tool
configure:12470: : '-?'
configure:12478: result: no
configure:12534: checking for dsymutil
configure:12550: found /usr/bin/dsymutil
configure:12561: result: dsymutil
configure:12626: checking for nmedit
configure:12642: found /usr/bin/nmedit
configure:12653: result: nmedit
configure:12718: checking for lipo
configure:12734: found /usr/bin/lipo
configure:12745: result: lipo
configure:12810: checking for otool
configure:12826: found /usr/bin/otool
configure:12837: result: otool
configure:12902: checking for otool64
configure:12932: result: no
configure:12977: checking for -single_module linker flag
/usr/bin/gcc-4.2 -std=gnu99 -std=gnu99 -D_THREAD_SAFE -D_THREAD_SAFE -pthread -Os -w -pipe -march=core2 -msse4 -mmacosx-version-min=10.6 -Wall -D_THREAD_SAFE -pthread -L/usr/local/lib -L/usr/X11/lib -o libconftest.dylib -dynamiclib -Wl,-single_module conftest.c
configure:13010: result: yes
configure:13013: checking for -exported_symbols_list linker flag
configure:13033: /usr/bin/gcc-4.2 -std=gnu99 -std=gnu99 -o conftest -D_THREAD_SAFE -D_THREAD_SAFE -pthread -Os -w -pipe -march=core2 -msse4 -mmacosx-version-min=10.6 -Wall -D_THREAD_SAFE -pthread -I/usr/X11/include -L/usr/local/lib -L/usr/X11/lib -Wl,-exported_symbols_list,conftest.sym conftest.c -lclparser -Wl,-framework,OpenCL -L/System/Library/Frameworks/OpenCL.framework/Versions/A/Libraries -lm >&5
configure:13033: $? = 0
configure:13043: result: yes
configure:13046: checking for -force_load linker flag
/usr/bin/gcc-4.2 -std=gnu99 -std=gnu99 -D_THREAD_SAFE -D_THREAD_SAFE -pthread -Os -w -pipe -march=core2 -msse4 -mmacosx-version-min=10.6 -Wall -D_THREAD_SAFE -pthread -c -o conftest.o conftest.c
ar cru libconftest.a conftest.o
ranlib libconftest.a
/usr/bin/gcc-4.2 -std=gnu99 -std=gnu99 -D_THREAD_SAFE -D_THREAD_SAFE -pthread -Os -w -pipe -march=core2 -msse4 -mmacosx-version-min=10.6 -Wall -D_THREAD_SAFE -pthread -L/usr/local/lib -L/usr/X11/lib -o conftest conftest.c -Wl,-force_load,./libconftest.a
configure:13078: result: yes
configure:13117: checking for dlfcn.h
configure:13117: /usr/bin/gcc-4.2 -std=gnu99 -std=gnu99 -c -D_THREAD_SAFE -D_THREAD_SAFE -pthread -Os -w -pipe -march=core2 -msse4 -mmacosx-version-min=10.6 -Wall -D_THREAD_SAFE -pthread -I/usr/X11/include conftest.c >&5
configure:13117: $? = 0
configure:13117: result: yes
configure:13630: checking for objdir
configure:13645: result: .libs
configure:13916: checking if /usr/bin/gcc-4.2 -std=gnu99 -std=gnu99 supports -fno-rtti -fno-exceptions
configure:13934: /usr/bin/gcc-4.2 -std=gnu99 -std=gnu99 -c -D_THREAD_SAFE -D_THREAD_SAFE -pthread -Os -w -pipe -march=core2 -msse4 -mmacosx-version-min=10.6 -Wall -D_THREAD_SAFE -pthread -I/usr/X11/include -fno-rtti -fno-exceptions conftest.c >&5
configure:13938: $? = 0
configure:13951: result: yes
configure:14278: checking for /usr/bin/gcc-4.2 -std=gnu99 -std=gnu99 option to produce PIC
configure:14285: result: -fno-common -DPIC
configure:14293: checking if /usr/bin/gcc-4.2 -std=gnu99 -std=gnu99 PIC flag -fno-common -DPIC works
configure:14311: /usr/bin/gcc-4.2 -std=gnu99 -std=gnu99 -c -D_THREAD_SAFE -D_THREAD_SAFE -pthread -Os -w -pipe -march=core2 -msse4 -mmacosx-version-min=10.6 -Wall -D_THREAD_SAFE -pthread -I/usr/X11/include -fno-common -DPIC -DPIC conftest.c >&5
configure:14315: $? = 0
configure:14328: result: yes
configure:14357: checking if /usr/bin/gcc-4.2 -std=gnu99 -std=gnu99 static flag -static works
configure:14385: result: no
configure:14400: checking if /usr/bin/gcc-4.2 -std=gnu99 -std=gnu99 supports -c -o file.o
configure:14421: /usr/bin/gcc-4.2 -std=gnu99 -std=gnu99 -c -D_THREAD_SAFE -D_THREAD_SAFE -pthread -Os -w -pipe -march=core2 -msse4 -mmacosx-version-min=10.6 -Wall -D_THREAD_SAFE -pthread -I/usr/X11/include -o out/conftest2.o conftest.c >&5
configure:14425: $? = 0
configure:14447: result: yes
configure:14455: checking if /usr/bin/gcc-4.2 -std=gnu99 -std=gnu99 supports -c -o file.o
configure:14502: result: yes
configure:14535: checking whether the /usr/bin/gcc-4.2 -std=gnu99 -std=gnu99 linker (/usr/libexec/gcc/i686-apple-darwin10/4.2.1/ld) supports shared libraries
configure:15688: result: yes
configure:15928: checking dynamic linker characteristics
configure:16665: result: darwin10.8.0 dyld
configure:16772: checking how to hardcode library paths into programs
configure:16797: result: immediate
configure:16842: checking for dlopen in -ldl
configure:16867: /usr/bin/gcc-4.2 -std=gnu99 -std=gnu99 -o conftest -D_THREAD_SAFE -D_THREAD_SAFE -pthread -Os -w -pipe -march=core2 -msse4 -mmacosx-version-min=10.6 -Wall -D_THREAD_SAFE -pthread -I/usr/X11/include -L/usr/local/lib -L/usr/X11/lib conftest.c -ldl -lclparser -Wl,-framework,OpenCL -L/System/Library/Frameworks/OpenCL.framework/Versions/A/Libraries -lm >&5
configure:16867: $? = 0
configure:16876: result: yes
configure:17091: checking whether a program can dlopen itself
configure:17171: /usr/bin/gcc-4.2 -std=gnu99 -std=gnu99 -o conftest -D_THREAD_SAFE -D_THREAD_SAFE -pthread -Os -w -pipe -march=core2 -msse4 -mmacosx-version-min=10.6 -Wall -D_THREAD_SAFE -pthread -I/usr/X11/include -DHAVE_DLFCN_H -L/usr/local/lib -L/usr/X11/lib conftest.c -ldl -lclparser -Wl,-framework,OpenCL -L/System/Library/Frameworks/OpenCL.framework/Versions/A/Libraries -lm >&5
configure:17174: $? = 0
configure:17192: result: yes
configure:17197: checking whether a statically linked program can dlopen itself
configure:17277: /usr/bin/gcc-4.2 -std=gnu99 -std=gnu99 -o conftest -D_THREAD_SAFE -D_THREAD_SAFE -pthread -Os -w -pipe -march=core2 -msse4 -mmacosx-version-min=10.6 -Wall -D_THREAD_SAFE -pthread -I/usr/X11/include -DHAVE_DLFCN_H -L/usr/local/lib -L/usr/X11/lib conftest.c -ldl -lclparser -Wl,-framework,OpenCL -L/System/Library/Frameworks/OpenCL.framework/Versions/A/Libraries -lm >&5
configure:17280: $? = 0
configure:17298: result: yes
configure:17337: checking whether stripping libraries is possible
configure:17351: result: yes
configure:17377: checking if libtool supports shared libraries
configure:17379: result: yes
configure:17382: checking whether to build shared libraries
configure:17403: result: yes
configure:17406: checking whether to build static libraries
configure:17410: result: no
configure:17433: checking how to run the C++ preprocessor
configure:17460: /usr/bin/g++-4.2 -E -I/usr/X11/include conftest.cpp
configure:17460: $? = 0
configure:17474: /usr/bin/g++-4.2 -E -I/usr/X11/include conftest.cpp
conftest.cpp:40:28: error: ac_nonexistent.h: No such file or directory
configure:17474: $? = 1
configure: failed program was:
| /* confdefs.h */
| #define PACKAGE_NAME "ImageMagick"
| #define PACKAGE_TARNAME "ImageMagick"
| #define PACKAGE_VERSION "6.8.0-10"
| #define PACKAGE_STRING "ImageMagick 6.8.0-10"
| #define PACKAGE_BUGREPORT "http://www.imagemagick.org"
| #define PACKAGE_URL ""
| #define MAGICK_TARGET_CPU x86_64
| #define MAGICK_TARGET_VENDOR apple
| #define MAGICK_TARGET_OS darwin10.8.0
| #define PACKAGE "ImageMagick"
| #define VERSION "6.8.0-10"
| #define STDC_HEADERS 1
| #define HAVE_SYS_TYPES_H 1
| #define HAVE_SYS_STAT_H 1
| #define HAVE_STDLIB_H 1
| #define HAVE_STRING_H 1
| #define HAVE_MEMORY_H 1
| #define HAVE_STRINGS_H 1
| #define HAVE_INTTYPES_H 1
| #define HAVE_STDINT_H 1
| #define HAVE_UNISTD_H 1
| #define __EXTENSIONS__ 1
| #define _ALL_SOURCE 1
| #define _GNU_SOURCE 1
| #define _POSIX_PTHREAD_SEMANTICS 1
| #define _TANDEM_SOURCE 1
| #define HAVE___ATTRIBUTE__ 1
| #define HAVE_PTHREAD_PRIO_INHERIT 1
| #define HAVE_PTHREAD 1
| #define THREAD_SUPPORT 1
| #define HAVE_PTHREAD_PRIO_INHERIT 1
| #define HAVE_PTHREAD 1
| #define HAVE_OPENCL_CL_H 1
| #define _OPENCL 1
| #define HAVE_FSEEKO 1
| #define HAVE_DLFCN_H 1
| #define LT_OBJDIR ".libs/"
| /* end confdefs.h. */
| #include <ac_nonexistent.h>
configure:17499: result: /usr/bin/g++-4.2 -E
configure:17519: /usr/bin/g++-4.2 -E -I/usr/X11/include conftest.cpp
configure:17519: $? = 0
configure:17533: /usr/bin/g++-4.2 -E -I/usr/X11/include conftest.cpp
conftest.cpp:40:28: error: ac_nonexistent.h: No such file or directory
configure:17533: $? = 1
configure: failed program was:
| /* confdefs.h */
| #define PACKAGE_NAME "ImageMagick"
| #define PACKAGE_TARNAME "ImageMagick"
| #define PACKAGE_VERSION "6.8.0-10"
| #define PACKAGE_STRING "ImageMagick 6.8.0-10"
| #define PACKAGE_BUGREPORT "http://www.imagemagick.org"
| #define PACKAGE_URL ""
| #define MAGICK_TARGET_CPU x86_64
| #define MAGICK_TARGET_VENDOR apple
| #define MAGICK_TARGET_OS darwin10.8.0
| #define PACKAGE "ImageMagick"
| #define VERSION "6.8.0-10"
| #define STDC_HEADERS 1
| #define HAVE_SYS_TYPES_H 1
| #define HAVE_SYS_STAT_H 1
| #define HAVE_STDLIB_H 1
| #define HAVE_STRING_H 1
| #define HAVE_MEMORY_H 1
| #define HAVE_STRINGS_H 1
| #define HAVE_INTTYPES_H 1
| #define HAVE_STDINT_H 1
| #define HAVE_UNISTD_H 1
| #define __EXTENSIONS__ 1
| #define _ALL_SOURCE 1
| #define _GNU_SOURCE 1
| #define _POSIX_PTHREAD_SEMANTICS 1
| #define _TANDEM_SOURCE 1
| #define HAVE___ATTRIBUTE__ 1
| #define HAVE_PTHREAD_PRIO_INHERIT 1
| #define HAVE_PTHREAD 1
| #define THREAD_SUPPORT 1
| #define HAVE_PTHREAD_PRIO_INHERIT 1
| #define HAVE_PTHREAD 1
| #define HAVE_OPENCL_CL_H 1
| #define _OPENCL 1
| #define HAVE_FSEEKO 1
| #define HAVE_DLFCN_H 1
| #define LT_OBJDIR ".libs/"
| /* end confdefs.h. */
| #include <ac_nonexistent.h>
configure:17702: checking for ld used by /usr/bin/g++-4.2
configure:17769: result: /usr/libexec/gcc/i686-apple-darwin10/4.2.1/ld
configure:17776: checking if the linker (/usr/libexec/gcc/i686-apple-darwin10/4.2.1/ld) is GNU ld
configure:17791: result: no
configure:17846: checking whether the /usr/bin/g++-4.2 linker (/usr/libexec/gcc/i686-apple-darwin10/4.2.1/ld) supports shared libraries
configure:18851: result: yes
configure:18887: /usr/bin/g++-4.2 -c -Os -w -pipe -march=core2 -msse4 -mmacosx-version-min=10.6 -D_THREAD_SAFE -pthread -I/usr/X11/include conftest.cpp >&5
configure:18890: $? = 0
configure:19410: checking for /usr/bin/g++-4.2 option to produce PIC
configure:19417: result: -fno-common -DPIC
configure:19425: checking if /usr/bin/g++-4.2 PIC flag -fno-common -DPIC works
configure:19443: /usr/bin/g++-4.2 -c -Os -w -pipe -march=core2 -msse4 -mmacosx-version-min=10.6 -D_THREAD_SAFE -pthread -I/usr/X11/include -fno-common -DPIC -DPIC conftest.cpp >&5
configure:19447: $? = 0
configure:19460: result: yes
configure:19483: checking if /usr/bin/g++-4.2 static flag -static works
configure:19511: result: no
configure:19523: checking if /usr/bin/g++-4.2 supports -c -o file.o
configure:19544: /usr/bin/g++-4.2 -c -Os -w -pipe -march=core2 -msse4 -mmacosx-version-min=10.6 -D_THREAD_SAFE -pthread -I/usr/X11/include -o out/conftest2.o conftest.cpp >&5
configure:19548: $? = 0
configure:19570: result: yes
configure:19575: checking if /usr/bin/g++-4.2 supports -c -o file.o
configure:19622: result: yes
configure:19652: checking whether the /usr/bin/g++-4.2 linker (/usr/libexec/gcc/i686-apple-darwin10/4.2.1/ld) supports shared libraries
configure:19688: result: yes
configure:19829: checking dynamic linker characteristics
configure:20500: result: darwin10.8.0 dyld
configure:20553: checking how to hardcode library paths into programs
configure:20578: result: immediate
configure:20811: checking whether to enable maintainer-specific portions of Makefiles
configure:20820: result: no
configure:21043: checking whether /usr/bin/gcc-4.2 -std=gnu99 -std=gnu99 needs -traditional
conftest.c:44:20: error: termio.h: No such file or directory
configure:21077: result: no
configure:21122: checking for ANSI C header files
configure:21226: result: yes
configure:21243: checking whether to enable assertions
configure:21261: result: yes
configure:21267: checking for dirent.h that defines DIR
configure:21286: /usr/bin/gcc-4.2 -std=gnu99 -std=gnu99 -c -D_THREAD_SAFE -D_THREAD_SAFE -pthread -Os -w -pipe -march=core2 -msse4 -mmacosx-version-min=10.6 -Wall -D_THREAD_SAFE -pthread -I/usr/X11/include conftest.c >&5
configure:21286: $? = 0
configure:21294: result: yes
configure:21307: checking for library containing opendir
configure:21338: /usr/bin/gcc-4.2 -std=gnu99 -std=gnu99 -o conftest -D_THREAD_SAFE -D_THREAD_SAFE -pthread -Os -w -pipe -march=core2 -msse4 -mmacosx-version-min=10.6 -Wall -D_THREAD_SAFE -pthread -I/usr/X11/include -L/usr/local/lib -L/usr/X11/lib conftest.c -lclparser -Wl,-framework,OpenCL -L/System/Library/Frameworks/OpenCL.framework/Versions/A/Libraries -lm >&5
configure:21338: $? = 0
configure:21355: result: none required
configure:21427: checking arm/limits.h usability
configure:21427: /usr/bin/gcc-4.2 -std=gnu99 -std=gnu99 -c -D_THREAD_SAFE -D_THREAD_SAFE -pthread -Os -w -pipe -march=core2 -msse4 -mmacosx-version-min=10.6 -Wall -D_THREAD_SAFE -pthread -I/usr/X11/include conftest.c >&5
conftest.c:79:24: error: arm/limits.h: No such file or directory
configure:21427: $? = 1
configure: failed program was:
| /* confdefs.h */
| #define PACKAGE_NAME "ImageMagick"
| #define PACKAGE_TARNAME "ImageMagick"
| #define PACKAGE_VERSION "6.8.0-10"
| #define PACKAGE_STRING "ImageMagick 6.8.0-10"
| #define PACKAGE_BUGREPORT "http://www.imagemagick.org"
| #define PACKAGE_URL ""
| #define MAGICK_TARGET_CPU x86_64
| #define MAGICK_TARGET_VENDOR apple
| #define MAGICK_TARGET_OS darwin10.8.0
| #define PACKAGE "ImageMagick"
| #define VERSION "6.8.0-10"
| #define STDC_HEADERS 1
| #define HAVE_SYS_TYPES_H 1
| #define HAVE_SYS_STAT_H 1
| #define HAVE_STDLIB_H 1
| #define HAVE_STRING_H 1
| #define HAVE_MEMORY_H 1
| #define HAVE_STRINGS_H 1
| #define HAVE_INTTYPES_H 1
| #define HAVE_STDINT_H 1
| #define HAVE_UNISTD_H 1
| #define __EXTENSIONS__ 1
| #define _ALL_SOURCE 1
| #define _GNU_SOURCE 1
| #define _POSIX_PTHREAD_SEMANTICS 1
| #define _TANDEM_SOURCE 1
| #define HAVE___ATTRIBUTE__ 1
| #define HAVE_PTHREAD_PRIO_INHERIT 1
| #define HAVE_PTHREAD 1
| #define THREAD_SUPPORT 1
| #define HAVE_PTHREAD_PRIO_INHERIT 1
| #define HAVE_PTHREAD 1
| #define HAVE_OPENCL_CL_H 1
| #define _OPENCL 1
| #define HAVE_FSEEKO 1
| #define HAVE_DLFCN_H 1
| #define LT_OBJDIR ".libs/"
| #define BUILD_MODULES 1
| #define INSTALLED_SUPPORT 1
| #define CIPHER_SUPPORT 1
| #define QUANTUM_DEPTH 16
| #define STDC_HEADERS 1
| #define HAVE_DIRENT_H 1
| /* end confdefs.h. */
| #include <stdio.h>
| #ifdef HAVE_SYS_TYPES_H
| # include <sys/types.h>
| #endif
| #ifdef HAVE_SYS_STAT_H
| # include <sys/stat.h>
| #endif
| #ifdef STDC_HEADERS
| # include <stdlib.h>
| # include <stddef.h>
| #else
| # ifdef HAVE_STDLIB_H
| # include <stdlib.h>
| # endif
| #endif
| #ifdef HAVE_STRING_H
| # if !defined STDC_HEADERS && defined HAVE_MEMORY_H
| # include <memory.h>
| # endif
| # include <string.h>
| #endif
| #ifdef HAVE_STRINGS_H
| # include <strings.h>
| #endif
| #ifdef HAVE_INTTYPES_H
| # include <inttypes.h>
| #endif
| #ifdef HAVE_STDINT_H
| # include <stdint.h>
| #endif
| #ifdef HAVE_UNISTD_H
| # include <unistd.h>
| #endif
| #include <arm/limits.h>
configure:21427: result: no
configure:21427: checking arm/limits.h presence
configure:21427: /usr/bin/gcc-4.2 -E -I/usr/X11/include conftest.c
conftest.c:46:24: error: arm/limits.h: No such file or directory
configure:21427: $? = 1
configure: failed program was:
| /* confdefs.h */
| #define PACKAGE_NAME "ImageMagick"
| #define PACKAGE_TARNAME "ImageMagick"
| #define PACKAGE_VERSION "6.8.0-10"
| #define PACKAGE_STRING "ImageMagick 6.8.0-10"
| #define PACKAGE_BUGREPORT "http://www.imagemagick.org"
| #define PACKAGE_URL ""
| #define MAGICK_TARGET_CPU x86_64
| #define MAGICK_TARGET_VENDOR apple
| #define MAGICK_TARGET_OS darwin10.8.0
| #define PACKAGE "ImageMagick"
| #define VERSION "6.8.0-10"
| #define STDC_HEADERS 1
| #define HAVE_SYS_TYPES_H 1
| #define HAVE_SYS_STAT_H 1
| #define HAVE_STDLIB_H 1
| #define HAVE_STRING_H 1
| #define HAVE_MEMORY_H 1
| #define HAVE_STRINGS_H 1
| #define HAVE_INTTYPES_H 1
| #define HAVE_STDINT_H 1
| #define HAVE_UNISTD_H 1
| #define __EXTENSIONS__ 1
| #define _ALL_SOURCE 1
| #define _GNU_SOURCE 1
| #define _POSIX_PTHREAD_SEMANTICS 1
| #define _TANDEM_SOURCE 1
| #define HAVE___ATTRIBUTE__ 1
| #define HAVE_PTHREAD_PRIO_INHERIT 1
| #define HAVE_PTHREAD 1
| #define THREAD_SUPPORT 1
| #define HAVE_PTHREAD_PRIO_INHERIT 1
| #define HAVE_PTHREAD 1
| #define HAVE_OPENCL_CL_H 1
| #define _OPENCL 1
| #define HAVE_FSEEKO 1
| #define HAVE_DLFCN_H 1
| #define LT_OBJDIR ".libs/"
| #define BUILD_MODULES 1
| #define INSTALLED_SUPPORT 1
| #define CIPHER_SUPPORT 1
| #define QUANTUM_DEPTH 16
| #define STDC_HEADERS 1
| #define HAVE_DIRENT_H 1
| /* end confdefs.h. */
| #include <arm/limits.h>
configure:21427: result: no
configure:21427: checking for arm/limits.h
configure:21427: result: no
configure:21427: checking complex.h usability
configure:21427: /usr/bin/gcc-4.2 -std=gnu99 -std=gnu99 -c -D_THREAD_SAFE -D_THREAD_SAFE -pthread -Os -w -pipe -march=core2 -msse4 -mmacosx-version-min=10.6 -Wall -D_THREAD_SAFE -pthread -I/usr/X11/include conftest.c >&5
configure:21427: $? = 0
configure:21427: result: yes
configure:21427: checking complex.h presence
configure:21427: /usr/bin/gcc-4.2 -E -I/usr/X11/include conftest.c
configure:21427: $? = 0
configure:21427: result: yes
configure:21427: checking for complex.h
configure:21427: result: yes
configure:21427: checking errno.h usability
configure:21427: /usr/bin/gcc-4.2 -std=gnu99 -std=gnu99 -c -D_THREAD_SAFE -D_THREAD_SAFE -pthread -Os -w -pipe -march=core2 -msse4 -mmacosx-version-min=10.6 -Wall -D_THREAD_SAFE -pthread -I/usr/X11/include conftest.c >&5
configure:21427: $? = 0
configure:21427: result: yes
configure:21427: checking errno.h presence
configure:21427: /usr/bin/gcc-4.2 -E -I/usr/X11/include conftest.c
configure:21427: $? = 0
configure:21427: result: yes
configure:21427: checking for errno.h
configure:21427: result: yes
configure:21427: checking fcntl.h usability
configure:21427: /usr/bin/gcc-4.2 -std=gnu99 -std=gnu99 -c -D_THREAD_SAFE -D_THREAD_SAFE -pthread -Os -w -pipe -march=core2 -msse4 -mmacosx-version-min=10.6 -Wall -D_THREAD_SAFE -pthread -I/usr/X11/include conftest.c >&5
configure:21427: $? = 0
configure:21427: result: yes
configure:21427: checking fcntl.h presence
configure:21427: /usr/bin/gcc-4.2 -E -I/usr/X11/include conftest.c
configure:21427: $? = 0
configure:21427: result: yes
configure:21427: checking for fcntl.h
configure:21427: result: yes
configure:21427: checking limits.h usability
configure:21427: /usr/bin/gcc-4.2 -std=gnu99 -std=gnu99 -c -D_THREAD_SAFE -D_THREAD_SAFE -pthread -Os -w -pipe -march=core2 -msse4 -mmacosx-version-min=10.6 -Wall -D_THREAD_SAFE -pthread -I/usr/X11/include conftest.c >&5
configure:21427: $? = 0
configure:21427: result: yes
configure:21427: checking limits.h presence
configure:21427: /usr/bin/gcc-4.2 -E -I/usr/X11/include conftest.c
configure:21427: $? = 0
configure:21427: result: yes
configure:21427: checking for limits.h
configure:21427: result: yes
configure:21427: checking linux/unistd.h usability
configure:21427: /usr/bin/gcc-4.2 -std=gnu99 -std=gnu99 -c -D_THREAD_SAFE -D_THREAD_SAFE -pthread -Os -w -pipe -march=core2 -msse4 -mmacosx-version-min=10.6 -Wall -D_THREAD_SAFE -pthread -I/usr/X11/include conftest.c >&5
conftest.c:83:26: error: linux/unistd.h: No such file or directory
configure:21427: $? = 1
configure: failed program was:
| /* confdefs.h */
| #define PACKAGE_NAME "ImageMagick"
| #define PACKAGE_TARNAME "ImageMagick"
| #define PACKAGE_VERSION "6.8.0-10"
| #define PACKAGE_STRING "ImageMagick 6.8.0-10"
| #define PACKAGE_BUGREPORT "http://www.imagemagick.org"
| #define PACKAGE_URL ""
| #define MAGICK_TARGET_CPU x86_64
| #define MAGICK_TARGET_VENDOR apple
| #define MAGICK_TARGET_OS darwin10.8.0
| #define PACKAGE "ImageMagick"
| #define VERSION "6.8.0-10"
| #define STDC_HEADERS 1
| #define HAVE_SYS_TYPES_H 1
| #define HAVE_SYS_STAT_H 1
| #define HAVE_STDLIB_H 1
| #define HAVE_STRING_H 1
| #define HAVE_MEMORY_H 1
| #define HAVE_STRINGS_H 1
| #define HAVE_INTTYPES_H 1
| #define HAVE_STDINT_H 1
| #define HAVE_UNISTD_H 1
| #define __EXTENSIONS__ 1
| #define _ALL_SOURCE 1
| #define _GNU_SOURCE 1
| #define _POSIX_PTHREAD_SEMANTICS 1
| #define _TANDEM_SOURCE 1
| #define HAVE___ATTRIBUTE__ 1
| #define HAVE_PTHREAD_PRIO_INHERIT 1
| #define HAVE_PTHREAD 1
| #define THREAD_SUPPORT 1
| #define HAVE_PTHREAD_PRIO_INHERIT 1
| #define HAVE_PTHREAD 1
| #define HAVE_OPENCL_CL_H 1
| #define _OPENCL 1
| #define HAVE_FSEEKO 1
| #define HAVE_DLFCN_H 1
| #define LT_OBJDIR ".libs/"
| #define BUILD_MODULES 1
| #define INSTALLED_SUPPORT 1
| #define CIPHER_SUPPORT 1
| #define QUANTUM_DEPTH 16
| #define STDC_HEADERS 1
| #define HAVE_DIRENT_H 1
| #define HAVE_COMPLEX_H 1
| #define HAVE_ERRNO_H 1
| #define HAVE_FCNTL_H 1
| #define HAVE_LIMITS_H 1
| /* end confdefs.h. */
| #include <stdio.h>
| #ifdef HAVE_SYS_TYPES_H
| # include <sys/types.h>
| #endif
| #ifdef HAVE_SYS_STAT_H
| # include <sys/stat.h>
| #endif
| #ifdef STDC_HEADERS
| # include <stdlib.h>
| # include <stddef.h>
| #else
| # ifdef HAVE_STDLIB_H
| # include <stdlib.h>
| # endif
| #endif
| #ifdef HAVE_STRING_H
| # if !defined STDC_HEADERS && defined HAVE_MEMORY_H
| # include <memory.h>
| # endif
| # include <string.h>
| #endif
| #ifdef HAVE_STRINGS_H
| # include <strings.h>
| #endif
| #ifdef HAVE_INTTYPES_H
| # include <inttypes.h>
| #endif
| #ifdef HAVE_STDINT_H
| # include <stdint.h>
| #endif
| #ifdef HAVE_UNISTD_H
| # include <unistd.h>
| #endif
| #include <linux/unistd.h>
configure:21427: result: no
configure:21427: checking linux/unistd.h presence
configure:21427: /usr/bin/gcc-4.2 -E -I/usr/X11/include conftest.c
conftest.c:50:26: error: linux/unistd.h: No such file or directory
configure:21427: $? = 1
configure: failed program was:
| /* confdefs.h */
| #define PACKAGE_NAME "ImageMagick"
| #define PACKAGE_TARNAME "ImageMagick"
| #define PACKAGE_VERSION "6.8.0-10"
| #define PACKAGE_STRING "ImageMagick 6.8.0-10"
| #define PACKAGE_BUGREPORT "http://www.imagemagick.org"
| #define PACKAGE_URL ""
| #define MAGICK_TARGET_CPU x86_64
| #define MAGICK_TARGET_VENDOR apple
| #define MAGICK_TARGET_OS darwin10.8.0
| #define PACKAGE "ImageMagick"
| #define VERSION "6.8.0-10"
| #define STDC_HEADERS 1
| #define HAVE_SYS_TYPES_H 1
| #define HAVE_SYS_STAT_H 1
| #define HAVE_STDLIB_H 1
| #define HAVE_STRING_H 1
| #define HAVE_MEMORY_H 1
| #define HAVE_STRINGS_H 1
| #define HAVE_INTTYPES_H 1
| #define HAVE_STDINT_H 1
| #define HAVE_UNISTD_H 1
| #define __EXTENSIONS__ 1
| #define _ALL_SOURCE 1
| #define _GNU_SOURCE 1
| #define _POSIX_PTHREAD_SEMANTICS 1
| #define _TANDEM_SOURCE 1
| #define HAVE___ATTRIBUTE__ 1
| #define HAVE_PTHREAD_PRIO_INHERIT 1
| #define HAVE_PTHREAD 1
| #define THREAD_SUPPORT 1
| #define HAVE_PTHREAD_PRIO_INHERIT 1
| #define HAVE_PTHREAD 1
| #define HAVE_OPENCL_CL_H 1
| #define _OPENCL 1
| #define HAVE_FSEEKO 1
| #define HAVE_DLFCN_H 1
| #define LT_OBJDIR ".libs/"
| #define BUILD_MODULES 1
| #define INSTALLED_SUPPORT 1
| #define CIPHER_SUPPORT 1
| #define QUANTUM_DEPTH 16
| #define STDC_HEADERS 1
| #define HAVE_DIRENT_H 1
| #define HAVE_COMPLEX_H 1
| #define HAVE_ERRNO_H 1
| #define HAVE_FCNTL_H 1
| #define HAVE_LIMITS_H 1
| /* end confdefs.h. */
| #include <linux/unistd.h>
configure:21427: result: no
configure:21427: checking for linux/unistd.h
configure:21427: result: no
configure:21427: checking locale.h usability
configure:21427: /usr/bin/gcc-4.2 -std=gnu99 -std=gnu99 -c -D_THREAD_SAFE -D_THREAD_SAFE -pthread -Os -w -pipe -march=core2 -msse4 -mmacosx-version-min=10.6 -Wall -D_THREAD_SAFE -pthread -I/usr/X11/include conftest.c >&5
configure:21427: $? = 0
configure:21427: result: yes
configure:21427: checking locale.h presence
configure:21427: /usr/bin/gcc-4.2 -E -I/usr/X11/include conftest.c
configure:21427: $? = 0
configure:21427: result: yes
configure:21427: checking for locale.h
configure:21427: result: yes
configure:21427: checking machine/param.h usability
configure:21427: /usr/bin/gcc-4.2 -std=gnu99 -std=gnu99 -c -D_THREAD_SAFE -D_THREAD_SAFE -pthread -Os -w -pipe -march=core2 -msse4 -mmacosx-version-min=10.6 -Wall -D_THREAD_SAFE -pthread -I/usr/X11/include conftest.c >&5
configure:21427: $? = 0
configure:21427: result: yes
configure:21427: checking machine/param.h presence
configure:21427: /usr/bin/gcc-4.2 -E -I/usr/X11/include conftest.c
configure:21427: $? = 0
configure:21427: result: yes
configure:21427: checking for machine/param.h
configure:21427: result: yes
configure:21427: checking mach-o/dyld.h usability
configure:21427: /usr/bin/gcc-4.2 -std=gnu99 -std=gnu99 -c -D_THREAD_SAFE -D_THREAD_SAFE -pthread -Os -w -pipe -march=core2 -msse4 -mmacosx-version-min=10.6 -Wall -D_THREAD_SAFE -pthread -I/usr/X11/include conftest.c >&5
configure:21427: $? = 0
configure:21427: result: yes
configure:21427: checking mach-o/dyld.h presence
configure:21427: /usr/bin/gcc-4.2 -E -I/usr/X11/include conftest.c
configure:21427: $? = 0
configure:21427: result: yes
configure:21427: checking for mach-o/dyld.h
configure:21427: result: yes
configure:21427: checking OS.h usability
configure:21427: /usr/bin/gcc-4.2 -std=gnu99 -std=gnu99 -c -D_THREAD_SAFE -D_THREAD_SAFE -pthread -Os -w -pipe -march=core2 -msse4 -mmacosx-version-min=10.6 -Wall -D_THREAD_SAFE -pthread -I/usr/X11/include conftest.c >&5
conftest.c:86:16: error: OS.h: No such file or directory
configure:21427: $? = 1
configure: failed program was:
| /* confdefs.h */
| #define PACKAGE_NAME "ImageMagick"
| #define PACKAGE_TARNAME "ImageMagick"
| #define PACKAGE_VERSION "6.8.0-10"
| #define PACKAGE_STRING "ImageMagick 6.8.0-10"
| #define PACKAGE_BUGREPORT "http://www.imagemagick.org"
| #define PACKAGE_URL ""
| #define MAGICK_TARGET_CPU x86_64
| #define MAGICK_TARGET_VENDOR apple
| #define MAGICK_TARGET_OS darwin10.8.0
| #define PACKAGE "ImageMagick"
| #define VERSION "6.8.0-10"
| #define STDC_HEADERS 1
| #define HAVE_SYS_TYPES_H 1
| #define HAVE_SYS_STAT_H 1
| #define HAVE_STDLIB_H 1
| #define HAVE_STRING_H 1
| #define HAVE_MEMORY_H 1
| #define HAVE_STRINGS_H 1
| #define HAVE_INTTYPES_H 1
| #define HAVE_STDINT_H 1
| #define HAVE_UNISTD_H 1
| #define __EXTENSIONS__ 1
| #define _ALL_SOURCE 1
| #define _GNU_SOURCE 1
| #define _POSIX_PTHREAD_SEMANTICS 1
| #define _TANDEM_SOURCE 1
| #define HAVE___ATTRIBUTE__ 1
| #define HAVE_PTHREAD_PRIO_INHERIT 1
| #define HAVE_PTHREAD 1
| #define THREAD_SUPPORT 1
| #define HAVE_PTHREAD_PRIO_INHERIT 1
| #define HAVE_PTHREAD 1
| #define HAVE_OPENCL_CL_H 1
| #define _OPENCL 1
| #define HAVE_FSEEKO 1
| #define HAVE_DLFCN_H 1
| #define LT_OBJDIR ".libs/"
| #define BUILD_MODULES 1
| #define INSTALLED_SUPPORT 1
| #define CIPHER_SUPPORT 1
| #define QUANTUM_DEPTH 16
| #define STDC_HEADERS 1
| #define HAVE_DIRENT_H 1
| #define HAVE_COMPLEX_H 1
| #define HAVE_ERRNO_H 1
| #define HAVE_FCNTL_H 1
| #define HAVE_LIMITS_H 1
| #define HAVE_LOCALE_H 1
| #define HAVE_MACHINE_PARAM_H 1
| #define HAVE_MACH_O_DYLD_H 1
| /* end confdefs.h. */
| #include <stdio.h>
| #ifdef HAVE_SYS_TYPES_H
| # include <sys/types.h>
| #endif
| #ifdef HAVE_SYS_STAT_H
| # include <sys/stat.h>
| #endif
| #ifdef STDC_HEADERS
| # include <stdlib.h>
| # include <stddef.h>
| #else
| # ifdef HAVE_STDLIB_H
| # include <stdlib.h>
| # endif
| #endif
| #ifdef HAVE_STRING_H
| # if !defined STDC_HEADERS && defined HAVE_MEMORY_H
| # include <memory.h>
| # endif
| # include <string.h>
| #endif
| #ifdef HAVE_STRINGS_H
| # include <strings.h>
| #endif
| #ifdef HAVE_INTTYPES_H
| # include <inttypes.h>
| #endif
| #ifdef HAVE_STDINT_H
| # include <stdint.h>
| #endif
| #ifdef HAVE_UNISTD_H
| # include <unistd.h>
| #endif
| #include <OS.h>
configure:21427: result: no
configure:21427: checking OS.h presence
configure:21427: /usr/bin/gcc-4.2 -E -I/usr/X11/include conftest.c
conftest.c:53:16: error: OS.h: No such file or directory
configure:21427: $? = 1
configure: failed program was:
| /* confdefs.h */
| #define PACKAGE_NAME "ImageMagick"
| #define PACKAGE_TARNAME "ImageMagick"
| #define PACKAGE_VERSION "6.8.0-10"
| #define PACKAGE_STRING "ImageMagick 6.8.0-10"
| #define PACKAGE_BUGREPORT "http://www.imagemagick.org"
| #define PACKAGE_URL ""
| #define MAGICK_TARGET_CPU x86_64
| #define MAGICK_TARGET_VENDOR apple
| #define MAGICK_TARGET_OS darwin10.8.0
| #define PACKAGE "ImageMagick"
| #define VERSION "6.8.0-10"
| #define STDC_HEADERS 1
| #define HAVE_SYS_TYPES_H 1
| #define HAVE_SYS_STAT_H 1
| #define HAVE_STDLIB_H 1
| #define HAVE_STRING_H 1
| #define HAVE_MEMORY_H 1
| #define HAVE_STRINGS_H 1
| #define HAVE_INTTYPES_H 1
| #define HAVE_STDINT_H 1
| #define HAVE_UNISTD_H 1
| #define __EXTENSIONS__ 1
| #define _ALL_SOURCE 1
| #define _GNU_SOURCE 1
| #define _POSIX_PTHREAD_SEMANTICS 1
| #define _TANDEM_SOURCE 1
| #define HAVE___ATTRIBUTE__ 1
| #define HAVE_PTHREAD_PRIO_INHERIT 1
| #define HAVE_PTHREAD 1
| #define THREAD_SUPPORT 1
| #define HAVE_PTHREAD_PRIO_INHERIT 1
| #define HAVE_PTHREAD 1
| #define HAVE_OPENCL_CL_H 1
| #define _OPENCL 1
| #define HAVE_FSEEKO 1
| #define HAVE_DLFCN_H 1
| #define LT_OBJDIR ".libs/"
| #define BUILD_MODULES 1
| #define INSTALLED_SUPPORT 1
| #define CIPHER_SUPPORT 1
| #define QUANTUM_DEPTH 16
| #define STDC_HEADERS 1
| #define HAVE_DIRENT_H 1
| #define HAVE_COMPLEX_H 1
| #define HAVE_ERRNO_H 1
| #define HAVE_FCNTL_H 1
| #define HAVE_LIMITS_H 1
| #define HAVE_LOCALE_H 1
| #define HAVE_MACHINE_PARAM_H 1
| #define HAVE_MACH_O_DYLD_H 1
| /* end confdefs.h. */
| #include <OS.h>
configure:21427: result: no
configure:21427: checking for OS.h
configure:21427: result: no
configure:21427: checking process.h usability
configure:21427: /usr/bin/gcc-4.2 -std=gnu99 -std=gnu99 -c -D_THREAD_SAFE -D_THREAD_SAFE -pthread -Os -w -pipe -march=core2 -msse4 -mmacosx-version-min=10.6 -Wall -D_THREAD_SAFE -pthread -I/usr/X11/include conftest.c >&5
conftest.c:86:21: error: process.h: No such file or directory
configure:21427: $? = 1
configure: failed program was:
| /* confdefs.h */
| #define PACKAGE_NAME "ImageMagick"
| #define PACKAGE_TARNAME "ImageMagick"
| #define PACKAGE_VERSION "6.8.0-10"
| #define PACKAGE_STRING "ImageMagick 6.8.0-10"
| #define PACKAGE_BUGREPORT "http://www.imagemagick.org"
| #define PACKAGE_URL ""
| #define MAGICK_TARGET_CPU x86_64
| #define MAGICK_TARGET_VENDOR apple
| #define MAGICK_TARGET_OS darwin10.8.0
| #define PACKAGE "ImageMagick"
| #define VERSION "6.8.0-10"
| #define STDC_HEADERS 1
| #define HAVE_SYS_TYPES_H 1
| #define HAVE_SYS_STAT_H 1
| #define HAVE_STDLIB_H 1
| #define HAVE_STRING_H 1
| #define HAVE_MEMORY_H 1
| #define HAVE_STRINGS_H 1
| #define HAVE_INTTYPES_H 1
| #define HAVE_STDINT_H 1
| #define HAVE_UNISTD_H 1
| #define __EXTENSIONS__ 1
| #define _ALL_SOURCE 1
| #define _GNU_SOURCE 1
| #define _POSIX_PTHREAD_SEMANTICS 1
| #define _TANDEM_SOURCE 1
| #define HAVE___ATTRIBUTE__ 1
| #define HAVE_PTHREAD_PRIO_INHERIT 1
| #define HAVE_PTHREAD 1
| #define THREAD_SUPPORT 1
| #define HAVE_PTHREAD_PRIO_INHERIT 1
| #define HAVE_PTHREAD 1
| #define HAVE_OPENCL_CL_H 1
| #define _OPENCL 1
| #define HAVE_FSEEKO 1
| #define HAVE_DLFCN_H 1
| #define LT_OBJDIR ".libs/"
| #define BUILD_MODULES 1
| #define INSTALLED_SUPPORT 1
| #define CIPHER_SUPPORT 1
| #define QUANTUM_DEPTH 16
| #define STDC_HEADERS 1
| #define HAVE_DIRENT_H 1
| #define HAVE_COMPLEX_H 1
| #define HAVE_ERRNO_H 1
| #define HAVE_FCNTL_H 1
| #define HAVE_LIMITS_H 1
| #define HAVE_LOCALE_H 1
| #define HAVE_MACHINE_PARAM_H 1
| #define HAVE_MACH_O_DYLD_H 1
| /* end confdefs.h. */
| #include <stdio.h>
| #ifdef HAVE_SYS_TYPES_H
| # include <sys/types.h>
| #endif
| #ifdef HAVE_SYS_STAT_H
| # include <sys/stat.h>
| #endif
| #ifdef STDC_HEADERS
| # include <stdlib.h>
| # include <stddef.h>
| #else
| # ifdef HAVE_STDLIB_H
| # include <stdlib.h>
| # endif
| #endif
| #ifdef HAVE_STRING_H
| # if !defined STDC_HEADERS && defined HAVE_MEMORY_H
| # include <memory.h>
| # endif
| # include <string.h>
| #endif
| #ifdef HAVE_STRINGS_H
| # include <strings.h>
| #endif
| #ifdef HAVE_INTTYPES_H
| # include <inttypes.h>
| #endif
| #ifdef HAVE_STDINT_H
| # include <stdint.h>
| #endif
| #ifdef HAVE_UNISTD_H
| # include <unistd.h>
| #endif
| #include <process.h>
configure:21427: result: no
configure:21427: checking process.h presence
configure:21427: /usr/bin/gcc-4.2 -E -I/usr/X11/include conftest.c
conftest.c:53:21: error: process.h: No such file or directory
configure:21427: $? = 1
configure: failed program was:
| /* confdefs.h */
| #define PACKAGE_NAME "ImageMagick"
| #define PACKAGE_TARNAME "ImageMagick"
| #define PACKAGE_VERSION "6.8.0-10"
| #define PACKAGE_STRING "ImageMagick 6.8.0-10"
| #define PACKAGE_BUGREPORT "http://www.imagemagick.org"
| #define PACKAGE_URL ""
| #define MAGICK_TARGET_CPU x86_64
| #define MAGICK_TARGET_VENDOR apple
| #define MAGICK_TARGET_OS darwin10.8.0
| #define PACKAGE "ImageMagick"
| #define VERSION "6.8.0-10"
| #define STDC_HEADERS 1
| #define HAVE_SYS_TYPES_H 1
| #define HAVE_SYS_STAT_H 1
| #define HAVE_STDLIB_H 1
| #define HAVE_STRING_H 1
| #define HAVE_MEMORY_H 1
| #define HAVE_STRINGS_H 1
| #define HAVE_INTTYPES_H 1
| #define HAVE_STDINT_H 1
| #define HAVE_UNISTD_H 1
| #define __EXTENSIONS__ 1
| #define _ALL_SOURCE 1
| #define _GNU_SOURCE 1
| #define _POSIX_PTHREAD_SEMANTICS 1
| #define _TANDEM_SOURCE 1
| #define HAVE___ATTRIBUTE__ 1
| #define HAVE_PTHREAD_PRIO_INHERIT 1
| #define HAVE_PTHREAD 1
| #define THREAD_SUPPORT 1
| #define HAVE_PTHREAD_PRIO_INHERIT 1
| #define HAVE_PTHREAD 1
| #define HAVE_OPENCL_CL_H 1
| #define _OPENCL 1
| #define HAVE_FSEEKO 1
| #define HAVE_DLFCN_H 1
| #define LT_OBJDIR ".libs/"
| #define BUILD_MODULES 1
| #define INSTALLED_SUPPORT 1
| #define CIPHER_SUPPORT 1
| #define QUANTUM_DEPTH 16
| #define STDC_HEADERS 1
| #define HAVE_DIRENT_H 1
| #define HAVE_COMPLEX_H 1
| #define HAVE_ERRNO_H 1
| #define HAVE_FCNTL_H 1
| #define HAVE_LIMITS_H 1
| #define HAVE_LOCALE_H 1
| #define HAVE_MACHINE_PARAM_H 1
| #define HAVE_MACH_O_DYLD_H 1
| /* end confdefs.h. */
| #include <process.h>
configure:21427: result: no
configure:21427: checking for process.h
configure:21427: result: no
configure:21427: checking sun_prefetch.h usability
configure:21427: /usr/bin/gcc-4.2 -std=gnu99 -std=gnu99 -c -D_THREAD_SAFE -D_THREAD_SAFE -pthread -Os -w -pipe -march=core2 -msse4 -mmacosx-version-min=10.6 -Wall -D_THREAD_SAFE -pthread -I/usr/X11/include conftest.c >&5
conftest.c:86:26: error: sun_prefetch.h: No such file or directory
configure:21427: $? = 1
configure: failed program was:
| /* confdefs.h */
| #define PACKAGE_NAME "ImageMagick"
| #define PACKAGE_TARNAME "ImageMagick"
| #define PACKAGE_VERSION "6.8.0-10"
| #define PACKAGE_STRING "ImageMagick 6.8.0-10"
| #define PACKAGE_BUGREPORT "http://www.imagemagick.org"
| #define PACKAGE_URL ""
| #define MAGICK_TARGET_CPU x86_64
| #define MAGICK_TARGET_VENDOR apple
| #define MAGICK_TARGET_OS darwin10.8.0
| #define PACKAGE "ImageMagick"
| #define VERSION "6.8.0-10"
| #define STDC_HEADERS 1
| #define HAVE_SYS_TYPES_H 1
| #define HAVE_SYS_STAT_H 1
| #define HAVE_STDLIB_H 1
| #define HAVE_STRING_H 1
| #define HAVE_MEMORY_H 1
| #define HAVE_STRINGS_H 1
| #define HAVE_INTTYPES_H 1
| #define HAVE_STDINT_H 1
| #define HAVE_UNISTD_H 1
| #define __EXTENSIONS__ 1
| #define _ALL_SOURCE 1
| #define _GNU_SOURCE 1
| #define _POSIX_PTHREAD_SEMANTICS 1
| #define _TANDEM_SOURCE 1
| #define HAVE___ATTRIBUTE__ 1
| #define HAVE_PTHREAD_PRIO_INHERIT 1
| #define HAVE_PTHREAD 1
| #define THREAD_SUPPORT 1
| #define HAVE_PTHREAD_PRIO_INHERIT 1
| #define HAVE_PTHREAD 1
| #define HAVE_OPENCL_CL_H 1
| #define _OPENCL 1
| #define HAVE_FSEEKO 1
| #define HAVE_DLFCN_H 1
| #define LT_OBJDIR ".libs/"
| #define BUILD_MODULES 1
| #define INSTALLED_SUPPORT 1
| #define CIPHER_SUPPORT 1
| #define QUANTUM_DEPTH 16
| #define STDC_HEADERS 1
| #define HAVE_DIRENT_H 1
| #define HAVE_COMPLEX_H 1
| #define HAVE_ERRNO_H 1
| #define HAVE_FCNTL_H 1
| #define HAVE_LIMITS_H 1
| #define HAVE_LOCALE_H 1
| #define HAVE_MACHINE_PARAM_H 1
| #define HAVE_MACH_O_DYLD_H 1
| /* end confdefs.h. */
| #include <stdio.h>
| #ifdef HAVE_SYS_TYPES_H
| # include <sys/types.h>
| #endif
| #ifdef HAVE_SYS_STAT_H
| # include <sys/stat.h>
| #endif
| #ifdef STDC_HEADERS
| # include <stdlib.h>
| # include <stddef.h>
| #else
| # ifdef HAVE_STDLIB_H
| # include <stdlib.h>
| # endif
| #endif
| #ifdef HAVE_STRING_H
| # if !defined STDC_HEADERS && defined HAVE_MEMORY_H
| # include <memory.h>
| # endif
| # include <string.h>
| #endif
| #ifdef HAVE_STRINGS_H
| # include <strings.h>
| #endif
| #ifdef HAVE_INTTYPES_H
| # include <inttypes.h>
| #endif
| #ifdef HAVE_STDINT_H
| # include <stdint.h>
| #endif
| #ifdef HAVE_UNISTD_H
| # include <unistd.h>
| #endif
| #include <sun_prefetch.h>
configure:21427: result: no
configure:21427: checking sun_prefetch.h presence
configure:21427: /usr/bin/gcc-4.2 -E -I/usr/X11/include conftest.c
conftest.c:53:26: error: sun_prefetch.h: No such file or directory
configure:21427: $? = 1
configure: failed program was:
| /* confdefs.h */
| #define PACKAGE_NAME "ImageMagick"
| #define PACKAGE_TARNAME "ImageMagick"
| #define PACKAGE_VERSION "6.8.0-10"
| #define PACKAGE_STRING "ImageMagick 6.8.0-10"
| #define PACKAGE_BUGREPORT "http://www.imagemagick.org"
| #define PACKAGE_URL ""
| #define MAGICK_TARGET_CPU x86_64
| #define MAGICK_TARGET_VENDOR apple
| #define MAGICK_TARGET_OS darwin10.8.0
| #define PACKAGE "ImageMagick"
| #define VERSION "6.8.0-10"
| #define STDC_HEADERS 1
| #define HAVE_SYS_TYPES_H 1
| #define HAVE_SYS_STAT_H 1
| #define HAVE_STDLIB_H 1
| #define HAVE_STRING_H 1
| #define HAVE_MEMORY_H 1
| #define HAVE_STRINGS_H 1
| #define HAVE_INTTYPES_H 1
| #define HAVE_STDINT_H 1
| #define HAVE_UNISTD_H 1
| #define __EXTENSIONS__ 1
| #define _ALL_SOURCE 1
| #define _GNU_SOURCE 1
| #define _POSIX_PTHREAD_SEMANTICS 1
| #define _TANDEM_SOURCE 1
| #define HAVE___ATTRIBUTE__ 1
| #define HAVE_PTHREAD_PRIO_INHERIT 1
| #define HAVE_PTHREAD 1
| #define THREAD_SUPPORT 1
| #define HAVE_PTHREAD_PRIO_INHERIT 1
| #define HAVE_PTHREAD 1
| #define HAVE_OPENCL_CL_H 1
| #define _OPENCL 1
| #define HAVE_FSEEKO 1
| #define HAVE_DLFCN_H 1
| #define LT_OBJDIR ".libs/"
| #define BUILD_MODULES 1
| #define INSTALLED_SUPPORT 1
| #define CIPHER_SUPPORT 1
| #define QUANTUM_DEPTH 16
| #define STDC_HEADERS 1
| #define HAVE_DIRENT_H 1
| #define HAVE_COMPLEX_H 1
| #define HAVE_ERRNO_H 1
| #define HAVE_FCNTL_H 1
| #define HAVE_LIMITS_H 1
| #define HAVE_LOCALE_H 1
| #define HAVE_MACHINE_PARAM_H 1
| #define HAVE_MACH_O_DYLD_H 1
| /* end confdefs.h. */
| #include <sun_prefetch.h>
configure:21427: result: no
configure:21427: checking for sun_prefetch.h
configure:21427: result: no
configure:21427: checking stdarg.h usability
configure:21427: /usr/bin/gcc-4.2 -std=gnu99 -std=gnu99 -c -D_THREAD_SAFE -D_THREAD_SAFE -pthread -Os -w -pipe -march=core2 -msse4 -mmacosx-version-min=10.6 -Wall -D_THREAD_SAFE -pthread -I/usr/X11/include conftest.c >&5
configure:21427: $? = 0
configure:21427: result: yes
configure:21427: checking stdarg.h presence
configure:21427: /usr/bin/gcc-4.2 -E -I/usr/X11/include conftest.c
configure:21427: $? = 0
configure:21427: result: yes
configure:21427: checking for stdarg.h
configure:21427: result: yes
configure:21427: checking sys/ipc.h usability
configure:21427: /usr/bin/gcc-4.2 -std=gnu99 -std=gnu99 -c -D_THREAD_SAFE -D_THREAD_SAFE -pthread -Os -w -pipe -march=core2 -msse4 -mmacosx-version-min=10.6 -Wall -D_THREAD_SAFE -pthread -I/usr/X11/include conftest.c >&5
configure:21427: $? = 0
configure:21427: result: yes
configure:21427: checking sys/ipc.h presence
configure:21427: /usr/bin/gcc-4.2 -E -I/usr/X11/include conftest.c
configure:21427: $? = 0
configure:21427: result: yes
configure:21427: checking for sys/ipc.h
configure:21427: result: yes
configure:21427: checking sys/mman.h usability
configure:21427: /usr/bin/gcc-4.2 -std=gnu99 -std=gnu99 -c -D_THREAD_SAFE -D_THREAD_SAFE -pthread -Os -w -pipe -march=core2 -msse4 -mmacosx-version-min=10.6 -Wall -D_THREAD_SAFE -pthread -I/usr/X11/include conftest.c >&5
configure:21427: $? = 0
configure:21427: result: yes
configure:21427: checking sys/mman.h presence
configure:21427: /usr/bin/gcc-4.2 -E -I/usr/X11/include conftest.c
configure:21427: $? = 0
configure:21427: result: yes
configure:21427: checking for sys/mman.h
configure:21427: result: yes
configure:21427: checking sys/resource.h usability
configure:21427: /usr/bin/gcc-4.2 -std=gnu99 -std=gnu99 -c -D_THREAD_SAFE -D_THREAD_SAFE -pthread -Os -w -pipe -march=core2 -msse4 -mmacosx-version-min=10.6 -Wall -D_THREAD_SAFE -pthread -I/usr/X11/include conftest.c >&5
configure:21427: $? = 0
configure:21427: result: yes
configure:21427: checking sys/resource.h presence
configure:21427: /usr/bin/gcc-4.2 -E -I/usr/X11/include conftest.c
configure:21427: $? = 0
configure:21427: result: yes
configure:21427: checking for sys/resource.h
configure:21427: result: yes
configure:21427: checking sys/syslimits.h usability
configure:21427: /usr/bin/gcc-4.2 -std=gnu99 -std=gnu99 -c -D_THREAD_SAFE -D_THREAD_SAFE -pthread -Os -w -pipe -march=core2 -msse4 -mmacosx-version-min=10.6 -Wall -D_THREAD_SAFE -pthread -I/usr/X11/include conftest.c >&5
configure:21427: $? = 0
configure:21427: result: yes
configure:21427: checking sys/syslimits.h presence
configure:21427: /usr/bin/gcc-4.2 -E -I/usr/X11/include conftest.c
configure:21427: $? = 0
configure:21427: result: yes
configure:21427: checking for sys/syslimits.h
configure:21427: result: yes
configure:21427: checking sys/time.h usability
configure:21427: /usr/bin/gcc-4.2 -std=gnu99 -std=gnu99 -c -D_THREAD_SAFE -D_THREAD_SAFE -pthread -Os -w -pipe -march=core2 -msse4 -mmacosx-version-min=10.6 -Wall -D_THREAD_SAFE -pthread -I/usr/X11/include conftest.c >&5
configure:21427: $? = 0
configure:21427: result: yes
configure:21427: checking sys/time.h presence
configure:21427: /usr/bin/gcc-4.2 -E -I/usr/X11/include conftest.c
configure:21427: $? = 0
configure:21427: result: yes
configure:21427: checking for sys/time.h
configure:21427: result: yes
configure:21427: checking sys/timeb.h usability
configure:21427: /usr/bin/gcc-4.2 -std=gnu99 -std=gnu99 -c -D_THREAD_SAFE -D_THREAD_SAFE -pthread -Os -w -pipe -march=core2 -msse4 -mmacosx-version-min=10.6 -Wall -D_THREAD_SAFE -pthread -I/usr/X11/include conftest.c >&5
configure:21427: $? = 0
configure:21427: result: yes
configure:21427: checking sys/timeb.h presence
configure:21427: /usr/bin/gcc-4.2 -E -I/usr/X11/include conftest.c
configure:21427: $? = 0
configure:21427: result: yes
configure:21427: checking for sys/timeb.h
configure:21427: result: yes
configure:21427: checking sys/times.h usability
configure:21427: /usr/bin/gcc-4.2 -std=gnu99 -std=gnu99 -c -D_THREAD_SAFE -D_THREAD_SAFE -pthread -Os -w -pipe -march=core2 -msse4 -mmacosx-version-min=10.6 -Wall -D_THREAD_SAFE -pthread -I/usr/X11/include conftest.c >&5
configure:21427: $? = 0
configure:21427: result: yes
configure:21427: checking sys/times.h presence
configure:21427: /usr/bin/gcc-4.2 -E -I/usr/X11/include conftest.c
configure:21427: $? = 0
configure:21427: result: yes
configure:21427: checking for sys/times.h
configure:21427: result: yes
configure:21427: checking sys/wait.h usability
configure:21427: /usr/bin/gcc-4.2 -std=gnu99 -std=gnu99 -c -D_THREAD_SAFE -D_THREAD_SAFE -pthread -Os -w -pipe -march=core2 -msse4 -mmacosx-version-min=10.6 -Wall -D_THREAD_SAFE -pthread -I/usr/X11/include conftest.c >&5
configure:21427: $? = 0
configure:21427: result: yes
configure:21427: checking sys/wait.h presence
configure:21427: /usr/bin/gcc-4.2 -E -I/usr/X11/include conftest.c
configure:21427: $? = 0
configure:21427: result: yes
configure:21427: checking for sys/wait.h
configure:21427: result: yes
configure:21427: checking wchar.h usability
configure:21427: /usr/bin/gcc-4.2 -std=gnu99 -std=gnu99 -c -D_THREAD_SAFE -D_THREAD_SAFE -pthread -Os -w -pipe -march=core2 -msse4 -mmacosx-version-min=10.6 -Wall -D_THREAD_SAFE -pthread -I/usr/X11/include conftest.c >&5
configure:21427: $? = 0
configure:21427: result: yes
configure:21427: checking wchar.h presence
configure:21427: /usr/bin/gcc-4.2 -E -I/usr/X11/include conftest.c
configure:21427: $? = 0
configure:21427: result: yes
configure:21427: checking for wchar.h
configure:21427: result: yes
configure:21427: checking xlocale.h usability
configure:21427: /usr/bin/gcc-4.2 -std=gnu99 -std=gnu99 -c -D_THREAD_SAFE -D_THREAD_SAFE -pthread -Os -w -pipe -march=core2 -msse4 -mmacosx-version-min=10.6 -Wall -D_THREAD_SAFE -pthread -I/usr/X11/include conftest.c >&5
configure:21427: $? = 0
configure:21427: result: yes
configure:21427: checking xlocale.h presence
configure:21427: /usr/bin/gcc-4.2 -E -I/usr/X11/include conftest.c
configure:21427: $? = 0
configure:21427: result: yes
configure:21427: checking for xlocale.h
configure:21427: result: yes
configure:21444: checking for stdbool.h that conforms to C99
configure:21511: /usr/bin/gcc-4.2 -std=gnu99 -std=gnu99 -c -D_THREAD_SAFE -D_THREAD_SAFE -pthread -Os -w -pipe -march=core2 -msse4 -mmacosx-version-min=10.6 -Wall -D_THREAD_SAFE -pthread -I/usr/X11/include conftest.c >&5
configure:21511: $? = 0
configure:21518: result: yes
configure:21520: checking for _Bool
configure:21520: /usr/bin/gcc-4.2 -std=gnu99 -std=gnu99 -c -D_THREAD_SAFE -D_THREAD_SAFE -pthread -Os -w -pipe -march=core2 -msse4 -mmacosx-version-min=10.6 -Wall -D_THREAD_SAFE -pthread -I/usr/X11/include conftest.c >&5
configure:21520: $? = 0
configure:21520: /usr/bin/gcc-4.2 -std=gnu99 -std=gnu99 -c -D_THREAD_SAFE -D_THREAD_SAFE -pthread -Os -w -pipe -march=core2 -msse4 -mmacosx-version-min=10.6 -Wall -D_THREAD_SAFE -pthread -I/usr/X11/include conftest.c >&5
conftest.c: In function 'main':
conftest.c:100: error: expected expression before ')' token
configure:21520: $? = 1
configure: failed program was:
| /* confdefs.h */
| #define PACKAGE_NAME "ImageMagick"
| #define PACKAGE_TARNAME "ImageMagick"
| #define PACKAGE_VERSION "6.8.0-10"
| #define PACKAGE_STRING "ImageMagick 6.8.0-10"
| #define PACKAGE_BUGREPORT "http://www.imagemagick.org"
| #define PACKAGE_URL ""
| #define MAGICK_TARGET_CPU x86_64
| #define MAGICK_TARGET_VENDOR apple
| #define MAGICK_TARGET_OS darwin10.8.0
| #define PACKAGE "ImageMagick"
| #define VERSION "6.8.0-10"
| #define STDC_HEADERS 1
| #define HAVE_SYS_TYPES_H 1
| #define HAVE_SYS_STAT_H 1
| #define HAVE_STDLIB_H 1
| #define HAVE_STRING_H 1
| #define HAVE_MEMORY_H 1
| #define HAVE_STRINGS_H 1
| #define HAVE_INTTYPES_H 1
| #define HAVE_STDINT_H 1
| #define HAVE_UNISTD_H 1
| #define __EXTENSIONS__ 1
| #define _ALL_SOURCE 1
| #define _GNU_SOURCE 1
| #define _POSIX_PTHREAD_SEMANTICS 1
| #define _TANDEM_SOURCE 1
| #define HAVE___ATTRIBUTE__ 1
| #define HAVE_PTHREAD_PRIO_INHERIT 1
| #define HAVE_PTHREAD 1
| #define THREAD_SUPPORT 1
| #define HAVE_PTHREAD_PRIO_INHERIT 1
| #define HAVE_PTHREAD 1
| #define HAVE_OPENCL_CL_H 1
| #define _OPENCL 1
| #define HAVE_FSEEKO 1
| #define HAVE_DLFCN_H 1
| #define LT_OBJDIR ".libs/"
| #define BUILD_MODULES 1
| #define INSTALLED_SUPPORT 1
| #define CIPHER_SUPPORT 1
| #define QUANTUM_DEPTH 16
| #define STDC_HEADERS 1
| #define HAVE_DIRENT_H 1
| #define HAVE_COMPLEX_H 1
| #define HAVE_ERRNO_H 1
| #define HAVE_FCNTL_H 1
| #define HAVE_LIMITS_H 1
| #define HAVE_LOCALE_H 1
| #define HAVE_MACHINE_PARAM_H 1
| #define HAVE_MACH_O_DYLD_H 1
| #define HAVE_STDARG_H 1
| #define HAVE_SYS_IPC_H 1
| #define HAVE_SYS_MMAN_H 1
| #define HAVE_SYS_RESOURCE_H 1
| #define HAVE_SYS_SYSLIMITS_H 1
| #define HAVE_SYS_TIME_H 1
| #define HAVE_SYS_TIMEB_H 1
| #define HAVE_SYS_TIMES_H 1
| #define HAVE_SYS_WAIT_H 1
| #define HAVE_WCHAR_H 1
| #define HAVE_XLOCALE_H 1
| /* end confdefs.h. */
| #include <stdio.h>
| #ifdef HAVE_SYS_TYPES_H
| # include <sys/types.h>
| #endif
| #ifdef HAVE_SYS_STAT_H
| # include <sys/stat.h>
| #endif
| #ifdef STDC_HEADERS
| # include <stdlib.h>
| # include <stddef.h>
| #else
| # ifdef HAVE_STDLIB_H
| # include <stdlib.h>
| # endif
| #endif
| #ifdef HAVE_STRING_H
| # if !defined STDC_HEADERS && defined HAVE_MEMORY_H
| # include <memory.h>
| # endif
| # include <string.h>
| #endif
| #ifdef HAVE_STRINGS_H
| # include <strings.h>
| #endif
| #ifdef HAVE_INTTYPES_H
| # include <inttypes.h>
| #endif
| #ifdef HAVE_STDINT_H
| # include <stdint.h>
| #endif
| #ifdef HAVE_UNISTD_H
| # include <unistd.h>
| #endif
| int
| main ()
| {
| if (sizeof ((_Bool)))
| return 0;
| ;
| return 0;
| }
configure:21520: result: yes
configure:21537: checking for working volatile
configure:21556: /usr/bin/gcc-4.2 -std=gnu99 -std=gnu99 -c -D_THREAD_SAFE -D_THREAD_SAFE -pthread -Os -w -pipe -march=core2 -msse4 -mmacosx-version-min=10.6 -Wall -D_THREAD_SAFE -pthread -I/usr/X11/include conftest.c >&5
configure:21556: $? = 0
configure:21563: result: yes
configure:21571: checking for preprocessor stringizing operator
configure:21591: result: yes
configure:21599: checking whether stat file-mode macros are broken
configure:21626: /usr/bin/gcc-4.2 -std=gnu99 -std=gnu99 -c -D_THREAD_SAFE -D_THREAD_SAFE -pthread -Os -w -pipe -march=core2 -msse4 -mmacosx-version-min=10.6 -Wall -D_THREAD_SAFE -pthread -I/usr/X11/include conftest.c >&5
configure:21626: $? = 0
configure:21633: result: no
configure:21641: checking whether time.h and sys/time.h may both be included
configure:21661: /usr/bin/gcc-4.2 -std=gnu99 -std=gnu99 -c -D_THREAD_SAFE -D_THREAD_SAFE -pthread -Os -w -pipe -march=core2 -msse4 -mmacosx-version-min=10.6 -Wall -D_THREAD_SAFE -pthread -I/usr/X11/include conftest.c >&5
configure:21661: $? = 0
configure:21668: result: yes
configure:21676: checking whether struct tm is in sys/time.h or time.h
configure:21696: /usr/bin/gcc-4.2 -std=gnu99 -std=gnu99 -c -D_THREAD_SAFE -D_THREAD_SAFE -pthread -Os -w -pipe -march=core2 -msse4 -mmacosx-version-min=10.6 -Wall -D_THREAD_SAFE -pthread -I/usr/X11/include conftest.c >&5
configure:21696: $? = 0
configure:21703: result: time.h
configure:21711: checking for struct tm.tm_zone
configure:21711: /usr/bin/gcc-4.2 -std=gnu99 -std=gnu99 -c -D_THREAD_SAFE -D_THREAD_SAFE -pthread -Os -w -pipe -march=core2 -msse4 -mmacosx-version-min=10.6 -Wall -D_THREAD_SAFE -pthread -I/usr/X11/include conftest.c >&5
configure:21711: $? = 0
configure:21711: result: yes
configure:21778: checking whether #! works in shell scripts
configure:21795: result: yes
configure:21803: checking for inline
configure:21819: /usr/bin/gcc-4.2 -std=gnu99 -std=gnu99 -c -D_THREAD_SAFE -D_THREAD_SAFE -pthread -Os -w -pipe -march=core2 -msse4 -mmacosx-version-min=10.6 -Wall -D_THREAD_SAFE -pthread -I/usr/X11/include conftest.c >&5
configure:21819: $? = 0
configure:21827: result: inline
configure:21849: checking for C/C++ restrict keyword
configure:21874: /usr/bin/gcc-4.2 -std=gnu99 -std=gnu99 -c -D_THREAD_SAFE -D_THREAD_SAFE -pthread -Os -w -pipe -march=core2 -msse4 -mmacosx-version-min=10.6 -Wall -D_THREAD_SAFE -pthread -I/usr/X11/include conftest.c >&5
configure:21874: $? = 0
configure:21882: result: __restrict
configure:21898: checking whether byte ordering is bigendian
configure:21913: /usr/bin/gcc-4.2 -std=gnu99 -std=gnu99 -c -D_THREAD_SAFE -D_THREAD_SAFE -pthread -Os -w -pipe -march=core2 -msse4 -mmacosx-version-min=10.6 -Wall -D_THREAD_SAFE -pthread -I/usr/X11/include conftest.c >&5
configure:21913: $? = 0
configure:21958: /usr/bin/gcc-4.2 -std=gnu99 -std=gnu99 -c -D_THREAD_SAFE -D_THREAD_SAFE -pthread -Os -w -pipe -march=core2 -msse4 -mmacosx-version-min=10.6 -Wall -D_THREAD_SAFE -pthread -I/usr/X11/include conftest.c >&5
configure:21958: $? = 0
configure:21976: /usr/bin/gcc-4.2 -std=gnu99 -std=gnu99 -c -D_THREAD_SAFE -D_THREAD_SAFE -pthread -Os -w -pipe -march=core2 -msse4 -mmacosx-version-min=10.6 -Wall -D_THREAD_SAFE -pthread -I/usr/X11/include conftest.c >&5
conftest.c: In function 'main':
conftest.c:78: error: 'not' undeclared (first use in this function)
conftest.c:78: error: (Each undeclared identifier is reported only once
conftest.c:78: error: for each function it appears in.)
conftest.c:78: error: expected ';' before 'big'
configure:21976: $? = 1
configure: failed program was:
| /* confdefs.h */
| #define PACKAGE_NAME "ImageMagick"
| #define PACKAGE_TARNAME "ImageMagick"
| #define PACKAGE_VERSION "6.8.0-10"
| #define PACKAGE_STRING "ImageMagick 6.8.0-10"
| #define PACKAGE_BUGREPORT "http://www.imagemagick.org"
| #define PACKAGE_URL ""
| #define MAGICK_TARGET_CPU x86_64
| #define MAGICK_TARGET_VENDOR apple
| #define MAGICK_TARGET_OS darwin10.8.0
| #define PACKAGE "ImageMagick"
| #define VERSION "6.8.0-10"
| #define STDC_HEADERS 1
| #define HAVE_SYS_TYPES_H 1
| #define HAVE_SYS_STAT_H 1
| #define HAVE_STDLIB_H 1
| #define HAVE_STRING_H 1
| #define HAVE_MEMORY_H 1
| #define HAVE_STRINGS_H 1
| #define HAVE_INTTYPES_H 1
| #define HAVE_STDINT_H 1
| #define HAVE_UNISTD_H 1
| #define __EXTENSIONS__ 1
| #define _ALL_SOURCE 1
| #define _GNU_SOURCE 1
| #define _POSIX_PTHREAD_SEMANTICS 1
| #define _TANDEM_SOURCE 1
| #define HAVE___ATTRIBUTE__ 1
| #define HAVE_PTHREAD_PRIO_INHERIT 1
| #define HAVE_PTHREAD 1
| #define THREAD_SUPPORT 1
| #define HAVE_PTHREAD_PRIO_INHERIT 1
| #define HAVE_PTHREAD 1
| #define HAVE_OPENCL_CL_H 1
| #define _OPENCL 1
| #define HAVE_FSEEKO 1
| #define HAVE_DLFCN_H 1
| #define LT_OBJDIR ".libs/"
| #define BUILD_MODULES 1
| #define INSTALLED_SUPPORT 1
| #define CIPHER_SUPPORT 1
| #define QUANTUM_DEPTH 16
| #define STDC_HEADERS 1
| #define HAVE_DIRENT_H 1
| #define HAVE_COMPLEX_H 1
| #define HAVE_ERRNO_H 1
| #define HAVE_FCNTL_H 1
| #define HAVE_LIMITS_H 1
| #define HAVE_LOCALE_H 1
| #define HAVE_MACHINE_PARAM_H 1
| #define HAVE_MACH_O_DYLD_H 1
| #define HAVE_STDARG_H 1
| #define HAVE_SYS_IPC_H 1
| #define HAVE_SYS_MMAN_H 1
| #define HAVE_SYS_RESOURCE_H 1
| #define HAVE_SYS_SYSLIMITS_H 1
| #define HAVE_SYS_TIME_H 1
| #define HAVE_SYS_TIMEB_H 1
| #define HAVE_SYS_TIMES_H 1
| #define HAVE_SYS_WAIT_H 1
| #define HAVE_WCHAR_H 1
| #define HAVE_XLOCALE_H 1
| #define HAVE__BOOL 1
| #define HAVE_STDBOOL_H 1
| #define HAVE_STRINGIZE 1
| #define TIME_WITH_SYS_TIME 1
| #define HAVE_STRUCT_TM_TM_ZONE 1
| #define HAVE_TM_ZONE 1
| #define restrict __restrict
| /* end confdefs.h. */
| #include <sys/types.h>
| #include <sys/param.h>
|
| int
| main ()
| {
| #if BYTE_ORDER != BIG_ENDIAN
| not big endian
| #endif
|
| ;
| return 0;
| }
configure:22104: result: no
configure:22124: checking for int8_t
configure:22124: /usr/bin/gcc-4.2 -std=gnu99 -std=gnu99 -c -D_THREAD_SAFE -D_THREAD_SAFE -pthread -Os -w -pipe -march=core2 -msse4 -mmacosx-version-min=10.6 -Wall -D_THREAD_SAFE -pthread -I/usr/X11/include conftest.c >&5
configure:22124: $? = 0
configure:22124: /usr/bin/gcc-4.2 -std=gnu99 -std=gnu99 -c -D_THREAD_SAFE -D_THREAD_SAFE -pthread -Os -w -pipe -march=core2 -msse4 -mmacosx-version-min=10.6 -Wall -D_THREAD_SAFE -pthread -I/usr/X11/include conftest.c >&5
conftest.c: In function 'main':
conftest.c:109: error: size of array 'test_array' is negative
configure:22124: $? = 1
configure: failed program was:
| /* confdefs.h */
| #define PACKAGE_NAME "ImageMagick"
| #define PACKAGE_TARNAME "ImageMagick"
| #define PACKAGE_VERSION "6.8.0-10"
| #define PACKAGE_STRING "ImageMagick 6.8.0-10"
| #define PACKAGE_BUGREPORT "http://www.imagemagick.org"
| #define PACKAGE_URL ""
| #define MAGICK_TARGET_CPU x86_64
| #define MAGICK_TARGET_VENDOR apple
| #define MAGICK_TARGET_OS darwin10.8.0
| #define PACKAGE "ImageMagick"
| #define VERSION "6.8.0-10"
| #define STDC_HEADERS 1
| #define HAVE_SYS_TYPES_H 1
| #define HAVE_SYS_STAT_H 1
| #define HAVE_STDLIB_H 1
| #define HAVE_STRING_H 1
| #define HAVE_MEMORY_H 1
| #define HAVE_STRINGS_H 1
| #define HAVE_INTTYPES_H 1
| #define HAVE_STDINT_H 1
| #define HAVE_UNISTD_H 1
| #define __EXTENSIONS__ 1
| #define _ALL_SOURCE 1
| #define _GNU_SOURCE 1
| #define _POSIX_PTHREAD_SEMANTICS 1
| #define _TANDEM_SOURCE 1
| #define HAVE___ATTRIBUTE__ 1
| #define HAVE_PTHREAD_PRIO_INHERIT 1
| #define HAVE_PTHREAD 1
| #define THREAD_SUPPORT 1
| #define HAVE_PTHREAD_PRIO_INHERIT 1
| #define HAVE_PTHREAD 1
| #define HAVE_OPENCL_CL_H 1
| #define _OPENCL 1
| #define HAVE_FSEEKO 1
| #define HAVE_DLFCN_H 1
| #define LT_OBJDIR ".libs/"
| #define BUILD_MODULES 1
| #define INSTALLED_SUPPORT 1
| #define CIPHER_SUPPORT 1
| #define QUANTUM_DEPTH 16
| #define STDC_HEADERS 1
| #define HAVE_DIRENT_H 1
| #define HAVE_COMPLEX_H 1
| #define HAVE_ERRNO_H 1
| #define HAVE_FCNTL_H 1
| #define HAVE_LIMITS_H 1
| #define HAVE_LOCALE_H 1
| #define HAVE_MACHINE_PARAM_H 1
| #define HAVE_MACH_O_DYLD_H 1
| #define HAVE_STDARG_H 1
| #define HAVE_SYS_IPC_H 1
| #define HAVE_SYS_MMAN_H 1
| #define HAVE_SYS_RESOURCE_H 1
| #define HAVE_SYS_SYSLIMITS_H 1
| #define HAVE_SYS_TIME_H 1
| #define HAVE_SYS_TIMEB_H 1
| #define HAVE_SYS_TIMES_H 1
| #define HAVE_SYS_WAIT_H 1
| #define HAVE_WCHAR_H 1
| #define HAVE_XLOCALE_H 1
| #define HAVE__BOOL 1
| #define HAVE_STDBOOL_H 1
| #define HAVE_STRINGIZE 1
| #define TIME_WITH_SYS_TIME 1
| #define HAVE_STRUCT_TM_TM_ZONE 1
| #define HAVE_TM_ZONE 1
| #define restrict __restrict
| /* end confdefs.h. */
| #include <stdio.h>
| #ifdef HAVE_SYS_TYPES_H
| # include <sys/types.h>
| #endif
| #ifdef HAVE_SYS_STAT_H
| # include <sys/stat.h>
| #endif
| #ifdef STDC_HEADERS
| # include <stdlib.h>
| # include <stddef.h>
| #else
| # ifdef HAVE_STDLIB_H
| # include <stdlib.h>
| # endif
| #endif
| #ifdef HAVE_STRING_H
| # if !defined STDC_HEADERS && defined HAVE_MEMORY_H
| # include <memory.h>
| # endif
| # include <string.h>
| #endif
| #ifdef HAVE_STRINGS_H
| # include <strings.h>
| #endif
| #ifdef HAVE_INTTYPES_H
| # include <inttypes.h>
| #endif
| #ifdef HAVE_STDINT_H
| # include <stdint.h>
| #endif
| #ifdef HAVE_UNISTD_H
| # include <unistd.h>
| #endif
| enum { N = 8 / 2 - 1 };
| int
| main ()
| {
| static int test_array [1 - 2 * !((int8_t) (((((int8_t) 1 << N) << N) - 1) * 2 + 1)
| < (int8_t) (((((int8_t) 1 << N) << N) - 1) * 2 + 2))];
| test_array [0] = 0;
| return test_array [0];
|
| ;
| return 0;
| }
configure:22124: result: yes
configure:22135: checking for int16_t
configure:22135: /usr/bin/gcc-4.2 -std=gnu99 -std=gnu99 -c -D_THREAD_SAFE -D_THREAD_SAFE -pthread -Os -w -pipe -march=core2 -msse4 -mmacosx-version-min=10.6 -Wall -D_THREAD_SAFE -pthread -I/usr/X11/include conftest.c >&5
configure:22135: $? = 0
configure:22135: /usr/bin/gcc-4.2 -std=gnu99 -std=gnu99 -c -D_THREAD_SAFE -D_THREAD_SAFE -pthread -Os -w -pipe -march=core2 -msse4 -mmacosx-version-min=10.6 -Wall -D_THREAD_SAFE -pthread -I/usr/X11/include conftest.c >&5
conftest.c: In function 'main':
conftest.c:109: error: size of array 'test_array' is negative
configure:22135: $? = 1
configure: failed program was:
| /* confdefs.h */
| #define PACKAGE_NAME "ImageMagick"
| #define PACKAGE_TARNAME "ImageMagick"
| #define PACKAGE_VERSION "6.8.0-10"
| #define PACKAGE_STRING "ImageMagick 6.8.0-10"
| #define PACKAGE_BUGREPORT "http://www.imagemagick.org"
| #define PACKAGE_URL ""
| #define MAGICK_TARGET_CPU x86_64
| #define MAGICK_TARGET_VENDOR apple
| #define MAGICK_TARGET_OS darwin10.8.0
| #define PACKAGE "ImageMagick"
| #define VERSION "6.8.0-10"
| #define STDC_HEADERS 1
| #define HAVE_SYS_TYPES_H 1
| #define HAVE_SYS_STAT_H 1
| #define HAVE_STDLIB_H 1
| #define HAVE_STRING_H 1
| #define HAVE_MEMORY_H 1
| #define HAVE_STRINGS_H 1
| #define HAVE_INTTYPES_H 1
| #define HAVE_STDINT_H 1
| #define HAVE_UNISTD_H 1
| #define __EXTENSIONS__ 1
| #define _ALL_SOURCE 1
| #define _GNU_SOURCE 1
| #define _POSIX_PTHREAD_SEMANTICS 1
| #define _TANDEM_SOURCE 1
| #define HAVE___ATTRIBUTE__ 1
| #define HAVE_PTHREAD_PRIO_INHERIT 1
| #define HAVE_PTHREAD 1
| #define THREAD_SUPPORT 1
| #define HAVE_PTHREAD_PRIO_INHERIT 1
| #define HAVE_PTHREAD 1
| #define HAVE_OPENCL_CL_H 1
| #define _OPENCL 1
| #define HAVE_FSEEKO 1
| #define HAVE_DLFCN_H 1
| #define LT_OBJDIR ".libs/"
| #define BUILD_MODULES 1
| #define INSTALLED_SUPPORT 1
| #define CIPHER_SUPPORT 1
| #define QUANTUM_DEPTH 16
| #define STDC_HEADERS 1
| #define HAVE_DIRENT_H 1
| #define HAVE_COMPLEX_H 1
| #define HAVE_ERRNO_H 1
| #define HAVE_FCNTL_H 1
| #define HAVE_LIMITS_H 1
| #define HAVE_LOCALE_H 1
| #define HAVE_MACHINE_PARAM_H 1
| #define HAVE_MACH_O_DYLD_H 1
| #define HAVE_STDARG_H 1
| #define HAVE_SYS_IPC_H 1
| #define HAVE_SYS_MMAN_H 1
| #define HAVE_SYS_RESOURCE_H 1
| #define HAVE_SYS_SYSLIMITS_H 1
| #define HAVE_SYS_TIME_H 1
| #define HAVE_SYS_TIMEB_H 1
| #define HAVE_SYS_TIMES_H 1
| #define HAVE_SYS_WAIT_H 1
| #define HAVE_WCHAR_H 1
| #define HAVE_XLOCALE_H 1
| #define HAVE__BOOL 1
| #define HAVE_STDBOOL_H 1
| #define HAVE_STRINGIZE 1
| #define TIME_WITH_SYS_TIME 1
| #define HAVE_STRUCT_TM_TM_ZONE 1
| #define HAVE_TM_ZONE 1
| #define restrict __restrict
| /* end confdefs.h. */
| #include <stdio.h>
| #ifdef HAVE_SYS_TYPES_H
| # include <sys/types.h>
| #endif
| #ifdef HAVE_SYS_STAT_H
| # include <sys/stat.h>
| #endif
| #ifdef STDC_HEADERS
| # include <stdlib.h>
| # include <stddef.h>
| #else
| # ifdef HAVE_STDLIB_H
| # include <stdlib.h>
| # endif
| #endif
| #ifdef HAVE_STRING_H
| # if !defined STDC_HEADERS && defined HAVE_MEMORY_H
| # include <memory.h>
| # endif
| # include <string.h>
| #endif
| #ifdef HAVE_STRINGS_H
| # include <strings.h>
| #endif
| #ifdef HAVE_INTTYPES_H
| # include <inttypes.h>
| #endif
| #ifdef HAVE_STDINT_H
| # include <stdint.h>
| #endif
| #ifdef HAVE_UNISTD_H
| # include <unistd.h>
| #endif
| enum { N = 16 / 2 - 1 };
| int
| main ()
| {
| static int test_array [1 - 2 * !((int16_t) (((((int16_t) 1 << N) << N) - 1) * 2 + 1)
| < (int16_t) (((((int16_t) 1 << N) << N) - 1) * 2 + 2))];
| test_array [0] = 0;
| return test_array [0];
|
| ;
| return 0;
| }
configure:22135: result: yes
configure:22146: checking for int32_t
configure:22146: /usr/bin/gcc-4.2 -std=gnu99 -std=gnu99 -c -D_THREAD_SAFE -D_THREAD_SAFE -pthread -Os -w -pipe -march=core2 -msse4 -mmacosx-version-min=10.6 -Wall -D_THREAD_SAFE -pthread -I/usr/X11/include conftest.c >&5
configure:22146: $? = 0
configure:22146: /usr/bin/gcc-4.2 -std=gnu99 -std=gnu99 -c -D_THREAD_SAFE -D_THREAD_SAFE -pthread -Os -w -pipe -march=core2 -msse4 -mmacosx-version-min=10.6 -Wall -D_THREAD_SAFE -pthread -I/usr/X11/include conftest.c >&5
conftest.c: In function 'main':
conftest.c:109: error: size of array 'test_array' is negative
configure:22146: $? = 1
configure: failed program was:
| /* confdefs.h */
| #define PACKAGE_NAME "ImageMagick"
| #define PACKAGE_TARNAME "ImageMagick"
| #define PACKAGE_VERSION "6.8.0-10"
| #define PACKAGE_STRING "ImageMagick 6.8.0-10"
| #define PACKAGE_BUGREPORT "http://www.imagemagick.org"
| #define PACKAGE_URL ""
| #define MAGICK_TARGET_CPU x86_64
| #define MAGICK_TARGET_VENDOR apple
| #define MAGICK_TARGET_OS darwin10.8.0
| #define PACKAGE "ImageMagick"
| #define VERSION "6.8.0-10"
| #define STDC_HEADERS 1
| #define HAVE_SYS_TYPES_H 1
| #define HAVE_SYS_STAT_H 1
| #define HAVE_STDLIB_H 1
| #define HAVE_STRING_H 1
| #define HAVE_MEMORY_H 1
| #define HAVE_STRINGS_H 1
| #define HAVE_INTTYPES_H 1
| #define HAVE_STDINT_H 1
| #define HAVE_UNISTD_H 1
| #define __EXTENSIONS__ 1
| #define _ALL_SOURCE 1
| #define _GNU_SOURCE 1
| #define _POSIX_PTHREAD_SEMANTICS 1
| #define _TANDEM_SOURCE 1
| #define HAVE___ATTRIBUTE__ 1
| #define HAVE_PTHREAD_PRIO_INHERIT 1
| #define HAVE_PTHREAD 1
| #define THREAD_SUPPORT 1
| #define HAVE_PTHREAD_PRIO_INHERIT 1
| #define HAVE_PTHREAD 1
| #define HAVE_OPENCL_CL_H 1
| #define _OPENCL 1
| #define HAVE_FSEEKO 1
| #define HAVE_DLFCN_H 1
| #define LT_OBJDIR ".libs/"
| #define BUILD_MODULES 1
| #define INSTALLED_SUPPORT 1
| #define CIPHER_SUPPORT 1
| #define QUANTUM_DEPTH 16
| #define STDC_HEADERS 1
| #define HAVE_DIRENT_H 1
| #define HAVE_COMPLEX_H 1
| #define HAVE_ERRNO_H 1
| #define HAVE_FCNTL_H 1
| #define HAVE_LIMITS_H 1
| #define HAVE_LOCALE_H 1
| #define HAVE_MACHINE_PARAM_H 1
| #define HAVE_MACH_O_DYLD_H 1
| #define HAVE_STDARG_H 1
| #define HAVE_SYS_IPC_H 1
| #define HAVE_SYS_MMAN_H 1
| #define HAVE_SYS_RESOURCE_H 1
| #define HAVE_SYS_SYSLIMITS_H 1
| #define HAVE_SYS_TIME_H 1
| #define HAVE_SYS_TIMEB_H 1
| #define HAVE_SYS_TIMES_H 1
| #define HAVE_SYS_WAIT_H 1
| #define HAVE_WCHAR_H 1
| #define HAVE_XLOCALE_H 1
| #define HAVE__BOOL 1
| #define HAVE_STDBOOL_H 1
| #define HAVE_STRINGIZE 1
| #define TIME_WITH_SYS_TIME 1
| #define HAVE_STRUCT_TM_TM_ZONE 1
| #define HAVE_TM_ZONE 1
| #define restrict __restrict
| /* end confdefs.h. */
| #include <stdio.h>
| #ifdef HAVE_SYS_TYPES_H
| # include <sys/types.h>
| #endif
| #ifdef HAVE_SYS_STAT_H
| # include <sys/stat.h>
| #endif
| #ifdef STDC_HEADERS
| # include <stdlib.h>
| # include <stddef.h>
| #else
| # ifdef HAVE_STDLIB_H
| # include <stdlib.h>
| # endif
| #endif
| #ifdef HAVE_STRING_H
| # if !defined STDC_HEADERS && defined HAVE_MEMORY_H
| # include <memory.h>
| # endif
| # include <string.h>
| #endif
| #ifdef HAVE_STRINGS_H
| # include <strings.h>
| #endif
| #ifdef HAVE_INTTYPES_H
| # include <inttypes.h>
| #endif
| #ifdef HAVE_STDINT_H
| # include <stdint.h>
| #endif
| #ifdef HAVE_UNISTD_H
| # include <unistd.h>
| #endif
| enum { N = 32 / 2 - 1 };
| int
| main ()
| {
| static int test_array [1 - 2 * !((int32_t) (((((int32_t) 1 << N) << N) - 1) * 2 + 1)
| < (int32_t) (((((int32_t) 1 << N) << N) - 1) * 2 + 2))];
| test_array [0] = 0;
| return test_array [0];
|
| ;
| return 0;
| }
configure:22146: result: yes
configure:22157: checking for int64_t
configure:22157: /usr/bin/gcc-4.2 -std=gnu99 -std=gnu99 -c -D_THREAD_SAFE -D_THREAD_SAFE -pthread -Os -w -pipe -march=core2 -msse4 -mmacosx-version-min=10.6 -Wall -D_THREAD_SAFE -pthread -I/usr/X11/include conftest.c >&5
configure:22157: $? = 0
configure:22157: /usr/bin/gcc-4.2 -std=gnu99 -std=gnu99 -c -D_THREAD_SAFE -D_THREAD_SAFE -pthread -Os -w -pipe -march=core2 -msse4 -mmacosx-version-min=10.6 -Wall -D_THREAD_SAFE -pthread -I/usr/X11/include conftest.c >&5
conftest.c: In function 'main':
conftest.c:109: error: size of array 'test_array' is negative
configure:22157: $? = 1
configure: failed program was:
| /* confdefs.h */
| #define PACKAGE_NAME "ImageMagick"
| #define PACKAGE_TARNAME "ImageMagick"
| #define PACKAGE_VERSION "6.8.0-10"
| #define PACKAGE_STRING "ImageMagick 6.8.0-10"
| #define PACKAGE_BUGREPORT "http://www.imagemagick.org"
| #define PACKAGE_URL ""
| #define MAGICK_TARGET_CPU x86_64
| #define MAGICK_TARGET_VENDOR apple
| #define MAGICK_TARGET_OS darwin10.8.0
| #define PACKAGE "ImageMagick"
| #define VERSION "6.8.0-10"
| #define STDC_HEADERS 1
| #define HAVE_SYS_TYPES_H 1
| #define HAVE_SYS_STAT_H 1
| #define HAVE_STDLIB_H 1
| #define HAVE_STRING_H 1
| #define HAVE_MEMORY_H 1
| #define HAVE_STRINGS_H 1
| #define HAVE_INTTYPES_H 1
| #define HAVE_STDINT_H 1
| #define HAVE_UNISTD_H 1
| #define __EXTENSIONS__ 1
| #define _ALL_SOURCE 1
| #define _GNU_SOURCE 1
| #define _POSIX_PTHREAD_SEMANTICS 1
| #define _TANDEM_SOURCE 1
| #define HAVE___ATTRIBUTE__ 1
| #define HAVE_PTHREAD_PRIO_INHERIT 1
| #define HAVE_PTHREAD 1
| #define THREAD_SUPPORT 1
| #define HAVE_PTHREAD_PRIO_INHERIT 1
| #define HAVE_PTHREAD 1
| #define HAVE_OPENCL_CL_H 1
| #define _OPENCL 1
| #define HAVE_FSEEKO 1
| #define HAVE_DLFCN_H 1
| #define LT_OBJDIR ".libs/"
| #define BUILD_MODULES 1
| #define INSTALLED_SUPPORT 1
| #define CIPHER_SUPPORT 1
| #define QUANTUM_DEPTH 16
| #define STDC_HEADERS 1
| #define HAVE_DIRENT_H 1
| #define HAVE_COMPLEX_H 1
| #define HAVE_ERRNO_H 1
| #define HAVE_FCNTL_H 1
| #define HAVE_LIMITS_H 1
| #define HAVE_LOCALE_H 1
| #define HAVE_MACHINE_PARAM_H 1
| #define HAVE_MACH_O_DYLD_H 1
| #define HAVE_STDARG_H 1
| #define HAVE_SYS_IPC_H 1
| #define HAVE_SYS_MMAN_H 1
| #define HAVE_SYS_RESOURCE_H 1
| #define HAVE_SYS_SYSLIMITS_H 1
| #define HAVE_SYS_TIME_H 1
| #define HAVE_SYS_TIMEB_H 1
| #define HAVE_SYS_TIMES_H 1
| #define HAVE_SYS_WAIT_H 1
| #define HAVE_WCHAR_H 1
| #define HAVE_XLOCALE_H 1
| #define HAVE__BOOL 1
| #define HAVE_STDBOOL_H 1
| #define HAVE_STRINGIZE 1
| #define TIME_WITH_SYS_TIME 1
| #define HAVE_STRUCT_TM_TM_ZONE 1
| #define HAVE_TM_ZONE 1
| #define restrict __restrict
| /* end confdefs.h. */
| #include <stdio.h>
| #ifdef HAVE_SYS_TYPES_H
| # include <sys/types.h>
| #endif
| #ifdef HAVE_SYS_STAT_H
| # include <sys/stat.h>
| #endif
| #ifdef STDC_HEADERS
| # include <stdlib.h>
| # include <stddef.h>
| #else
| # ifdef HAVE_STDLIB_H
| # include <stdlib.h>
| # endif
| #endif
| #ifdef HAVE_STRING_H
| # if !defined STDC_HEADERS && defined HAVE_MEMORY_H
| # include <memory.h>
| # endif
| # include <string.h>
| #endif
| #ifdef HAVE_STRINGS_H
| # include <strings.h>
| #endif
| #ifdef HAVE_INTTYPES_H
| # include <inttypes.h>
| #endif
| #ifdef HAVE_STDINT_H
| # include <stdint.h>
| #endif
| #ifdef HAVE_UNISTD_H
| # include <unistd.h>
| #endif
| enum { N = 64 / 2 - 1 };
| int
| main ()
| {
| static int test_array [1 - 2 * !((int64_t) (((((int64_t) 1 << N) << N) - 1) * 2 + 1)
| < (int64_t) (((((int64_t) 1 << N) << N) - 1) * 2 + 2))];
| test_array [0] = 0;
| return test_array [0];
|
| ;
| return 0;
| }
configure:22157: result: yes
configure:22169: checking for unsigned long long int
configure:22217: result: yes
configure:22227: checking for long long int
configure:22277: result: yes
configure:22287: checking for intmax_t
configure:22287: /usr/bin/gcc-4.2 -std=gnu99 -std=gnu99 -c -D_THREAD_SAFE -D_THREAD_SAFE -pthread -Os -w -pipe -march=core2 -msse4 -mmacosx-version-min=10.6 -Wall -D_THREAD_SAFE -pthread -I/usr/X11/include conftest.c >&5
configure:22287: $? = 0
configure:22287: /usr/bin/gcc-4.2 -std=gnu99 -std=gnu99 -c -D_THREAD_SAFE -D_THREAD_SAFE -pthread -Os -w -pipe -march=core2 -msse4 -mmacosx-version-min=10.6 -Wall -D_THREAD_SAFE -pthread -I/usr/X11/include conftest.c >&5
conftest.c: In function 'main':
conftest.c:109: error: expected expression before ')' token
configure:22287: $? = 1
configure: failed program was:
| /* confdefs.h */
| #define PACKAGE_NAME "ImageMagick"
| #define PACKAGE_TARNAME "ImageMagick"
| #define PACKAGE_VERSION "6.8.0-10"
| #define PACKAGE_STRING "ImageMagick 6.8.0-10"
| #define PACKAGE_BUGREPORT "http://www.imagemagick.org"
| #define PACKAGE_URL ""
| #define MAGICK_TARGET_CPU x86_64
| #define MAGICK_TARGET_VENDOR apple
| #define MAGICK_TARGET_OS darwin10.8.0
| #define PACKAGE "ImageMagick"
| #define VERSION "6.8.0-10"
| #define STDC_HEADERS 1
| #define HAVE_SYS_TYPES_H 1
| #define HAVE_SYS_STAT_H 1
| #define HAVE_STDLIB_H 1
| #define HAVE_STRING_H 1
| #define HAVE_MEMORY_H 1
| #define HAVE_STRINGS_H 1
| #define HAVE_INTTYPES_H 1
| #define HAVE_STDINT_H 1
| #define HAVE_UNISTD_H 1
| #define __EXTENSIONS__ 1
| #define _ALL_SOURCE 1
| #define _GNU_SOURCE 1
| #define _POSIX_PTHREAD_SEMANTICS 1
| #define _TANDEM_SOURCE 1
| #define HAVE___ATTRIBUTE__ 1
| #define HAVE_PTHREAD_PRIO_INHERIT 1
| #define HAVE_PTHREAD 1
| #define THREAD_SUPPORT 1
| #define HAVE_PTHREAD_PRIO_INHERIT 1
| #define HAVE_PTHREAD 1
| #define HAVE_OPENCL_CL_H 1
| #define _OPENCL 1
| #define HAVE_FSEEKO 1
| #define HAVE_DLFCN_H 1
| #define LT_OBJDIR ".libs/"
| #define BUILD_MODULES 1
| #define INSTALLED_SUPPORT 1
| #define CIPHER_SUPPORT 1
| #define QUANTUM_DEPTH 16
| #define STDC_HEADERS 1
| #define HAVE_DIRENT_H 1
| #define HAVE_COMPLEX_H 1
| #define HAVE_ERRNO_H 1
| #define HAVE_FCNTL_H 1
| #define HAVE_LIMITS_H 1
| #define HAVE_LOCALE_H 1
| #define HAVE_MACHINE_PARAM_H 1
| #define HAVE_MACH_O_DYLD_H 1
| #define HAVE_STDARG_H 1
| #define HAVE_SYS_IPC_H 1
| #define HAVE_SYS_MMAN_H 1
| #define HAVE_SYS_RESOURCE_H 1
| #define HAVE_SYS_SYSLIMITS_H 1
| #define HAVE_SYS_TIME_H 1
| #define HAVE_SYS_TIMEB_H 1
| #define HAVE_SYS_TIMES_H 1
| #define HAVE_SYS_WAIT_H 1
| #define HAVE_WCHAR_H 1
| #define HAVE_XLOCALE_H 1
| #define HAVE__BOOL 1
| #define HAVE_STDBOOL_H 1
| #define HAVE_STRINGIZE 1
| #define TIME_WITH_SYS_TIME 1
| #define HAVE_STRUCT_TM_TM_ZONE 1
| #define HAVE_TM_ZONE 1
| #define restrict __restrict
| #define HAVE_UNSIGNED_LONG_LONG_INT 1
| #define HAVE_LONG_LONG_INT 1
| /* end confdefs.h. */
| #include <stdio.h>
| #ifdef HAVE_SYS_TYPES_H
| # include <sys/types.h>
| #endif
| #ifdef HAVE_SYS_STAT_H
| # include <sys/stat.h>
| #endif
| #ifdef STDC_HEADERS
| # include <stdlib.h>
| # include <stddef.h>
| #else
| # ifdef HAVE_STDLIB_H
| # include <stdlib.h>
| # endif
| #endif
| #ifdef HAVE_STRING_H
| # if !defined STDC_HEADERS && defined HAVE_MEMORY_H
| # include <memory.h>
| # endif
| # include <string.h>
| #endif
| #ifdef HAVE_STRINGS_H
| # include <strings.h>
| #endif
| #ifdef HAVE_INTTYPES_H
| # include <inttypes.h>
| #endif
| #ifdef HAVE_STDINT_H
| # include <stdint.h>
| #endif
| #ifdef HAVE_UNISTD_H
| # include <unistd.h>
| #endif
| int
| main ()
| {
| if (sizeof ((intmax_t)))
| return 0;
| ;
| return 0;
| }
configure:22287: result: yes
configure:22305: checking for intptr_t
configure:22305: /usr/bin/gcc-4.2 -std=gnu99 -std=gnu99 -c -D_THREAD_SAFE -D_THREAD_SAFE -pthread -Os -w -pipe -march=core2 -msse4 -mmacosx-version-min=10.6 -Wall -D_THREAD_SAFE -pthread -I/usr/X11/include conftest.c >&5
configure:22305: $? = 0
configure:22305: /usr/bin/gcc-4.2 -std=gnu99 -std=gnu99 -c -D_THREAD_SAFE -D_THREAD_SAFE -pthread -Os -w -pipe -march=core2 -msse4 -mmacosx-version-min=10.6 -Wall -D_THREAD_SAFE -pthread -I/usr/X11/include conftest.c >&5
conftest.c: In function 'main':
conftest.c:110: error: expected expression before ')' token
configure:22305: $? = 1
configure: failed program was:
| /* confdefs.h */
| #define PACKAGE_NAME "ImageMagick"
| #define PACKAGE_TARNAME "ImageMagick"
| #define PACKAGE_VERSION "6.8.0-10"
| #define PACKAGE_STRING "ImageMagick 6.8.0-10"
| #define PACKAGE_BUGREPORT "http://www.imagemagick.org"
| #define PACKAGE_URL ""
| #define MAGICK_TARGET_CPU x86_64
| #define MAGICK_TARGET_VENDOR apple
| #define MAGICK_TARGET_OS darwin10.8.0
| #define PACKAGE "ImageMagick"
| #define VERSION "6.8.0-10"
| #define STDC_HEADERS 1
| #define HAVE_SYS_TYPES_H 1
| #define HAVE_SYS_STAT_H 1
| #define HAVE_STDLIB_H 1
| #define HAVE_STRING_H 1
| #define HAVE_MEMORY_H 1
| #define HAVE_STRINGS_H 1
| #define HAVE_INTTYPES_H 1
| #define HAVE_STDINT_H 1
| #define HAVE_UNISTD_H 1
| #define __EXTENSIONS__ 1
| #define _ALL_SOURCE 1
| #define _GNU_SOURCE 1
| #define _POSIX_PTHREAD_SEMANTICS 1
| #define _TANDEM_SOURCE 1
| #define HAVE___ATTRIBUTE__ 1
| #define HAVE_PTHREAD_PRIO_INHERIT 1
| #define HAVE_PTHREAD 1
| #define THREAD_SUPPORT 1
| #define HAVE_PTHREAD_PRIO_INHERIT 1
| #define HAVE_PTHREAD 1
| #define HAVE_OPENCL_CL_H 1
| #define _OPENCL 1
| #define HAVE_FSEEKO 1
| #define HAVE_DLFCN_H 1
| #define LT_OBJDIR ".libs/"
| #define BUILD_MODULES 1
| #define INSTALLED_SUPPORT 1
| #define CIPHER_SUPPORT 1
| #define QUANTUM_DEPTH 16
| #define STDC_HEADERS 1
| #define HAVE_DIRENT_H 1
| #define HAVE_COMPLEX_H 1
| #define HAVE_ERRNO_H 1
| #define HAVE_FCNTL_H 1
| #define HAVE_LIMITS_H 1
| #define HAVE_LOCALE_H 1
| #define HAVE_MACHINE_PARAM_H 1
| #define HAVE_MACH_O_DYLD_H 1
| #define HAVE_STDARG_H 1
| #define HAVE_SYS_IPC_H 1
| #define HAVE_SYS_MMAN_H 1
| #define HAVE_SYS_RESOURCE_H 1
| #define HAVE_SYS_SYSLIMITS_H 1
| #define HAVE_SYS_TIME_H 1
| #define HAVE_SYS_TIMEB_H 1
| #define HAVE_SYS_TIMES_H 1
| #define HAVE_SYS_WAIT_H 1
| #define HAVE_WCHAR_H 1
| #define HAVE_XLOCALE_H 1
| #define HAVE__BOOL 1
| #define HAVE_STDBOOL_H 1
| #define HAVE_STRINGIZE 1
| #define TIME_WITH_SYS_TIME 1
| #define HAVE_STRUCT_TM_TM_ZONE 1
| #define HAVE_TM_ZONE 1
| #define restrict __restrict
| #define HAVE_UNSIGNED_LONG_LONG_INT 1
| #define HAVE_LONG_LONG_INT 1
| #define HAVE_INTMAX_T 1
| /* end confdefs.h. */
| #include <stdio.h>
| #ifdef HAVE_SYS_TYPES_H
| # include <sys/types.h>
| #endif
| #ifdef HAVE_SYS_STAT_H
| # include <sys/stat.h>
| #endif
| #ifdef STDC_HEADERS
| # include <stdlib.h>
| # include <stddef.h>
| #else
| # ifdef HAVE_STDLIB_H
| # include <stdlib.h>
| # endif
| #endif
| #ifdef HAVE_STRING_H
| # if !defined STDC_HEADERS && defined HAVE_MEMORY_H
| # include <memory.h>
| # endif
| # include <string.h>
| #endif
| #ifdef HAVE_STRINGS_H
| # include <strings.h>
| #endif
| #ifdef HAVE_INTTYPES_H
| # include <inttypes.h>
| #endif
| #ifdef HAVE_STDINT_H
| # include <stdint.h>
| #endif
| #ifdef HAVE_UNISTD_H
| # include <unistd.h>
| #endif
| int
| main ()
| {
| if (sizeof ((intptr_t)))
| return 0;
| ;
| return 0;
| }
configure:22305: result: yes
configure:22341: checking for long double
configure:22374: result: yes
configure:22383: checking for long double with more range or precision than double
configure:22419: /usr/bin/gcc-4.2 -std=gnu99 -std=gnu99 -c -D_THREAD_SAFE -D_THREAD_SAFE -pthread -Os -w -pipe -march=core2 -msse4 -mmacosx-version-min=10.6 -Wall -D_THREAD_SAFE -pthread -I/usr/X11/include conftest.c >&5
configure:22419: $? = 0
configure:22426: result: yes
configure:22436: checking for long long int
configure:22486: result: yes
configure:22494: checking for mbstate_t
configure:22511: /usr/bin/gcc-4.2 -std=gnu99 -std=gnu99 -c -D_THREAD_SAFE -D_THREAD_SAFE -pthread -Os -w -pipe -march=core2 -msse4 -mmacosx-version-min=10.6 -Wall -D_THREAD_SAFE -pthread -I/usr/X11/include conftest.c >&5
configure:22511: $? = 0
configure:22518: result: yes
configure:22529: checking for mode_t
configure:22529: /usr/bin/gcc-4.2 -std=gnu99 -std=gnu99 -c -D_THREAD_SAFE -D_THREAD_SAFE -pthread -Os -w -pipe -march=core2 -msse4 -mmacosx-version-min=10.6 -Wall -D_THREAD_SAFE -pthread -I/usr/X11/include conftest.c >&5
configure:22529: $? = 0
configure:22529: /usr/bin/gcc-4.2 -std=gnu99 -std=gnu99 -c -D_THREAD_SAFE -D_THREAD_SAFE -pthread -Os -w -pipe -march=core2 -msse4 -mmacosx-version-min=10.6 -Wall -D_THREAD_SAFE -pthread -I/usr/X11/include conftest.c >&5
conftest.c: In function 'main':
conftest.c:115: error: expected expression before ')' token
configure:22529: $? = 1
configure: failed program was:
| /* confdefs.h */
| #define PACKAGE_NAME "ImageMagick"
| #define PACKAGE_TARNAME "ImageMagick"
| #define PACKAGE_VERSION "6.8.0-10"
| #define PACKAGE_STRING "ImageMagick 6.8.0-10"
| #define PACKAGE_BUGREPORT "http://www.imagemagick.org"
| #define PACKAGE_URL ""
| #define MAGICK_TARGET_CPU x86_64
| #define MAGICK_TARGET_VENDOR apple
| #define MAGICK_TARGET_OS darwin10.8.0
| #define PACKAGE "ImageMagick"
| #define VERSION "6.8.0-10"
| #define STDC_HEADERS 1
| #define HAVE_SYS_TYPES_H 1
| #define HAVE_SYS_STAT_H 1
| #define HAVE_STDLIB_H 1
| #define HAVE_STRING_H 1
| #define HAVE_MEMORY_H 1
| #define HAVE_STRINGS_H 1
| #define HAVE_INTTYPES_H 1
| #define HAVE_STDINT_H 1
| #define HAVE_UNISTD_H 1
| #define __EXTENSIONS__ 1
| #define _ALL_SOURCE 1
| #define _GNU_SOURCE 1
| #define _POSIX_PTHREAD_SEMANTICS 1
| #define _TANDEM_SOURCE 1
| #define HAVE___ATTRIBUTE__ 1
| #define HAVE_PTHREAD_PRIO_INHERIT 1
| #define HAVE_PTHREAD 1
| #define THREAD_SUPPORT 1
| #define HAVE_PTHREAD_PRIO_INHERIT 1
| #define HAVE_PTHREAD 1
| #define HAVE_OPENCL_CL_H 1
| #define _OPENCL 1
| #define HAVE_FSEEKO 1
| #define HAVE_DLFCN_H 1
| #define LT_OBJDIR ".libs/"
| #define BUILD_MODULES 1
| #define INSTALLED_SUPPORT 1
| #define CIPHER_SUPPORT 1
| #define QUANTUM_DEPTH 16
| #define STDC_HEADERS 1
| #define HAVE_DIRENT_H 1
| #define HAVE_COMPLEX_H 1
| #define HAVE_ERRNO_H 1
| #define HAVE_FCNTL_H 1
| #define HAVE_LIMITS_H 1
| #define HAVE_LOCALE_H 1
| #define HAVE_MACHINE_PARAM_H 1
| #define HAVE_MACH_O_DYLD_H 1
| #define HAVE_STDARG_H 1
| #define HAVE_SYS_IPC_H 1
| #define HAVE_SYS_MMAN_H 1
| #define HAVE_SYS_RESOURCE_H 1
| #define HAVE_SYS_SYSLIMITS_H 1
| #define HAVE_SYS_TIME_H 1
| #define HAVE_SYS_TIMEB_H 1
| #define HAVE_SYS_TIMES_H 1
| #define HAVE_SYS_WAIT_H 1
| #define HAVE_WCHAR_H 1
| #define HAVE_XLOCALE_H 1
| #define HAVE__BOOL 1
| #define HAVE_STDBOOL_H 1
| #define HAVE_STRINGIZE 1
| #define TIME_WITH_SYS_TIME 1
| #define HAVE_STRUCT_TM_TM_ZONE 1
| #define HAVE_TM_ZONE 1
| #define restrict __restrict
| #define HAVE_UNSIGNED_LONG_LONG_INT 1
| #define HAVE_LONG_LONG_INT 1
| #define HAVE_INTMAX_T 1
| #define HAVE_INTPTR_T 1
| #define HAVE_LONG_DOUBLE 1
| #define HAVE_LONG_DOUBLE_WIDER 1
| #define HAVE_LONG_LONG_INT 1
| #define HAVE_MBSTATE_T 1
| /* end confdefs.h. */
| #include <stdio.h>
| #ifdef HAVE_SYS_TYPES_H
| # include <sys/types.h>
| #endif
| #ifdef HAVE_SYS_STAT_H
| # include <sys/stat.h>
| #endif
| #ifdef STDC_HEADERS
| # include <stdlib.h>
| # include <stddef.h>
| #else
| # ifdef HAVE_STDLIB_H
| # include <stdlib.h>
| # endif
| #endif
| #ifdef HAVE_STRING_H
| # if !defined STDC_HEADERS && defined HAVE_MEMORY_H
| # include <memory.h>
| # endif
| # include <string.h>
| #endif
| #ifdef HAVE_STRINGS_H
| # include <strings.h>
| #endif
| #ifdef HAVE_INTTYPES_H
| # include <inttypes.h>
| #endif
| #ifdef HAVE_STDINT_H
| # include <stdint.h>
| #endif
| #ifdef HAVE_UNISTD_H
| # include <unistd.h>
| #endif
| int
| main ()
| {
| if (sizeof ((mode_t)))
| return 0;
| ;
| return 0;
| }
configure:22529: result: yes
configure:22540: checking for off_t
configure:22540: /usr/bin/gcc-4.2 -std=gnu99 -std=gnu99 -c -D_THREAD_SAFE -D_THREAD_SAFE -pthread -Os -w -pipe -march=core2 -msse4 -mmacosx-version-min=10.6 -Wall -D_THREAD_SAFE -pthread -I/usr/X11/include conftest.c >&5
configure:22540: $? = 0
configure:22540: /usr/bin/gcc-4.2 -std=gnu99 -std=gnu99 -c -D_THREAD_SAFE -D_THREAD_SAFE -pthread -Os -w -pipe -march=core2 -msse4 -mmacosx-version-min=10.6 -Wall -D_THREAD_SAFE -pthread -I/usr/X11/include conftest.c >&5
conftest.c: In function 'main':
conftest.c:115: error: expected expression before ')' token
configure:22540: $? = 1
configure: failed program was:
| /* confdefs.h */
| #define PACKAGE_NAME "ImageMagick"
| #define PACKAGE_TARNAME "ImageMagick"
| #define PACKAGE_VERSION "6.8.0-10"
| #define PACKAGE_STRING "ImageMagick 6.8.0-10"
| #define PACKAGE_BUGREPORT "http://www.imagemagick.org"
| #define PACKAGE_URL ""
| #define MAGICK_TARGET_CPU x86_64
| #define MAGICK_TARGET_VENDOR apple
| #define MAGICK_TARGET_OS darwin10.8.0
| #define PACKAGE "ImageMagick"
| #define VERSION "6.8.0-10"
| #define STDC_HEADERS 1
| #define HAVE_SYS_TYPES_H 1
| #define HAVE_SYS_STAT_H 1
| #define HAVE_STDLIB_H 1
| #define HAVE_STRING_H 1
| #define HAVE_MEMORY_H 1
| #define HAVE_STRINGS_H 1
| #define HAVE_INTTYPES_H 1
| #define HAVE_STDINT_H 1
| #define HAVE_UNISTD_H 1
| #define __EXTENSIONS__ 1
| #define _ALL_SOURCE 1
| #define _GNU_SOURCE 1
| #define _POSIX_PTHREAD_SEMANTICS 1
| #define _TANDEM_SOURCE 1
| #define HAVE___ATTRIBUTE__ 1
| #define HAVE_PTHREAD_PRIO_INHERIT 1
| #define HAVE_PTHREAD 1
| #define THREAD_SUPPORT 1
| #define HAVE_PTHREAD_PRIO_INHERIT 1
| #define HAVE_PTHREAD 1
| #define HAVE_OPENCL_CL_H 1
| #define _OPENCL 1
| #define HAVE_FSEEKO 1
| #define HAVE_DLFCN_H 1
| #define LT_OBJDIR ".libs/"
| #define BUILD_MODULES 1
| #define INSTALLED_SUPPORT 1
| #define CIPHER_SUPPORT 1
| #define QUANTUM_DEPTH 16
| #define STDC_HEADERS 1
| #define HAVE_DIRENT_H 1
| #define HAVE_COMPLEX_H 1
| #define HAVE_ERRNO_H 1
| #define HAVE_FCNTL_H 1
| #define HAVE_LIMITS_H 1
| #define HAVE_LOCALE_H 1
| #define HAVE_MACHINE_PARAM_H 1
| #define HAVE_MACH_O_DYLD_H 1
| #define HAVE_STDARG_H 1
| #define HAVE_SYS_IPC_H 1
| #define HAVE_SYS_MMAN_H 1
| #define HAVE_SYS_RESOURCE_H 1
| #define HAVE_SYS_SYSLIMITS_H 1
| #define HAVE_SYS_TIME_H 1
| #define HAVE_SYS_TIMEB_H 1
| #define HAVE_SYS_TIMES_H 1
| #define HAVE_SYS_WAIT_H 1
| #define HAVE_WCHAR_H 1
| #define HAVE_XLOCALE_H 1
| #define HAVE__BOOL 1
| #define HAVE_STDBOOL_H 1
| #define HAVE_STRINGIZE 1
| #define TIME_WITH_SYS_TIME 1
| #define HAVE_STRUCT_TM_TM_ZONE 1
| #define HAVE_TM_ZONE 1
| #define restrict __restrict
| #define HAVE_UNSIGNED_LONG_LONG_INT 1
| #define HAVE_LONG_LONG_INT 1
| #define HAVE_INTMAX_T 1
| #define HAVE_INTPTR_T 1
| #define HAVE_LONG_DOUBLE 1
| #define HAVE_LONG_DOUBLE_WIDER 1
| #define HAVE_LONG_LONG_INT 1
| #define HAVE_MBSTATE_T 1
| /* end confdefs.h. */
| #include <stdio.h>
| #ifdef HAVE_SYS_TYPES_H
| # include <sys/types.h>
| #endif
| #ifdef HAVE_SYS_STAT_H
| # include <sys/stat.h>
| #endif
| #ifdef STDC_HEADERS
| # include <stdlib.h>
| # include <stddef.h>
| #else
| # ifdef HAVE_STDLIB_H
| # include <stdlib.h>
| # endif
| #endif
| #ifdef HAVE_STRING_H
| # if !defined STDC_HEADERS && defined HAVE_MEMORY_H
| # include <memory.h>
| # endif
| # include <string.h>
| #endif
| #ifdef HAVE_STRINGS_H
| # include <strings.h>
| #endif
| #ifdef HAVE_INTTYPES_H
| # include <inttypes.h>
| #endif
| #ifdef HAVE_STDINT_H
| # include <stdint.h>
| #endif
| #ifdef HAVE_UNISTD_H
| # include <unistd.h>
| #endif
| int
| main ()
| {
| if (sizeof ((off_t)))
| return 0;
| ;
| return 0;
| }
configure:22540: result: yes
configure:22551: checking for pid_t
configure:22551: /usr/bin/gcc-4.2 -std=gnu99 -std=gnu99 -c -D_THREAD_SAFE -D_THREAD_SAFE -pthread -Os -w -pipe -march=core2 -msse4 -mmacosx-version-min=10.6 -Wall -D_THREAD_SAFE -pthread -I/usr/X11/include conftest.c >&5
configure:22551: $? = 0
configure:22551: /usr/bin/gcc-4.2 -std=gnu99 -std=gnu99 -c -D_THREAD_SAFE -D_THREAD_SAFE -pthread -Os -w -pipe -march=core2 -msse4 -mmacosx-version-min=10.6 -Wall -D_THREAD_SAFE -pthread -I/usr/X11/include conftest.c >&5
conftest.c: In function 'main':
conftest.c:115: error: expected expression before ')' token
configure:22551: $? = 1
configure: failed program was:
| /* confdefs.h */
| #define PACKAGE_NAME "ImageMagick"
| #define PACKAGE_TARNAME "ImageMagick"
| #define PACKAGE_VERSION "6.8.0-10"
| #define PACKAGE_STRING "ImageMagick 6.8.0-10"
| #define PACKAGE_BUGREPORT "http://www.imagemagick.org"
| #define PACKAGE_URL ""
| #define MAGICK_TARGET_CPU x86_64
| #define MAGICK_TARGET_VENDOR apple
| #define MAGICK_TARGET_OS darwin10.8.0
| #define PACKAGE "ImageMagick"
| #define VERSION "6.8.0-10"
| #define STDC_HEADERS 1
| #define HAVE_SYS_TYPES_H 1
| #define HAVE_SYS_STAT_H 1
| #define HAVE_STDLIB_H 1
| #define HAVE_STRING_H 1
| #define HAVE_MEMORY_H 1
| #define HAVE_STRINGS_H 1
| #define HAVE_INTTYPES_H 1
| #define HAVE_STDINT_H 1
| #define HAVE_UNISTD_H 1
| #define __EXTENSIONS__ 1
| #define _ALL_SOURCE 1
| #define _GNU_SOURCE 1
| #define _POSIX_PTHREAD_SEMANTICS 1
| #define _TANDEM_SOURCE 1
| #define HAVE___ATTRIBUTE__ 1
| #define HAVE_PTHREAD_PRIO_INHERIT 1
| #define HAVE_PTHREAD 1
| #define THREAD_SUPPORT 1
| #define HAVE_PTHREAD_PRIO_INHERIT 1
| #define HAVE_PTHREAD 1
| #define HAVE_OPENCL_CL_H 1
| #define _OPENCL 1
| #define HAVE_FSEEKO 1
| #define HAVE_DLFCN_H 1
| #define LT_OBJDIR ".libs/"
| #define BUILD_MODULES 1
| #define INSTALLED_SUPPORT 1
| #define CIPHER_SUPPORT 1
| #define QUANTUM_DEPTH 16
| #define STDC_HEADERS 1
| #define HAVE_DIRENT_H 1
| #define HAVE_COMPLEX_H 1
| #define HAVE_ERRNO_H 1
| #define HAVE_FCNTL_H 1
| #define HAVE_LIMITS_H 1
| #define HAVE_LOCALE_H 1
| #define HAVE_MACHINE_PARAM_H 1
| #define HAVE_MACH_O_DYLD_H 1
| #define HAVE_STDARG_H 1
| #define HAVE_SYS_IPC_H 1
| #define HAVE_SYS_MMAN_H 1
| #define HAVE_SYS_RESOURCE_H 1
| #define HAVE_SYS_SYSLIMITS_H 1
| #define HAVE_SYS_TIME_H 1