Skip to content

Instantly share code, notes, and snippets.

Embed
What would you like to do?
Nodejitsu deployment errors
jitsu deploy
info: Welcome to Nodejitsu desmondmorris
info: jitsu v0.11.3, node v0.8.14
info: It worked if it ends with Nodejitsu ok
info: Executing command deploy
info: Analyzing application dependencies in node app
info: Creating snapshot 0.0.1-1
info Uploading: [=============================] 100%
error: Error running command deploy
error: Nodejitsu Error (500): Internal Server Error
error: npm http GET http://nj-npm.irisnpm.com/express
npm http GET http://nj-npm.irisnpm.com/jade
npm http GET http://nj-npm.irisnpm.com/node-foursquare-2
npm http 200 http://nj-npm.irisnpm.com/node-foursquare-2
npm http GET http://nj-npm.irisnpm.com/node-foursquare-2/-/node-foursquare-2-0.1.5.tgz
npm http 200 http://nj-npm.irisnpm.com/jade
npm http GET http://nj-npm.irisnpm.com/jade/-/jade-0.27.7.tgz
npm http 200 http://nj-npm.irisnpm.com/node-foursquare-2/-/node-foursquare-2-0.1.5.tgz
npm http 200 http://nj-npm.irisnpm.com/jade/-/jade-0.27.7.tgz
npm http 200 http://nj-npm.irisnpm.com/express
npm http GET http://nj-npm.irisnpm.com/express/-/express-3.0.4.tgz
npm http 200 http://nj-npm.irisnpm.com/express/-/express-3.0.4.tgz
npm http GET http://nj-npm.irisnpm.com/connect/2.7.1
npm http GET http://nj-npm.irisnpm.com/commander/0.6.1
npm http GET http://nj-npm.irisnpm.com/range-parser/0.0.4
npm http GET http://nj-npm.irisnpm.com/mkdirp/0.3.3
npm http GET http://nj-npm.irisnpm.com/cookie/0.0.5
npm http GET http://nj-npm.irisnpm.com/buffer-crc32/0.1.1
npm http GET http://nj-npm.irisnpm.com/fresh/0.1.0
npm http GET http://nj-npm.irisnpm.com/methods/0.0.1
npm http GET http://nj-npm.irisnpm.com/send/0.1.0
npm http GET http://nj-npm.irisnpm.com/cookie-signature/0.0.1
npm http GET http://nj-npm.irisnpm.com/debug
npm http GET http://nj-npm.irisnpm.com/log4js
npm http GET http://nj-npm.irisnpm.com/mkdirp
npm http GET http://nj-npm.irisnpm.com/coffee-script
npm http 200 http://nj-npm.irisnpm.com/range-parser/0.0.4
npm http GET http://nj-npm.irisnpm.com/range-parser/-/range-parser-0.0.4.tgz
npm http 200 http://nj-npm.irisnpm.com/mkdirp/0.3.3
npm http GET http://nj-npm.irisnpm.com/mkdirp/-/mkdirp-0.3.3.tgz
npm http 200 http://nj-npm.irisnpm.com/commander/0.6.1
npm http GET http://nj-npm.irisnpm.com/commander/-/commander-0.6.1.tgz
npm http 200 http://nj-npm.irisnpm.com/connect/2.7.1
npm http 200 http://nj-npm.irisnpm.com/cookie/0.0.5
npm http GET http://nj-npm.irisnpm.com/connect/-/connect-2.7.1.tgz
npm http GET http://nj-npm.irisnpm.com/cookie/-/cookie-0.0.5.tgz
npm http 200 http://nj-npm.irisnpm.com/buffer-crc32/0.1.1
npm http GET http://nj-npm.irisnpm.com/buffer-crc32/-/buffer-crc32-0.1.1.tgz
npm http 200 http://nj-npm.irisnpm.com/fresh/0.1.0
npm http GET http://nj-npm.irisnpm.com/fresh/-/fresh-0.1.0.tgz
npm http 200 http://nj-npm.irisnpm.com/send/0.1.0
npm http GET http://nj-npm.irisnpm.com/send/-/send-0.1.0.tgz
npm http 200 http://nj-npm.irisnpm.com/methods/0.0.1
npm http GET http://nj-npm.irisnpm.com/methods/-/methods-0.0.1.tgz
npm http 200 http://nj-npm.irisnpm.com/cookie-signature/0.0.1
npm http GET http://nj-npm.irisnpm.com/cookie-signature/-/cookie-signature-0.0.1.tgz
npm http 200 http://nj-npm.irisnpm.com/debug
npm http GET http://nj-npm.irisnpm.com/debug/-/debug-0.7.0.tgz
npm http 200 http://nj-npm.irisnpm.com/range-parser/-/range-parser-0.0.4.tgz
npm http 200 http://nj-npm.irisnpm.com/mkdirp/-/mkdirp-0.3.3.tgz
npm http 200 http://nj-npm.irisnpm.com/mkdirp
npm http GET http://nj-npm.irisnpm.com/mkdirp/-/mkdirp-0.3.4.tgz
npm http 200 http://nj-npm.irisnpm.com/log4js
npm http 200 http://nj-npm.irisnpm.com/commander/-/commander-0.6.1.tgz
npm http GET http://nj-npm.irisnpm.com/log4js/-/log4js-0.4.3.tgz
npm http 200 http://nj-npm.irisnpm.com/coffee-script
npm http 200 http://nj-npm.irisnpm.com/connect/-/connect-2.7.1.tgz
npm http GET http://nj-npm.irisnpm.com/coffee-script/-/coffee-script-1.4.0.tgz
npm http 200 http://nj-npm.irisnpm.com/buffer-crc32/-/buffer-crc32-0.1.1.tgz
npm http 200 http://nj-npm.irisnpm.com/cookie/-/cookie-0.0.5.tgz
npm http 200 http://nj-npm.irisnpm.com/fresh/-/fresh-0.1.0.tgz
npm http 200 http://nj-npm.irisnpm.com/cookie-signature/-/cookie-signature-0.0.1.tgz
npm http 200 http://nj-npm.irisnpm.com/methods/-/methods-0.0.1.tgz
npm http 200 http://nj-npm.irisnpm.com/send/-/send-0.1.0.tgz
npm WARN package.json methods@0.0.1 No README.md file found!
npm http 200 http://nj-npm.irisnpm.com/log4js/-/log4js-0.4.3.tgz
npm http 200 http://nj-npm.irisnpm.com/mkdirp/-/mkdirp-0.3.4.tgz
npm http 200 http://nj-npm.irisnpm.com/debug/-/debug-0.7.0.tgz
npm http 200 http://nj-npm.irisnpm.com/coffee-script/-/coffee-script-1.4.0.tgz
npm http GET http://nj-npm.irisnpm.com/async/0.1.15
npm http GET http://nj-npm.irisnpm.com/compress-buffer/0.5.1
npm http 200 http://nj-npm.irisnpm.com/async/0.1.15
npm http 200 http://nj-npm.irisnpm.com/compress-buffer/0.5.1
npm http GET http://nj-npm.irisnpm.com/async/-/async-0.1.15.tgz
npm http GET http://nj-npm.irisnpm.com/compress-buffer/-/compress-buffer-0.5.1.tgz
npm http GET http://nj-npm.irisnpm.com/mime/1.2.6
npm http 200 http://nj-npm.irisnpm.com/compress-buffer/-/compress-buffer-0.5.1.tgz
npm http 200 http://nj-npm.irisnpm.com/async/-/async-0.1.15.tgz
npm http 200 http://nj-npm.irisnpm.com/mime/1.2.6
npm http GET http://nj-npm.irisnpm.com/mime/-/mime-1.2.6.tgz
npm http 200 http://nj-npm.irisnpm.com/mime/-/mime-1.2.6.tgz
npm http GET http://nj-npm.irisnpm.com/qs/0.5.1
npm http GET http://nj-npm.irisnpm.com/formidable/1.0.11
npm http GET http://nj-npm.irisnpm.com/crc/0.2.0
npm http GET http://nj-npm.irisnpm.com/bytes/0.1.0
npm http GET http://nj-npm.irisnpm.com/pause/0.0.1
npm http 200 http://nj-npm.irisnpm.com/crc/0.2.0
npm http GET http://nj-npm.irisnpm.com/crc/-/crc-0.2.0.tgz
npm http 200 http://nj-npm.irisnpm.com/pause/0.0.1
npm http 200 http://nj-npm.irisnpm.com/crc/-/crc-0.2.0.tgz
npm http GET http://nj-npm.irisnpm.com/pause/-/pause-0.0.1.tgz
npm http 200 http://nj-npm.irisnpm.com/bytes/0.1.0
npm http 200 http://nj-npm.irisnpm.com/formidable/1.0.11
npm http 200 http://nj-npm.irisnpm.com/qs/0.5.1
npm http GET http://nj-npm.irisnpm.com/bytes/-/bytes-0.1.0.tgz
npm http GET http://nj-npm.irisnpm.com/formidable/-/formidable-1.0.11.tgz
npm http GET http://nj-npm.irisnpm.com/qs/-/qs-0.5.1.tgz
npm http 200 http://nj-npm.irisnpm.com/pause/-/pause-0.0.1.tgz
npm http 200 http://nj-npm.irisnpm.com/qs/-/qs-0.5.1.tgz
npm http 200 http://nj-npm.irisnpm.com/bytes/-/bytes-0.1.0.tgz
npm http 200 http://nj-npm.irisnpm.com/formidable/-/formidable-1.0.11.tgz
> compress-buffer@0.5.1 install /root/tmp/tmp-1682n0n4pm8/build/package/node_modules/node-foursquare-2/node_modules/log4js/node_modules/compress-buffer
> make build
rm -Rf build
node-waf configure
Checking for program g++ or c++ : /opt/local/bin/g++
Checking for program cpp : /opt/local/bin/cpp
Checking for program ar : /opt/local/bin/ar
Checking for program ranlib : /opt/local/bin/ranlib
Checking for g++ : ok
Checking for node path : not found
Checking for node prefix : ok /opt/local
'configure' finished successfully (0.069s)
node-waf build
Waf: Entering directory `/root/tmp/tmp-1682n0n4pm8/build/package/node_modules/node-foursquare-2/node_modules/log4js/node_modules/compress-buffer/build'
[1/2] cxx: src/compress-buffer.cc -> build/Release/src/compress-buffer_1.o
[2/2] cxx_link: build/Release/src/compress-buffer_1.o -> build/Release/compress-buffer-bindings.node
ld: fatal: file Release/src/compress-buffer_1.o: wrong ELF class: ELFCLASS64
ld: fatal: file processing errors. No output written to /root/tmp/tmp-1682n0n4pm8/build/package/node_modules/node-foursquare-2/node_modules/log4js/node_modules/compress-buffer/build/Release/compress-buffer-bindings.node
collect2: ld returned 1 exit status
Waf: Leaving directory `/root/tmp/tmp-1682n0n4pm8/build/package/node_modules/node-foursquare-2/node_modules/log4js/node_modules/compress-buffer/build'
Build failed: -> task failed (err #1):
{task: cxx_link compress-buffer_1.o -> compress-buffer-bindings.node}
make: *** [compile] Error 1
npm ERR! compress-buffer@0.5.1 install: `make build`
npm ERR! `sh "-c" "make build"` failed with 2
npm ERR!
npm ERR! Failed at the compress-buffer@0.5.1 install script.
npm ERR! This is most likely a problem with the compress-buffer package,
npm ERR! not with npm itself.
npm ERR! Tell the author that this fails on your system:
npm ERR! make build
npm ERR! You can get their info via:
npm ERR! npm owner ls compress-buffer
npm ERR! There is likely additional logging output above.
npm ERR! System SunOS 5.11
npm ERR! command "/opt/local/bin/node" "/opt/local/bin/npm" "install"
npm ERR! cwd /root/tmp/tmp-1682n0n4pm8/build/package
npm ERR! node -v v0.8.8
npm ERR! npm -v 1.1.59
npm ERR! code ELIFECYCLE
npm ERR!
npm ERR! Additional logging details can be found in:
npm ERR! /root/tmp/tmp-1682n0n4pm8/build/package/npm-debug.log
npm ERR! not ok code 0
help: For help with this error contact Nodejitsu Support:
help: webchat: <http://webchat.nodejitsu.com/>
help: irc: <irc://chat.freenode.net/#nodejitsu>
help: email: <support@nodejitsu.com>
help:
help: Copy and paste this output to a gist (http://gist.github.com/)
info: Nodejitsu not ok
Sign up for free to join this conversation on GitHub. Already have an account? Sign in to comment
You can’t perform that action at this time.