Skip to content

Instantly share code, notes, and snippets.

Embed
What would you like to do?
minitest-handler gem install debug
# /opt/chef/embedded/bin/gem install minitest-chef-handler --debug
Exception `NameError' at /opt/chef/embedded/lib/ruby/site_ruby/1.9.1/rubygems/command_manager.rb:177 - uninitialized constant Gem::Commands::InstallCommand
Exception `Errno::EAGAIN' at /opt/chef/embedded/lib/ruby/1.9.1/net/protocol.rb:141 - Resource temporarily unavailable - read would block
Exception `Errno::EAGAIN' at /opt/chef/embedded/lib/ruby/1.9.1/net/protocol.rb:141 - Resource temporarily unavailable - read would block
Exception `Errno::EAGAIN' at /opt/chef/embedded/lib/ruby/1.9.1/net/protocol.rb:141 - Resource temporarily unavailable - read would block
Exception `Errno::EAGAIN' at /opt/chef/embedded/lib/ruby/1.9.1/net/protocol.rb:141 - Resource temporarily unavailable - read would block
Exception `Errno::EAGAIN' at /opt/chef/embedded/lib/ruby/1.9.1/net/protocol.rb:141 - Resource temporarily unavailable - read would block
Exception `Errno::EAGAIN' at /opt/chef/embedded/lib/ruby/1.9.1/net/protocol.rb:141 - Resource temporarily unavailable - read would block
Exception `Errno::EAGAIN' at /opt/chef/embedded/lib/ruby/1.9.1/net/protocol.rb:141 - Resource temporarily unavailable - read would block
Exception `Errno::EAGAIN' at /opt/chef/embedded/lib/ruby/1.9.1/net/protocol.rb:141 - Resource temporarily unavailable - read would block
Exception `Errno::EAGAIN' at /opt/chef/embedded/lib/ruby/1.9.1/net/protocol.rb:141 - Resource temporarily unavailable - read would block
Exception `Errno::EAGAIN' at /opt/chef/embedded/lib/ruby/1.9.1/net/protocol.rb:141 - Resource temporarily unavailable - read would block
Exception `Errno::EAGAIN' at /opt/chef/embedded/lib/ruby/1.9.1/net/protocol.rb:141 - Resource temporarily unavailable - read would block
Exception `Errno::EAGAIN' at /opt/chef/embedded/lib/ruby/1.9.1/net/protocol.rb:141 - Resource temporarily unavailable - read would block
Exception `Errno::EAGAIN' at /opt/chef/embedded/lib/ruby/1.9.1/net/protocol.rb:141 - Resource temporarily unavailable - read would block
Exception `Errno::EAGAIN' at /opt/chef/embedded/lib/ruby/1.9.1/net/protocol.rb:141 - Resource temporarily unavailable - read would block
Exception `Errno::EAGAIN' at /opt/chef/embedded/lib/ruby/1.9.1/net/protocol.rb:141 - Resource temporarily unavailable - read would block
Exception `Errno::EAGAIN' at /opt/chef/embedded/lib/ruby/1.9.1/net/protocol.rb:141 - Resource temporarily unavailable - read would block
Exception `Errno::EAGAIN' at /opt/chef/embedded/lib/ruby/1.9.1/net/protocol.rb:141 - Resource temporarily unavailable - read would block
Exception `Errno::EAGAIN' at /opt/chef/embedded/lib/ruby/1.9.1/net/protocol.rb:141 - Resource temporarily unavailable - read would block
Exception `Errno::EAGAIN' at /opt/chef/embedded/lib/ruby/1.9.1/net/protocol.rb:141 - Resource temporarily unavailable - read would block
Exception `Errno::EAGAIN' at /opt/chef/embedded/lib/ruby/1.9.1/net/protocol.rb:141 - Resource temporarily unavailable - read would block
Exception `Errno::EAGAIN' at /opt/chef/embedded/lib/ruby/1.9.1/net/protocol.rb:141 - Resource temporarily unavailable - read would block
Exception `Errno::EAGAIN' at /opt/chef/embedded/lib/ruby/1.9.1/net/protocol.rb:141 - Resource temporarily unavailable - read would block
Exception `Errno::EAGAIN' at /opt/chef/embedded/lib/ruby/1.9.1/net/protocol.rb:141 - Resource temporarily unavailable - read would block
Exception `Errno::EAGAIN' at /opt/chef/embedded/lib/ruby/1.9.1/net/protocol.rb:141 - Resource temporarily unavailable - read would block
Exception `Errno::EAGAIN' at /opt/chef/embedded/lib/ruby/1.9.1/net/protocol.rb:141 - Resource temporarily unavailable - read would block
Exception `Errno::EAGAIN' at /opt/chef/embedded/lib/ruby/1.9.1/net/protocol.rb:141 - Resource temporarily unavailable - read would block
Exception `Errno::EAGAIN' at /opt/chef/embedded/lib/ruby/1.9.1/net/protocol.rb:141 - Resource temporarily unavailable - read would block
Exception `Errno::EAGAIN' at /opt/chef/embedded/lib/ruby/1.9.1/net/protocol.rb:141 - Resource temporarily unavailable - read would block
Exception `Errno::EAGAIN' at /opt/chef/embedded/lib/ruby/1.9.1/net/protocol.rb:141 - Resource temporarily unavailable - read would block
Exception `Errno::EAGAIN' at /opt/chef/embedded/lib/ruby/1.9.1/net/protocol.rb:141 - Resource temporarily unavailable - read would block
Exception `Errno::EAGAIN' at /opt/chef/embedded/lib/ruby/1.9.1/net/protocol.rb:141 - Resource temporarily unavailable - read would block
Exception `Errno::EAGAIN' at /opt/chef/embedded/lib/ruby/1.9.1/net/protocol.rb:141 - Resource temporarily unavailable - read would block
Exception `Errno::EAGAIN' at /opt/chef/embedded/lib/ruby/1.9.1/net/protocol.rb:141 - Resource temporarily unavailable - read would block
Exception `Errno::EAGAIN' at /opt/chef/embedded/lib/ruby/1.9.1/net/protocol.rb:141 - Resource temporarily unavailable - read would block
Exception `Errno::EAGAIN' at /opt/chef/embedded/lib/ruby/1.9.1/net/protocol.rb:141 - Resource temporarily unavailable - read would block
Exception `Errno::EAGAIN' at /opt/chef/embedded/lib/ruby/1.9.1/net/protocol.rb:141 - Resource temporarily unavailable - read would block
Exception `Errno::EAGAIN' at /opt/chef/embedded/lib/ruby/1.9.1/net/protocol.rb:141 - Resource temporarily unavailable - read would block
Exception `Errno::EAGAIN' at /opt/chef/embedded/lib/ruby/1.9.1/net/protocol.rb:141 - Resource temporarily unavailable - read would block
Exception `Errno::EEXIST' at /opt/chef/embedded/lib/ruby/1.9.1/fileutils.rb:247 - File exists - /root/.gem/specs/rubygems.org%80
Exception `Errno::EAGAIN' at /opt/chef/embedded/lib/ruby/1.9.1/net/protocol.rb:141 - Resource temporarily unavailable - read would block
Exception `Errno::EAGAIN' at /opt/chef/embedded/lib/ruby/1.9.1/net/protocol.rb:141 - Resource temporarily unavailable - read would block
Exception `Errno::EAGAIN' at /opt/chef/embedded/lib/ruby/1.9.1/net/protocol.rb:141 - Resource temporarily unavailable - read would block
Exception `Errno::EAGAIN' at /opt/chef/embedded/lib/ruby/1.9.1/net/protocol.rb:141 - Resource temporarily unavailable - read would block
Exception `Errno::EAGAIN' at /opt/chef/embedded/lib/ruby/1.9.1/net/protocol.rb:141 - Resource temporarily unavailable - read would block
Exception `Errno::EAGAIN' at /opt/chef/embedded/lib/ruby/1.9.1/net/protocol.rb:141 - Resource temporarily unavailable - read would block
Exception `Errno::EAGAIN' at /opt/chef/embedded/lib/ruby/1.9.1/net/protocol.rb:141 - Resource temporarily unavailable - read would block
Exception `Errno::EAGAIN' at /opt/chef/embedded/lib/ruby/1.9.1/net/protocol.rb:141 - Resource temporarily unavailable - read would block
Exception `Errno::EAGAIN' at /opt/chef/embedded/lib/ruby/1.9.1/net/protocol.rb:141 - Resource temporarily unavailable - read would block
Exception `Errno::EAGAIN' at /opt/chef/embedded/lib/ruby/1.9.1/net/protocol.rb:141 - Resource temporarily unavailable - read would block
Exception `Errno::EAGAIN' at /opt/chef/embedded/lib/ruby/1.9.1/net/protocol.rb:141 - Resource temporarily unavailable - read would block
Exception `Errno::EAGAIN' at /opt/chef/embedded/lib/ruby/1.9.1/net/protocol.rb:141 - Resource temporarily unavailable - read would block
Exception `Errno::EAGAIN' at /opt/chef/embedded/lib/ruby/1.9.1/net/protocol.rb:141 - Resource temporarily unavailable - read would block
Exception `Errno::EAGAIN' at /opt/chef/embedded/lib/ruby/1.9.1/net/protocol.rb:141 - Resource temporarily unavailable - read would block
Exception `Errno::EAGAIN' at /opt/chef/embedded/lib/ruby/1.9.1/net/protocol.rb:141 - Resource temporarily unavailable - read would block
Exception `Errno::EAGAIN' at /opt/chef/embedded/lib/ruby/1.9.1/net/protocol.rb:141 - Resource temporarily unavailable - read would block
Exception `Errno::EAGAIN' at /opt/chef/embedded/lib/ruby/1.9.1/net/protocol.rb:141 - Resource temporarily unavailable - read would block
Exception `Errno::EAGAIN' at /opt/chef/embedded/lib/ruby/1.9.1/net/protocol.rb:141 - Resource temporarily unavailable - read would block
Exception `Errno::EAGAIN' at /opt/chef/embedded/lib/ruby/1.9.1/net/protocol.rb:141 - Resource temporarily unavailable - read would block
Exception `Errno::EAGAIN' at /opt/chef/embedded/lib/ruby/1.9.1/net/protocol.rb:141 - Resource temporarily unavailable - read would block
Exception `Errno::EAGAIN' at /opt/chef/embedded/lib/ruby/1.9.1/net/protocol.rb:141 - Resource temporarily unavailable - read would block
Exception `Errno::EAGAIN' at /opt/chef/embedded/lib/ruby/1.9.1/net/protocol.rb:141 - Resource temporarily unavailable - read would block
Exception `Errno::EAGAIN' at /opt/chef/embedded/lib/ruby/1.9.1/net/protocol.rb:141 - Resource temporarily unavailable - read would block
Exception `Errno::EAGAIN' at /opt/chef/embedded/lib/ruby/1.9.1/net/protocol.rb:141 - Resource temporarily unavailable - read would block
Exception `Errno::EAGAIN' at /opt/chef/embedded/lib/ruby/1.9.1/net/protocol.rb:141 - Resource temporarily unavailable - read would block
Exception `Errno::EAGAIN' at /opt/chef/embedded/lib/ruby/1.9.1/net/protocol.rb:141 - Resource temporarily unavailable - read would block
Exception `Errno::EAGAIN' at /opt/chef/embedded/lib/ruby/1.9.1/net/protocol.rb:141 - Resource temporarily unavailable - read would block
Exception `Errno::EAGAIN' at /opt/chef/embedded/lib/ruby/1.9.1/net/protocol.rb:141 - Resource temporarily unavailable - read would block
Exception `Errno::EAGAIN' at /opt/chef/embedded/lib/ruby/1.9.1/net/protocol.rb:141 - Resource temporarily unavailable - read would block
Exception `Errno::EAGAIN' at /opt/chef/embedded/lib/ruby/1.9.1/net/protocol.rb:141 - Resource temporarily unavailable - read would block
Exception `Errno::EAGAIN' at /opt/chef/embedded/lib/ruby/1.9.1/net/protocol.rb:141 - Resource temporarily unavailable - read would block
Exception `Errno::EAGAIN' at /opt/chef/embedded/lib/ruby/1.9.1/net/protocol.rb:141 - Resource temporarily unavailable - read would block
Exception `Errno::EAGAIN' at /opt/chef/embedded/lib/ruby/1.9.1/net/protocol.rb:141 - Resource temporarily unavailable - read would block
Exception `Errno::EAGAIN' at /opt/chef/embedded/lib/ruby/1.9.1/net/protocol.rb:141 - Resource temporarily unavailable - read would block
Exception `Errno::EAGAIN' at /opt/chef/embedded/lib/ruby/1.9.1/net/protocol.rb:141 - Resource temporarily unavailable - read would block
Exception `Errno::EAGAIN' at /opt/chef/embedded/lib/ruby/1.9.1/net/protocol.rb:141 - Resource temporarily unavailable - read would block
Exception `Errno::EAGAIN' at /opt/chef/embedded/lib/ruby/1.9.1/net/protocol.rb:141 - Resource temporarily unavailable - read would block
Exception `Errno::EAGAIN' at /opt/chef/embedded/lib/ruby/1.9.1/net/protocol.rb:141 - Resource temporarily unavailable - read would block
Exception `Errno::EAGAIN' at /opt/chef/embedded/lib/ruby/1.9.1/net/protocol.rb:141 - Resource temporarily unavailable - read would block
Exception `Errno::EAGAIN' at /opt/chef/embedded/lib/ruby/1.9.1/net/protocol.rb:141 - Resource temporarily unavailable - read would block
Exception `Errno::EAGAIN' at /opt/chef/embedded/lib/ruby/1.9.1/net/protocol.rb:141 - Resource temporarily unavailable - read would block
Exception `Errno::EAGAIN' at /opt/chef/embedded/lib/ruby/1.9.1/net/protocol.rb:141 - Resource temporarily unavailable - read would block
Exception `Errno::EAGAIN' at /opt/chef/embedded/lib/ruby/1.9.1/net/protocol.rb:141 - Resource temporarily unavailable - read would block
Exception `Errno::EAGAIN' at /opt/chef/embedded/lib/ruby/1.9.1/net/protocol.rb:141 - Resource temporarily unavailable - read would block
Exception `Errno::EAGAIN' at /opt/chef/embedded/lib/ruby/1.9.1/net/protocol.rb:141 - Resource temporarily unavailable - read would block
Exception `Errno::EAGAIN' at /opt/chef/embedded/lib/ruby/1.9.1/net/protocol.rb:141 - Resource temporarily unavailable - read would block
Exception `Errno::EAGAIN' at /opt/chef/embedded/lib/ruby/1.9.1/net/protocol.rb:141 - Resource temporarily unavailable - read would block
Exception `Errno::EAGAIN' at /opt/chef/embedded/lib/ruby/1.9.1/net/protocol.rb:141 - Resource temporarily unavailable - read would block
Exception `Errno::EAGAIN' at /opt/chef/embedded/lib/ruby/1.9.1/net/protocol.rb:141 - Resource temporarily unavailable - read would block
Exception `Errno::EAGAIN' at /opt/chef/embedded/lib/ruby/1.9.1/net/protocol.rb:141 - Resource temporarily unavailable - read would block
Exception `Errno::EAGAIN' at /opt/chef/embedded/lib/ruby/1.9.1/net/protocol.rb:141 - Resource temporarily unavailable - read would block
Exception `Errno::EAGAIN' at /opt/chef/embedded/lib/ruby/1.9.1/net/protocol.rb:141 - Resource temporarily unavailable - read would block
Exception `Errno::EAGAIN' at /opt/chef/embedded/lib/ruby/1.9.1/net/protocol.rb:141 - Resource temporarily unavailable - read would block
Exception `Errno::EAGAIN' at /opt/chef/embedded/lib/ruby/1.9.1/net/protocol.rb:141 - Resource temporarily unavailable - read would block
Exception `Errno::EAGAIN' at /opt/chef/embedded/lib/ruby/1.9.1/net/protocol.rb:141 - Resource temporarily unavailable - read would block
Exception `Errno::EAGAIN' at /opt/chef/embedded/lib/ruby/1.9.1/net/protocol.rb:141 - Resource temporarily unavailable - read would block
Exception `Errno::EAGAIN' at /opt/chef/embedded/lib/ruby/1.9.1/net/protocol.rb:141 - Resource temporarily unavailable - read would block
Exception `Errno::EAGAIN' at /opt/chef/embedded/lib/ruby/1.9.1/net/protocol.rb:141 - Resource temporarily unavailable - read would block
Exception `Errno::EAGAIN' at /opt/chef/embedded/lib/ruby/1.9.1/net/protocol.rb:141 - Resource temporarily unavailable - read would block
Exception `Errno::EAGAIN' at /opt/chef/embedded/lib/ruby/1.9.1/net/protocol.rb:141 - Resource temporarily unavailable - read would block
Exception `Errno::EAGAIN' at /opt/chef/embedded/lib/ruby/1.9.1/net/protocol.rb:141 - Resource temporarily unavailable - read would block
Exception `Errno::EAGAIN' at /opt/chef/embedded/lib/ruby/1.9.1/net/protocol.rb:141 - Resource temporarily unavailable - read would block
Exception `Errno::EAGAIN' at /opt/chef/embedded/lib/ruby/1.9.1/net/protocol.rb:141 - Resource temporarily unavailable - read would block
Exception `Errno::EAGAIN' at /opt/chef/embedded/lib/ruby/1.9.1/net/protocol.rb:141 - Resource temporarily unavailable - read would block
Exception `Errno::EAGAIN' at /opt/chef/embedded/lib/ruby/1.9.1/net/protocol.rb:141 - Resource temporarily unavailable - read would block
Exception `Errno::EAGAIN' at /opt/chef/embedded/lib/ruby/1.9.1/net/protocol.rb:141 - Resource temporarily unavailable - read would block
Exception `Errno::EAGAIN' at /opt/chef/embedded/lib/ruby/1.9.1/net/protocol.rb:141 - Resource temporarily unavailable - read would block
Exception `Errno::EAGAIN' at /opt/chef/embedded/lib/ruby/1.9.1/net/protocol.rb:141 - Resource temporarily unavailable - read would block
Exception `Errno::EAGAIN' at /opt/chef/embedded/lib/ruby/1.9.1/net/protocol.rb:141 - Resource temporarily unavailable - read would block
Exception `Errno::EAGAIN' at /opt/chef/embedded/lib/ruby/1.9.1/net/protocol.rb:141 - Resource temporarily unavailable - read would block
Exception `Errno::EAGAIN' at /opt/chef/embedded/lib/ruby/1.9.1/net/protocol.rb:141 - Resource temporarily unavailable - read would block
Exception `Errno::EAGAIN' at /opt/chef/embedded/lib/ruby/1.9.1/net/protocol.rb:141 - Resource temporarily unavailable - read would block
Exception `Errno::EEXIST' at /opt/chef/embedded/lib/ruby/1.9.1/fileutils.rb:247 - File exists - /root/.gem/specs/rubygems.org%80
Exception `NoMethodError' at /opt/chef/embedded/lib/ruby/site_ruby/1.9.1/rubygems/specification.rb:1495 - undefined method `to_ary' for #<Gem::Specification name=minitest-chef-handler version=1.0.1>
Exception `NoMethodError' at /opt/chef/embedded/lib/ruby/site_ruby/1.9.1/rubygems/specification.rb:1495 - undefined method `to_ary' for #<Gem::Specification name=puma version=1.6.3>
Exception `NoMethodError' at /opt/chef/embedded/lib/ruby/site_ruby/1.9.1/rubygems/specification.rb:1495 - undefined method `to_ary' for #<Gem::Specification name=hashie version=2.0.5>
Exception `NoMethodError' at /opt/chef/embedded/lib/ruby/site_ruby/1.9.1/rubygems/specification.rb:1495 - undefined method `to_ary' for #<Gem::Specification name=chef-zero version=1.6.2>
Exception `NoMethodError' at /opt/chef/embedded/lib/ruby/site_ruby/1.9.1/rubygems/specification.rb:1495 - undefined method `to_ary' for #<Gem::Specification name=puma version=1.6.2>
Exception `NoMethodError' at /opt/chef/embedded/lib/ruby/site_ruby/1.9.1/rubygems/specification.rb:1495 - undefined method `to_ary' for #<Gem::Specification name=puma version=1.6.1>
Exception `NoMethodError' at /opt/chef/embedded/lib/ruby/site_ruby/1.9.1/rubygems/specification.rb:1495 - undefined method `to_ary' for #<Gem::Specification name=puma version=1.6.0>
Exception `NoMethodError' at /opt/chef/embedded/lib/ruby/site_ruby/1.9.1/rubygems/specification.rb:1495 - undefined method `to_ary' for #<Gem::Specification name=hashie version=2.0.4>
Exception `NoMethodError' at /opt/chef/embedded/lib/ruby/site_ruby/1.9.1/rubygems/specification.rb:1495 - undefined method `to_ary' for #<Gem::Specification name=hashie version=2.0.3>
Exception `NoMethodError' at /opt/chef/embedded/lib/ruby/site_ruby/1.9.1/rubygems/specification.rb:1495 - undefined method `to_ary' for #<Gem::Specification name=hashie version=2.0.2>
Exception `NoMethodError' at /opt/chef/embedded/lib/ruby/site_ruby/1.9.1/rubygems/specification.rb:1495 - undefined method `to_ary' for #<Gem::Specification name=hashie version=2.0.1>
Exception `NoMethodError' at /opt/chef/embedded/lib/ruby/site_ruby/1.9.1/rubygems/specification.rb:1495 - undefined method `to_ary' for #<Gem::Specification name=hashie version=2.0.0>
Exception `NoMethodError' at /opt/chef/embedded/lib/ruby/site_ruby/1.9.1/rubygems/specification.rb:1495 - undefined method `to_ary' for #<Gem::Specification name=minitest-chef-handler version=1.0.1>
Exception `NoMethodError' at /opt/chef/embedded/lib/ruby/site_ruby/1.9.1/rubygems/specification.rb:1495 - undefined method `to_ary' for #<Gem::Specification name=puma version=1.6.3>
Exception `NoMethodError' at /opt/chef/embedded/lib/ruby/site_ruby/1.9.1/rubygems/specification.rb:1495 - undefined method `to_ary' for #<Gem::Specification name=hashie version=2.0.5>
Exception `NoMethodError' at /opt/chef/embedded/lib/ruby/site_ruby/1.9.1/rubygems/specification.rb:1495 - undefined method `to_ary' for #<Gem::Specification name=chef-zero version=1.6.2>
Exception `NoMethodError' at /opt/chef/embedded/lib/ruby/site_ruby/1.9.1/rubygems/specification.rb:1495 - undefined method `to_ary' for #<Gem::Specification name=puma version=1.6.2>
Exception `NoMethodError' at /opt/chef/embedded/lib/ruby/site_ruby/1.9.1/rubygems/specification.rb:1495 - undefined method `to_ary' for #<Gem::Specification name=puma version=1.6.1>
Exception `NoMethodError' at /opt/chef/embedded/lib/ruby/site_ruby/1.9.1/rubygems/specification.rb:1495 - undefined method `to_ary' for #<Gem::Specification name=puma version=1.6.0>
Exception `NoMethodError' at /opt/chef/embedded/lib/ruby/site_ruby/1.9.1/rubygems/specification.rb:1495 - undefined method `to_ary' for #<Gem::Specification name=hashie version=2.0.4>
Exception `NoMethodError' at /opt/chef/embedded/lib/ruby/site_ruby/1.9.1/rubygems/specification.rb:1495 - undefined method `to_ary' for #<Gem::Specification name=hashie version=2.0.3>
Exception `NoMethodError' at /opt/chef/embedded/lib/ruby/site_ruby/1.9.1/rubygems/specification.rb:1495 - undefined method `to_ary' for #<Gem::Specification name=hashie version=2.0.2>
Exception `NoMethodError' at /opt/chef/embedded/lib/ruby/site_ruby/1.9.1/rubygems/specification.rb:1495 - undefined method `to_ary' for #<Gem::Specification name=hashie version=2.0.1>
Exception `NoMethodError' at /opt/chef/embedded/lib/ruby/site_ruby/1.9.1/rubygems/specification.rb:1495 - undefined method `to_ary' for #<Gem::Specification name=hashie version=2.0.0>
Exception `Errno::EEXIST' at /opt/chef/embedded/lib/ruby/1.9.1/fileutils.rb:247 - File exists - /opt/chef/embedded/lib/ruby/gems/1.9.1
Exception `NoMethodError' at /opt/chef/embedded/lib/ruby/site_ruby/1.9.1/rubygems/package/tar_input.rb:57 - undefined method `readpartial' for #<Gem::Package::TarReader::Entry:0x00000004f7c5e8>
Exception `ArgumentError' at /opt/chef/embedded/lib/ruby/1.9.1/psych/scalar_scanner.rb:82 - invalid value for Float(): "1.6.3"
Exception `ArgumentError' at /opt/chef/embedded/lib/ruby/1.9.1/psych/scalar_scanner.rb:82 - invalid value for Float(): "0.8.0"
Exception `ArgumentError' at /opt/chef/embedded/lib/ruby/1.9.1/psych/scalar_scanner.rb:91 - invalid value for Integer(): "--main"
Exception `ArgumentError' at /opt/chef/embedded/lib/ruby/1.9.1/psych/scalar_scanner.rb:91 - invalid value for Integer(): ">="
Exception `ArgumentError' at /opt/chef/embedded/lib/ruby/1.9.1/psych/scalar_scanner.rb:82 - invalid value for Float(): "1.8.7"
Exception `ArgumentError' at /opt/chef/embedded/lib/ruby/1.9.1/psych/scalar_scanner.rb:82 - invalid value for Float(): "1.8.24"
Exception `NoMethodError' at /opt/chef/embedded/lib/ruby/site_ruby/1.9.1/rubygems/package/tar_input.rb:231 - undefined method `readpartial' for #<Gem::Package::TarReader::Entry:0x00000004f99f30>
Exception `NoMethodError' at /opt/chef/embedded/lib/ruby/site_ruby/1.9.1/rubygems/package/tar_reader.rb:71 - undefined method `seek' for #<Zlib::GzipReader:0x00000004f99eb8>
Exception `NoMethodError' at /opt/chef/embedded/lib/ruby/site_ruby/1.9.1/rubygems/package/tar_reader.rb:71 - undefined method `seek' for #<Zlib::GzipReader:0x00000004f99eb8>
Exception `NoMethodError' at /opt/chef/embedded/lib/ruby/site_ruby/1.9.1/rubygems/package/tar_reader.rb:71 - undefined method `seek' for #<Zlib::GzipReader:0x00000004f99eb8>
Exception `NoMethodError' at /opt/chef/embedded/lib/ruby/site_ruby/1.9.1/rubygems/package/tar_reader/entry.rb:126 - undefined method `readpartial' for #<Gem::Package::TarReader::Entry:0x00000004f99f30>
Exception `NoMethodError' at /opt/chef/embedded/lib/ruby/site_ruby/1.9.1/rubygems/package/tar_reader.rb:71 - undefined method `seek' for #<Zlib::GzipReader:0x00000004f99eb8>
Exception `NoMethodError' at /opt/chef/embedded/lib/ruby/site_ruby/1.9.1/rubygems/package/tar_reader.rb:71 - undefined method `seek' for #<Zlib::GzipReader:0x00000004f99eb8>
Exception `NoMethodError' at /opt/chef/embedded/lib/ruby/site_ruby/1.9.1/rubygems/package/tar_reader/entry.rb:126 - undefined method `readpartial' for #<Gem::Package::TarReader::Entry:0x00000004f99f30>
Exception `NoMethodError' at /opt/chef/embedded/lib/ruby/site_ruby/1.9.1/rubygems/package/tar_reader.rb:71 - undefined method `seek' for #<Zlib::GzipReader:0x00000004f99eb8>
Exception `NoMethodError' at /opt/chef/embedded/lib/ruby/site_ruby/1.9.1/rubygems/package/tar_reader/entry.rb:126 - undefined method `readpartial' for #<Gem::Package::TarReader::Entry:0x00000004f99f30>
Exception `NoMethodError' at /opt/chef/embedded/lib/ruby/site_ruby/1.9.1/rubygems/package/tar_reader.rb:71 - undefined method `seek' for #<Zlib::GzipReader:0x00000004f99eb8>
Exception `NoMethodError' at /opt/chef/embedded/lib/ruby/site_ruby/1.9.1/rubygems/package/tar_reader/entry.rb:126 - undefined method `readpartial' for #<Gem::Package::TarReader::Entry:0x00000004f99f30>
Exception `NoMethodError' at /opt/chef/embedded/lib/ruby/site_ruby/1.9.1/rubygems/package/tar_reader.rb:71 - undefined method `seek' for #<Zlib::GzipReader:0x00000004f99eb8>
Exception `NoMethodError' at /opt/chef/embedded/lib/ruby/site_ruby/1.9.1/rubygems/package/tar_reader.rb:71 - undefined method `seek' for #<Zlib::GzipReader:0x00000004f99eb8>
Exception `NoMethodError' at /opt/chef/embedded/lib/ruby/site_ruby/1.9.1/rubygems/package/tar_reader.rb:71 - undefined method `seek' for #<Zlib::GzipReader:0x00000004f99eb8>
Exception `NoMethodError' at /opt/chef/embedded/lib/ruby/site_ruby/1.9.1/rubygems/package/tar_reader.rb:71 - undefined method `seek' for #<Zlib::GzipReader:0x00000004f99eb8>
Exception `NoMethodError' at /opt/chef/embedded/lib/ruby/site_ruby/1.9.1/rubygems/package/tar_reader.rb:71 - undefined method `seek' for #<Zlib::GzipReader:0x00000004f99eb8>
Exception `NoMethodError' at /opt/chef/embedded/lib/ruby/site_ruby/1.9.1/rubygems/package/tar_reader/entry.rb:126 - undefined method `readpartial' for #<Gem::Package::TarReader::Entry:0x00000004f99f30>
Exception `NoMethodError' at /opt/chef/embedded/lib/ruby/site_ruby/1.9.1/rubygems/package/tar_reader.rb:71 - undefined method `seek' for #<Zlib::GzipReader:0x00000004f99eb8>
Exception `NoMethodError' at /opt/chef/embedded/lib/ruby/site_ruby/1.9.1/rubygems/package/tar_reader.rb:71 - undefined method `seek' for #<Zlib::GzipReader:0x00000004f99eb8>
Exception `NoMethodError' at /opt/chef/embedded/lib/ruby/site_ruby/1.9.1/rubygems/package/tar_reader/entry.rb:126 - undefined method `readpartial' for #<Gem::Package::TarReader::Entry:0x00000004f99f30>
Exception `NoMethodError' at /opt/chef/embedded/lib/ruby/site_ruby/1.9.1/rubygems/package/tar_reader.rb:71 - undefined method `seek' for #<Zlib::GzipReader:0x00000004f99eb8>
Exception `NoMethodError' at /opt/chef/embedded/lib/ruby/site_ruby/1.9.1/rubygems/package/tar_reader.rb:71 - undefined method `seek' for #<Zlib::GzipReader:0x00000004f99eb8>
Exception `NoMethodError' at /opt/chef/embedded/lib/ruby/site_ruby/1.9.1/rubygems/package/tar_reader.rb:71 - undefined method `seek' for #<Zlib::GzipReader:0x00000004f99eb8>
Exception `NoMethodError' at /opt/chef/embedded/lib/ruby/site_ruby/1.9.1/rubygems/package/tar_reader.rb:71 - undefined method `seek' for #<Zlib::GzipReader:0x00000004f99eb8>
Exception `NoMethodError' at /opt/chef/embedded/lib/ruby/site_ruby/1.9.1/rubygems/package/tar_reader.rb:71 - undefined method `seek' for #<Zlib::GzipReader:0x00000004f99eb8>
Exception `NoMethodError' at /opt/chef/embedded/lib/ruby/site_ruby/1.9.1/rubygems/package/tar_reader.rb:71 - undefined method `seek' for #<Zlib::GzipReader:0x00000004f99eb8>
Exception `NoMethodError' at /opt/chef/embedded/lib/ruby/site_ruby/1.9.1/rubygems/package/tar_reader.rb:71 - undefined method `seek' for #<Zlib::GzipReader:0x00000004f99eb8>
Exception `NoMethodError' at /opt/chef/embedded/lib/ruby/site_ruby/1.9.1/rubygems/package/tar_reader.rb:71 - undefined method `seek' for #<Zlib::GzipReader:0x00000004f99eb8>
Exception `NoMethodError' at /opt/chef/embedded/lib/ruby/site_ruby/1.9.1/rubygems/package/tar_reader.rb:71 - undefined method `seek' for #<Zlib::GzipReader:0x00000004f99eb8>
Exception `NoMethodError' at /opt/chef/embedded/lib/ruby/site_ruby/1.9.1/rubygems/package/tar_reader.rb:71 - undefined method `seek' for #<Zlib::GzipReader:0x00000004f99eb8>
Exception `NoMethodError' at /opt/chef/embedded/lib/ruby/site_ruby/1.9.1/rubygems/package/tar_reader/entry.rb:126 - undefined method `readpartial' for #<Gem::Package::TarReader::Entry:0x00000004f99f30>
Exception `NoMethodError' at /opt/chef/embedded/lib/ruby/site_ruby/1.9.1/rubygems/package/tar_reader/entry.rb:126 - undefined method `readpartial' for #<Gem::Package::TarReader::Entry:0x00000004f99f30>
Exception `NoMethodError' at /opt/chef/embedded/lib/ruby/site_ruby/1.9.1/rubygems/package/tar_reader.rb:71 - undefined method `seek' for #<Zlib::GzipReader:0x00000004f99eb8>
Exception `NoMethodError' at /opt/chef/embedded/lib/ruby/site_ruby/1.9.1/rubygems/package/tar_reader.rb:71 - undefined method `seek' for #<Zlib::GzipReader:0x00000004f99eb8>
Exception `NoMethodError' at /opt/chef/embedded/lib/ruby/site_ruby/1.9.1/rubygems/package/tar_reader/entry.rb:126 - undefined method `readpartial' for #<Gem::Package::TarReader::Entry:0x00000004f99f30>
Exception `NoMethodError' at /opt/chef/embedded/lib/ruby/site_ruby/1.9.1/rubygems/package/tar_reader.rb:71 - undefined method `seek' for #<Zlib::GzipReader:0x00000004f99eb8>
Exception `NoMethodError' at /opt/chef/embedded/lib/ruby/site_ruby/1.9.1/rubygems/package/tar_reader.rb:71 - undefined method `seek' for #<Zlib::GzipReader:0x00000004f99eb8>
Exception `NoMethodError' at /opt/chef/embedded/lib/ruby/site_ruby/1.9.1/rubygems/package/tar_reader.rb:71 - undefined method `seek' for #<Zlib::GzipReader:0x00000004f99eb8>
Exception `NoMethodError' at /opt/chef/embedded/lib/ruby/site_ruby/1.9.1/rubygems/package/tar_reader/entry.rb:126 - undefined method `readpartial' for #<Gem::Package::TarReader::Entry:0x00000004f99f30>
Exception `NoMethodError' at /opt/chef/embedded/lib/ruby/site_ruby/1.9.1/rubygems/package/tar_reader.rb:71 - undefined method `seek' for #<Zlib::GzipReader:0x00000004f99eb8>
Exception `NoMethodError' at /opt/chef/embedded/lib/ruby/site_ruby/1.9.1/rubygems/package/tar_reader/entry.rb:126 - undefined method `readpartial' for #<Gem::Package::TarReader::Entry:0x00000004f99f30>
Exception `NoMethodError' at /opt/chef/embedded/lib/ruby/site_ruby/1.9.1/rubygems/package/tar_reader/entry.rb:126 - undefined method `readpartial' for #<Gem::Package::TarReader::Entry:0x00000004f99f30>
Exception `NoMethodError' at /opt/chef/embedded/lib/ruby/site_ruby/1.9.1/rubygems/package/tar_reader.rb:71 - undefined method `seek' for #<Zlib::GzipReader:0x00000004f99eb8>
Exception `NoMethodError' at /opt/chef/embedded/lib/ruby/site_ruby/1.9.1/rubygems/package/tar_reader/entry.rb:126 - undefined method `readpartial' for #<Gem::Package::TarReader::Entry:0x00000004f99f30>
Exception `NoMethodError' at /opt/chef/embedded/lib/ruby/site_ruby/1.9.1/rubygems/package/tar_reader.rb:71 - undefined method `seek' for #<Zlib::GzipReader:0x00000004f99eb8>
Exception `NoMethodError' at /opt/chef/embedded/lib/ruby/site_ruby/1.9.1/rubygems/package/tar_reader.rb:71 - undefined method `seek' for #<Zlib::GzipReader:0x00000004f99eb8>
Exception `NoMethodError' at /opt/chef/embedded/lib/ruby/site_ruby/1.9.1/rubygems/package/tar_reader/entry.rb:126 - undefined method `readpartial' for #<Gem::Package::TarReader::Entry:0x00000004f99f30>
Exception `NoMethodError' at /opt/chef/embedded/lib/ruby/site_ruby/1.9.1/rubygems/package/tar_reader.rb:71 - undefined method `seek' for #<Zlib::GzipReader:0x00000004f99eb8>
Exception `NoMethodError' at /opt/chef/embedded/lib/ruby/site_ruby/1.9.1/rubygems/package/tar_reader/entry.rb:126 - undefined method `readpartial' for #<Gem::Package::TarReader::Entry:0x00000004f99f30>
Exception `NoMethodError' at /opt/chef/embedded/lib/ruby/site_ruby/1.9.1/rubygems/package/tar_reader.rb:71 - undefined method `seek' for #<Zlib::GzipReader:0x00000004f99eb8>
Exception `NoMethodError' at /opt/chef/embedded/lib/ruby/site_ruby/1.9.1/rubygems/package/tar_reader/entry.rb:126 - undefined method `readpartial' for #<Gem::Package::TarReader::Entry:0x00000004f99f30>
Exception `NoMethodError' at /opt/chef/embedded/lib/ruby/site_ruby/1.9.1/rubygems/package/tar_reader.rb:71 - undefined method `seek' for #<Zlib::GzipReader:0x00000004f99eb8>
Exception `NoMethodError' at /opt/chef/embedded/lib/ruby/site_ruby/1.9.1/rubygems/package/tar_reader.rb:71 - undefined method `seek' for #<Zlib::GzipReader:0x00000004f99eb8>
Exception `NoMethodError' at /opt/chef/embedded/lib/ruby/site_ruby/1.9.1/rubygems/package/tar_reader/entry.rb:126 - undefined method `readpartial' for #<Gem::Package::TarReader::Entry:0x00000004f99f30>
Exception `NoMethodError' at /opt/chef/embedded/lib/ruby/site_ruby/1.9.1/rubygems/package/tar_reader.rb:71 - undefined method `seek' for #<Zlib::GzipReader:0x00000004f99eb8>
Exception `NoMethodError' at /opt/chef/embedded/lib/ruby/site_ruby/1.9.1/rubygems/package/tar_reader/entry.rb:126 - undefined method `readpartial' for #<Gem::Package::TarReader::Entry:0x00000004f99f30>
Exception `NoMethodError' at /opt/chef/embedded/lib/ruby/site_ruby/1.9.1/rubygems/package/tar_reader.rb:71 - undefined method `seek' for #<Zlib::GzipReader:0x00000004f99eb8>
Exception `NoMethodError' at /opt/chef/embedded/lib/ruby/site_ruby/1.9.1/rubygems/package/tar_reader.rb:71 - undefined method `seek' for #<Zlib::GzipReader:0x00000004f99eb8>
Exception `NoMethodError' at /opt/chef/embedded/lib/ruby/site_ruby/1.9.1/rubygems/package/tar_reader.rb:71 - undefined method `seek' for #<Zlib::GzipReader:0x00000004f99eb8>
Exception `NoMethodError' at /opt/chef/embedded/lib/ruby/site_ruby/1.9.1/rubygems/package/tar_reader.rb:71 - undefined method `seek' for #<Zlib::GzipReader:0x00000004f99eb8>
Exception `NoMethodError' at /opt/chef/embedded/lib/ruby/site_ruby/1.9.1/rubygems/package/tar_reader.rb:71 - undefined method `seek' for #<Zlib::GzipReader:0x00000004f99eb8>
Exception `NoMethodError' at /opt/chef/embedded/lib/ruby/site_ruby/1.9.1/rubygems/package/tar_reader.rb:71 - undefined method `seek' for #<Zlib::GzipReader:0x00000004f99eb8>
Exception `NoMethodError' at /opt/chef/embedded/lib/ruby/site_ruby/1.9.1/rubygems/package/tar_reader/entry.rb:126 - undefined method `readpartial' for #<Gem::Package::TarReader::Entry:0x00000004f99f30>
Exception `NoMethodError' at /opt/chef/embedded/lib/ruby/site_ruby/1.9.1/rubygems/package/tar_reader.rb:71 - undefined method `seek' for #<Zlib::GzipReader:0x00000004f99eb8>
Exception `NoMethodError' at /opt/chef/embedded/lib/ruby/site_ruby/1.9.1/rubygems/package/tar_reader.rb:71 - undefined method `seek' for #<Zlib::GzipReader:0x00000004f99eb8>
Exception `NoMethodError' at /opt/chef/embedded/lib/ruby/site_ruby/1.9.1/rubygems/package/tar_reader/entry.rb:126 - undefined method `readpartial' for #<Gem::Package::TarReader::Entry:0x00000004f99f30>
Exception `NoMethodError' at /opt/chef/embedded/lib/ruby/site_ruby/1.9.1/rubygems/package/tar_reader/entry.rb:126 - undefined method `readpartial' for #<Gem::Package::TarReader::Entry:0x00000004f99f30>
Exception `NoMethodError' at /opt/chef/embedded/lib/ruby/site_ruby/1.9.1/rubygems/package/tar_reader.rb:71 - undefined method `seek' for #<Zlib::GzipReader:0x00000004f99eb8>
Exception `NoMethodError' at /opt/chef/embedded/lib/ruby/site_ruby/1.9.1/rubygems/package/tar_reader/entry.rb:126 - undefined method `readpartial' for #<Gem::Package::TarReader::Entry:0x00000004f99f30>
Exception `NoMethodError' at /opt/chef/embedded/lib/ruby/site_ruby/1.9.1/rubygems/package/tar_reader.rb:71 - undefined method `seek' for #<Zlib::GzipReader:0x00000004f99eb8>
Exception `NoMethodError' at /opt/chef/embedded/lib/ruby/site_ruby/1.9.1/rubygems/package/tar_reader.rb:71 - undefined method `seek' for #<Zlib::GzipReader:0x00000004f99eb8>
Exception `NoMethodError' at /opt/chef/embedded/lib/ruby/site_ruby/1.9.1/rubygems/package/tar_reader/entry.rb:126 - undefined method `readpartial' for #<Gem::Package::TarReader::Entry:0x00000004f99f30>
Exception `NoMethodError' at /opt/chef/embedded/lib/ruby/site_ruby/1.9.1/rubygems/package/tar_reader.rb:71 - undefined method `seek' for #<Zlib::GzipReader:0x00000004f99eb8>
Exception `NoMethodError' at /opt/chef/embedded/lib/ruby/site_ruby/1.9.1/rubygems/package/tar_reader.rb:71 - undefined method `seek' for #<Zlib::GzipReader:0x00000004f99eb8>
Exception `NoMethodError' at /opt/chef/embedded/lib/ruby/site_ruby/1.9.1/rubygems/package/tar_reader.rb:71 - undefined method `seek' for #<Zlib::GzipReader:0x00000004f99eb8>
Exception `NoMethodError' at /opt/chef/embedded/lib/ruby/site_ruby/1.9.1/rubygems/package/tar_reader.rb:71 - undefined method `seek' for #<Zlib::GzipReader:0x00000004f99eb8>
Exception `NoMethodError' at /opt/chef/embedded/lib/ruby/site_ruby/1.9.1/rubygems/package/tar_reader.rb:71 - undefined method `seek' for #<Zlib::GzipReader:0x00000004f99eb8>
Exception `NoMethodError' at /opt/chef/embedded/lib/ruby/site_ruby/1.9.1/rubygems/package/tar_reader.rb:71 - undefined method `seek' for #<Zlib::GzipReader:0x00000004f99eb8>
Exception `NoMethodError' at /opt/chef/embedded/lib/ruby/site_ruby/1.9.1/rubygems/package/tar_reader.rb:71 - undefined method `seek' for #<Zlib::GzipReader:0x00000004f99eb8>
Exception `NoMethodError' at /opt/chef/embedded/lib/ruby/site_ruby/1.9.1/rubygems/package/tar_reader.rb:71 - undefined method `seek' for #<Zlib::GzipReader:0x00000004f99eb8>
Exception `NoMethodError' at /opt/chef/embedded/lib/ruby/site_ruby/1.9.1/rubygems/package/tar_reader.rb:71 - undefined method `seek' for #<Zlib::GzipReader:0x00000004f99eb8>
Exception `NoMethodError' at /opt/chef/embedded/lib/ruby/site_ruby/1.9.1/rubygems/package/tar_reader/entry.rb:126 - undefined method `readpartial' for #<Gem::Package::TarReader::Entry:0x00000004f99f30>
Exception `NoMethodError' at /opt/chef/embedded/lib/ruby/site_ruby/1.9.1/rubygems/package/tar_reader.rb:71 - undefined method `seek' for #<Zlib::GzipReader:0x00000004f99eb8>
Exception `NoMethodError' at /opt/chef/embedded/lib/ruby/site_ruby/1.9.1/rubygems/package/tar_reader.rb:71 - undefined method `seek' for #<Zlib::GzipReader:0x00000004f99eb8>
Exception `NoMethodError' at /opt/chef/embedded/lib/ruby/site_ruby/1.9.1/rubygems/package/tar_reader.rb:71 - undefined method `seek' for #<Zlib::GzipReader:0x00000004f99eb8>
Exception `NoMethodError' at /opt/chef/embedded/lib/ruby/site_ruby/1.9.1/rubygems/package/tar_reader.rb:71 - undefined method `seek' for #<Zlib::GzipReader:0x00000004f99eb8>
Exception `NoMethodError' at /opt/chef/embedded/lib/ruby/site_ruby/1.9.1/rubygems/package/tar_reader.rb:71 - undefined method `seek' for #<Zlib::GzipReader:0x00000004f99eb8>
Exception `NoMethodError' at /opt/chef/embedded/lib/ruby/site_ruby/1.9.1/rubygems/package/tar_reader.rb:71 - undefined method `seek' for #<Zlib::GzipReader:0x00000004f99eb8>
Exception `NoMethodError' at /opt/chef/embedded/lib/ruby/site_ruby/1.9.1/rubygems/package/tar_reader/entry.rb:126 - undefined method `readpartial' for #<Gem::Package::TarReader::Entry:0x00000004f99f30>
Exception `NoMethodError' at /opt/chef/embedded/lib/ruby/site_ruby/1.9.1/rubygems/package/tar_reader.rb:71 - undefined method `seek' for #<Zlib::GzipReader:0x00000004f99eb8>
Exception `NoMethodError' at /opt/chef/embedded/lib/ruby/site_ruby/1.9.1/rubygems/package/tar_reader.rb:71 - undefined method `seek' for #<Zlib::GzipReader:0x00000004f99eb8>
Exception `NoMethodError' at /opt/chef/embedded/lib/ruby/site_ruby/1.9.1/rubygems/package/tar_reader.rb:71 - undefined method `seek' for #<Zlib::GzipReader:0x00000004f99eb8>
Exception `NoMethodError' at /opt/chef/embedded/lib/ruby/site_ruby/1.9.1/rubygems/package/tar_reader/entry.rb:126 - undefined method `readpartial' for #<Gem::Package::TarReader::Entry:0x00000004f99f30>
Exception `NoMethodError' at /opt/chef/embedded/lib/ruby/site_ruby/1.9.1/rubygems/package/tar_reader.rb:71 - undefined method `seek' for #<Zlib::GzipReader:0x00000004f99eb8>
Exception `NoMethodError' at /opt/chef/embedded/lib/ruby/site_ruby/1.9.1/rubygems/package/tar_reader.rb:71 - undefined method `seek' for #<Zlib::GzipReader:0x00000004f99eb8>
Exception `NoMethodError' at /opt/chef/embedded/lib/ruby/site_ruby/1.9.1/rubygems/package/tar_reader.rb:71 - undefined method `seek' for #<Zlib::GzipReader:0x00000004f99eb8>
Exception `NoMethodError' at /opt/chef/embedded/lib/ruby/site_ruby/1.9.1/rubygems/package/tar_reader.rb:71 - undefined method `seek' for #<Zlib::GzipReader:0x00000004f99eb8>
Exception `NoMethodError' at /opt/chef/embedded/lib/ruby/site_ruby/1.9.1/rubygems/package/tar_reader.rb:71 - undefined method `seek' for #<Zlib::GzipReader:0x00000004f99eb8>
Exception `NoMethodError' at /opt/chef/embedded/lib/ruby/site_ruby/1.9.1/rubygems/package/tar_reader/entry.rb:126 - undefined method `readpartial' for #<Gem::Package::TarReader::Entry:0x00000004f99f30>
Exception `NoMethodError' at /opt/chef/embedded/lib/ruby/site_ruby/1.9.1/rubygems/package/tar_reader.rb:71 - undefined method `seek' for #<Zlib::GzipReader:0x00000004f99eb8>
Exception `IOError' at /opt/chef/embedded/lib/ruby/site_ruby/1.9.1/rubygems/format.rb:45 - closed stream
Exception `Errno::ENOENT' at /opt/chef/embedded/lib/ruby/1.9.1/fileutils.rb:247 - No such file or directory - /opt/chef/embedded/lib/ruby/gems/1.9.1/gems/puma-1.6.3/examples/CA
Exception `Errno::ENOENT' at /opt/chef/embedded/lib/ruby/1.9.1/fileutils.rb:247 - No such file or directory -
Exception `Errno::EEXIST' at /opt/chef/embedded/lib/ruby/1.9.1/fileutils.rb:247 - File exists - /opt
Exception `Errno::EEXIST' at /opt/chef/embedded/lib/ruby/1.9.1/fileutils.rb:247 - File exists - /opt/chef
Exception `Errno::EEXIST' at /opt/chef/embedded/lib/ruby/1.9.1/fileutils.rb:247 - File exists - /opt/chef/embedded
Exception `Errno::EEXIST' at /opt/chef/embedded/lib/ruby/1.9.1/fileutils.rb:247 - File exists - /opt/chef/embedded/lib
Exception `Errno::EEXIST' at /opt/chef/embedded/lib/ruby/1.9.1/fileutils.rb:247 - File exists - /opt/chef/embedded/lib/ruby
Exception `Errno::EEXIST' at /opt/chef/embedded/lib/ruby/1.9.1/fileutils.rb:247 - File exists - /opt/chef/embedded/lib/ruby/gems
Exception `Errno::EEXIST' at /opt/chef/embedded/lib/ruby/1.9.1/fileutils.rb:247 - File exists - /opt/chef/embedded/lib/ruby/gems/1.9.1
Exception `Errno::EEXIST' at /opt/chef/embedded/lib/ruby/1.9.1/fileutils.rb:247 - File exists - /opt/chef/embedded/lib/ruby/gems/1.9.1/gems
Exception `Errno::EEXIST' at /opt/chef/embedded/lib/ruby/1.9.1/fileutils.rb:247 - File exists - /opt/chef/embedded/lib/ruby/gems/1.9.1/gems/puma-1.6.3
Exception `Errno::ENOENT' at /opt/chef/embedded/lib/ruby/1.9.1/fileutils.rb:247 - No such file or directory - /opt/chef/embedded/lib/ruby/gems/1.9.1/gems/puma-1.6.3/ext/puma_http11
Exception `Errno::ENOENT' at /opt/chef/embedded/lib/ruby/1.9.1/fileutils.rb:247 - No such file or directory -
Exception `Errno::EEXIST' at /opt/chef/embedded/lib/ruby/1.9.1/fileutils.rb:247 - File exists - /opt
Exception `Errno::EEXIST' at /opt/chef/embedded/lib/ruby/1.9.1/fileutils.rb:247 - File exists - /opt/chef
Exception `Errno::EEXIST' at /opt/chef/embedded/lib/ruby/1.9.1/fileutils.rb:247 - File exists - /opt/chef/embedded
Exception `Errno::EEXIST' at /opt/chef/embedded/lib/ruby/1.9.1/fileutils.rb:247 - File exists - /opt/chef/embedded/lib
Exception `Errno::EEXIST' at /opt/chef/embedded/lib/ruby/1.9.1/fileutils.rb:247 - File exists - /opt/chef/embedded/lib/ruby
Exception `Errno::EEXIST' at /opt/chef/embedded/lib/ruby/1.9.1/fileutils.rb:247 - File exists - /opt/chef/embedded/lib/ruby/gems
Exception `Errno::EEXIST' at /opt/chef/embedded/lib/ruby/1.9.1/fileutils.rb:247 - File exists - /opt/chef/embedded/lib/ruby/gems/1.9.1
Exception `Errno::EEXIST' at /opt/chef/embedded/lib/ruby/1.9.1/fileutils.rb:247 - File exists - /opt/chef/embedded/lib/ruby/gems/1.9.1/gems
Exception `Errno::EEXIST' at /opt/chef/embedded/lib/ruby/1.9.1/fileutils.rb:247 - File exists - /opt/chef/embedded/lib/ruby/gems/1.9.1/gems/puma-1.6.3
Exception `Errno::ENOENT' at /opt/chef/embedded/lib/ruby/1.9.1/fileutils.rb:247 - No such file or directory - /opt/chef/embedded/lib/ruby/gems/1.9.1/gems/puma-1.6.3/ext/puma_http11/org/jruby/puma
Exception `Errno::ENOENT' at /opt/chef/embedded/lib/ruby/1.9.1/fileutils.rb:247 - No such file or directory -
Exception `Errno::EEXIST' at /opt/chef/embedded/lib/ruby/1.9.1/fileutils.rb:247 - File exists - /opt
Exception `Errno::EEXIST' at /opt/chef/embedded/lib/ruby/1.9.1/fileutils.rb:247 - File exists - /opt/chef
Exception `Errno::EEXIST' at /opt/chef/embedded/lib/ruby/1.9.1/fileutils.rb:247 - File exists - /opt/chef/embedded
Exception `Errno::EEXIST' at /opt/chef/embedded/lib/ruby/1.9.1/fileutils.rb:247 - File exists - /opt/chef/embedded/lib
Exception `Errno::EEXIST' at /opt/chef/embedded/lib/ruby/1.9.1/fileutils.rb:247 - File exists - /opt/chef/embedded/lib/ruby
Exception `Errno::EEXIST' at /opt/chef/embedded/lib/ruby/1.9.1/fileutils.rb:247 - File exists - /opt/chef/embedded/lib/ruby/gems
Exception `Errno::EEXIST' at /opt/chef/embedded/lib/ruby/1.9.1/fileutils.rb:247 - File exists - /opt/chef/embedded/lib/ruby/gems/1.9.1
Exception `Errno::EEXIST' at /opt/chef/embedded/lib/ruby/1.9.1/fileutils.rb:247 - File exists - /opt/chef/embedded/lib/ruby/gems/1.9.1/gems
Exception `Errno::EEXIST' at /opt/chef/embedded/lib/ruby/1.9.1/fileutils.rb:247 - File exists - /opt/chef/embedded/lib/ruby/gems/1.9.1/gems/puma-1.6.3
Exception `Errno::EEXIST' at /opt/chef/embedded/lib/ruby/1.9.1/fileutils.rb:247 - File exists - /opt/chef/embedded/lib/ruby/gems/1.9.1/gems/puma-1.6.3/ext
Exception `Errno::EEXIST' at /opt/chef/embedded/lib/ruby/1.9.1/fileutils.rb:247 - File exists - /opt/chef/embedded/lib/ruby/gems/1.9.1/gems/puma-1.6.3/ext/puma_http11
Exception `Errno::ENOENT' at /opt/chef/embedded/lib/ruby/1.9.1/fileutils.rb:247 - No such file or directory - /opt/chef/embedded/lib/ruby/gems/1.9.1/gems/puma-1.6.3/lib/puma/app
Exception `Errno::ENOENT' at /opt/chef/embedded/lib/ruby/1.9.1/fileutils.rb:247 - No such file or directory -
Exception `Errno::EEXIST' at /opt/chef/embedded/lib/ruby/1.9.1/fileutils.rb:247 - File exists - /opt
Exception `Errno::EEXIST' at /opt/chef/embedded/lib/ruby/1.9.1/fileutils.rb:247 - File exists - /opt/chef
Exception `Errno::EEXIST' at /opt/chef/embedded/lib/ruby/1.9.1/fileutils.rb:247 - File exists - /opt/chef/embedded
Exception `Errno::EEXIST' at /opt/chef/embedded/lib/ruby/1.9.1/fileutils.rb:247 - File exists - /opt/chef/embedded/lib
Exception `Errno::EEXIST' at /opt/chef/embedded/lib/ruby/1.9.1/fileutils.rb:247 - File exists - /opt/chef/embedded/lib/ruby
Exception `Errno::EEXIST' at /opt/chef/embedded/lib/ruby/1.9.1/fileutils.rb:247 - File exists - /opt/chef/embedded/lib/ruby/gems
Exception `Errno::EEXIST' at /opt/chef/embedded/lib/ruby/1.9.1/fileutils.rb:247 - File exists - /opt/chef/embedded/lib/ruby/gems/1.9.1
Exception `Errno::EEXIST' at /opt/chef/embedded/lib/ruby/1.9.1/fileutils.rb:247 - File exists - /opt/chef/embedded/lib/ruby/gems/1.9.1/gems
Exception `Errno::EEXIST' at /opt/chef/embedded/lib/ruby/1.9.1/fileutils.rb:247 - File exists - /opt/chef/embedded/lib/ruby/gems/1.9.1/gems/puma-1.6.3
Exception `Errno::EEXIST' at /opt/chef/embedded/lib/ruby/1.9.1/fileutils.rb:247 - File exists - /opt/chef/embedded/lib/ruby/gems/1.9.1/gems/puma-1.6.3/lib
Exception `Errno::ENOENT' at /opt/chef/embedded/lib/ruby/1.9.1/fileutils.rb:247 - No such file or directory - /opt/chef/embedded/lib/ruby/gems/1.9.1/gems/puma-1.6.3/lib/rack/handler
Exception `Errno::ENOENT' at /opt/chef/embedded/lib/ruby/1.9.1/fileutils.rb:247 - No such file or directory -
Exception `Errno::EEXIST' at /opt/chef/embedded/lib/ruby/1.9.1/fileutils.rb:247 - File exists - /opt
Exception `Errno::EEXIST' at /opt/chef/embedded/lib/ruby/1.9.1/fileutils.rb:247 - File exists - /opt/chef
Exception `Errno::EEXIST' at /opt/chef/embedded/lib/ruby/1.9.1/fileutils.rb:247 - File exists - /opt/chef/embedded
Exception `Errno::EEXIST' at /opt/chef/embedded/lib/ruby/1.9.1/fileutils.rb:247 - File exists - /opt/chef/embedded/lib
Exception `Errno::EEXIST' at /opt/chef/embedded/lib/ruby/1.9.1/fileutils.rb:247 - File exists - /opt/chef/embedded/lib/ruby
Exception `Errno::EEXIST' at /opt/chef/embedded/lib/ruby/1.9.1/fileutils.rb:247 - File exists - /opt/chef/embedded/lib/ruby/gems
Exception `Errno::EEXIST' at /opt/chef/embedded/lib/ruby/1.9.1/fileutils.rb:247 - File exists - /opt/chef/embedded/lib/ruby/gems/1.9.1
Exception `Errno::EEXIST' at /opt/chef/embedded/lib/ruby/1.9.1/fileutils.rb:247 - File exists - /opt/chef/embedded/lib/ruby/gems/1.9.1/gems
Exception `Errno::EEXIST' at /opt/chef/embedded/lib/ruby/1.9.1/fileutils.rb:247 - File exists - /opt/chef/embedded/lib/ruby/gems/1.9.1/gems/puma-1.6.3
Exception `Errno::EEXIST' at /opt/chef/embedded/lib/ruby/1.9.1/fileutils.rb:247 - File exists - /opt/chef/embedded/lib/ruby/gems/1.9.1/gems/puma-1.6.3/lib
Building native extensions. This could take a while...
Exception `Gem::InstallError' at /opt/chef/embedded/lib/ruby/site_ruby/1.9.1/rubygems/ext/builder.rb:37 - make failed:
["/opt/chef/embedded/bin/ruby extconf.rb", "creating Makefile\n", "make", "compiling puma_http11.c\nmake: gcc: Command not found\nmake: *** [puma_http11.o] Error 127\n"]
Exception `Gem::Installer::ExtensionBuildError' at /opt/chef/embedded/lib/ruby/site_ruby/1.9.1/rubygems/installer.rb:556 - ERROR: Failed to build gem native extension.
/opt/chef/embedded/bin/ruby extconf.rb
creating Makefile
make
compiling puma_http11.c
make: gcc: Command not found
make: *** [puma_http11.o] Error 127
Gem files will remain installed in /opt/chef/embedded/lib/ruby/gems/1.9.1/gems/puma-1.6.3 for inspection.
Results logged to /opt/chef/embedded/lib/ruby/gems/1.9.1/gems/puma-1.6.3/ext/puma_http11/gem_make.out
ERROR: Error installing minitest-chef-handler:
ERROR: Failed to build gem native extension.
/opt/chef/embedded/bin/ruby extconf.rb
creating Makefile
make
compiling puma_http11.c
make: gcc: Command not found
make: *** [puma_http11.o] Error 127
Gem files will remain installed in /opt/chef/embedded/lib/ruby/gems/1.9.1/gems/puma-1.6.3 for inspection.
Results logged to /opt/chef/embedded/lib/ruby/gems/1.9.1/gems/puma-1.6.3/ext/puma_http11/gem_make.out
Sign up for free to join this conversation on GitHub. Already have an account? Sign in to comment
You can’t perform that action at this time.