Skip to content

Instantly share code, notes, and snippets.

Embed
What would you like to do?
zfs 0.8.1 dkms build - ERROR (dkms apport): kernel package linux-headers-5.3.0-050300-lowlatency is not supported
Building module:
cleaning build area...
make -j12 KERNELRELEASE=5.3.0-050300-lowlatency...(bad exit status: 2)
ERROR (dkms apport): kernel package linux-headers-5.3.0-050300-lowlatency is not supported
Error! Bad return status for module build on kernel: 5.3.0-050300-lowlatency (x86_64)
Consult /var/lib/dkms/zfs/0.8.1/build/make.log for more information.
[id:~/.shadow/copy/etc] $ cat /var/lib/dkms/zfs/0.8.1/build/make.log
DKMS make.log for zfs-0.8.1 for kernel 5.3.0-050300-lowlatency (x86_64)
Thu 19 Sep 19:20:58 BST 2019
./scripts/make_gitrev.sh
make: [Makefile:1546: gitrev] Error 128 (ignored)
make all-recursive
make[1]: Entering directory '/var/lib/dkms/zfs/0.8.1/build'
Making all in include
make[2]: Entering directory '/var/lib/dkms/zfs/0.8.1/build/include'
Making all in linux
make[3]: Entering directory '/var/lib/dkms/zfs/0.8.1/build/include/linux'
make[3]: Nothing to be done for 'all'.
make[3]: Leaving directory '/var/lib/dkms/zfs/0.8.1/build/include/linux'
Making all in spl
make[3]: Entering directory '/var/lib/dkms/zfs/0.8.1/build/include/spl'
Making all in rpc
make[4]: Entering directory '/var/lib/dkms/zfs/0.8.1/build/include/spl/rpc'
make[4]: Nothing to be done for 'all'.
make[4]: Leaving directory '/var/lib/dkms/zfs/0.8.1/build/include/spl/rpc'
Making all in sys
make[4]: Entering directory '/var/lib/dkms/zfs/0.8.1/build/include/spl/sys'
make[4]: Nothing to be done for 'all'.
make[4]: Leaving directory '/var/lib/dkms/zfs/0.8.1/build/include/spl/sys'
make[4]: Entering directory '/var/lib/dkms/zfs/0.8.1/build/include/spl'
make[4]: Nothing to be done for 'all-am'.
make[4]: Leaving directory '/var/lib/dkms/zfs/0.8.1/build/include/spl'
make[3]: Leaving directory '/var/lib/dkms/zfs/0.8.1/build/include/spl'
Making all in sys
make[3]: Entering directory '/var/lib/dkms/zfs/0.8.1/build/include/sys'
Making all in fm
make[4]: Entering directory '/var/lib/dkms/zfs/0.8.1/build/include/sys/fm'
Making all in fs
make[5]: Entering directory '/var/lib/dkms/zfs/0.8.1/build/include/sys/fm/fs'
make[5]: Nothing to be done for 'all'.
make[5]: Leaving directory '/var/lib/dkms/zfs/0.8.1/build/include/sys/fm/fs'
make[5]: Entering directory '/var/lib/dkms/zfs/0.8.1/build/include/sys/fm'
make[5]: Nothing to be done for 'all-am'.
make[5]: Leaving directory '/var/lib/dkms/zfs/0.8.1/build/include/sys/fm'
make[4]: Leaving directory '/var/lib/dkms/zfs/0.8.1/build/include/sys/fm'
Making all in fs
make[4]: Entering directory '/var/lib/dkms/zfs/0.8.1/build/include/sys/fs'
make[4]: Nothing to be done for 'all'.
make[4]: Leaving directory '/var/lib/dkms/zfs/0.8.1/build/include/sys/fs'
Making all in crypto
make[4]: Entering directory '/var/lib/dkms/zfs/0.8.1/build/include/sys/crypto'
make[4]: Nothing to be done for 'all'.
make[4]: Leaving directory '/var/lib/dkms/zfs/0.8.1/build/include/sys/crypto'
Making all in lua
make[4]: Entering directory '/var/lib/dkms/zfs/0.8.1/build/include/sys/lua'
make[4]: Nothing to be done for 'all'.
make[4]: Leaving directory '/var/lib/dkms/zfs/0.8.1/build/include/sys/lua'
Making all in sysevent
make[4]: Entering directory '/var/lib/dkms/zfs/0.8.1/build/include/sys/sysevent'
make[4]: Nothing to be done for 'all'.
make[4]: Leaving directory '/var/lib/dkms/zfs/0.8.1/build/include/sys/sysevent'
make[4]: Entering directory '/var/lib/dkms/zfs/0.8.1/build/include/sys'
make[4]: Nothing to be done for 'all-am'.
make[4]: Leaving directory '/var/lib/dkms/zfs/0.8.1/build/include/sys'
make[3]: Leaving directory '/var/lib/dkms/zfs/0.8.1/build/include/sys'
make[3]: Entering directory '/var/lib/dkms/zfs/0.8.1/build/include'
make[3]: Nothing to be done for 'all-am'.
make[3]: Leaving directory '/var/lib/dkms/zfs/0.8.1/build/include'
make[2]: Leaving directory '/var/lib/dkms/zfs/0.8.1/build/include'
Making all in rpm
make[2]: Entering directory '/var/lib/dkms/zfs/0.8.1/build/rpm'
Making all in generic
make[3]: Entering directory '/var/lib/dkms/zfs/0.8.1/build/rpm/generic'
make[3]: Nothing to be done for 'all'.
make[3]: Leaving directory '/var/lib/dkms/zfs/0.8.1/build/rpm/generic'
Making all in redhat
make[3]: Entering directory '/var/lib/dkms/zfs/0.8.1/build/rpm/redhat'
make[3]: Nothing to be done for 'all'.
make[3]: Leaving directory '/var/lib/dkms/zfs/0.8.1/build/rpm/redhat'
make[3]: Entering directory '/var/lib/dkms/zfs/0.8.1/build/rpm'
make[3]: Nothing to be done for 'all-am'.
make[3]: Leaving directory '/var/lib/dkms/zfs/0.8.1/build/rpm'
make[2]: Leaving directory '/var/lib/dkms/zfs/0.8.1/build/rpm'
Making all in module
make[2]: Entering directory '/var/lib/dkms/zfs/0.8.1/build/module'
list='icp lua'; for targetdir in $list; do \
make -C $targetdir; \
done
make[3]: Entering directory '/var/lib/dkms/zfs/0.8.1/build/module/icp'
mkdir -p api core spi io os algs algs/aes algs/edonr algs/modes algs/sha1 algs/sha2 algs/skein asm-x86_64 asm-x86_64/aes asm-x86_64/modes asm-x86_64/sha1 asm-x86_64/sha2 asm-i386 asm-generic
make[3]: Leaving directory '/var/lib/dkms/zfs/0.8.1/build/module/icp'
make[3]: Entering directory '/var/lib/dkms/zfs/0.8.1/build/module/lua'
mkdir -p setjmp
make[3]: Leaving directory '/var/lib/dkms/zfs/0.8.1/build/module/lua'
make -C /lib/modules/5.3.0-050300-lowlatency/build M=`pwd` CONFIG_ZFS=m modules
make[3]: Entering directory '/usr/src/linux-headers-5.3.0-050300-lowlatency'
scripts/Makefile.build:57: '/var/lib/dkms/zfs/0.8.1/build/module/lua/zlua.ko' will not be built even though obj-m is specified.
scripts/Makefile.build:58: You cannot use subdir-y/m to visit a module Makefile. Use obj-y/m instead.
scripts/Makefile.build:57: '/var/lib/dkms/zfs/0.8.1/build/module/nvpair/znvpair.ko' will not be built even though obj-m is specified.
scripts/Makefile.build:58: You cannot use subdir-y/m to visit a module Makefile. Use obj-y/m instead.
scripts/Makefile.build:57: '/var/lib/dkms/zfs/0.8.1/build/module/spl/spl.ko' will not be built even though obj-m is specified.
scripts/Makefile.build:58: You cannot use subdir-y/m to visit a module Makefile. Use obj-y/m instead.
scripts/Makefile.build:57: '/var/lib/dkms/zfs/0.8.1/build/module/unicode/zunicode.ko' will not be built even though obj-m is specified.
scripts/Makefile.build:58: You cannot use subdir-y/m to visit a module Makefile. Use obj-y/m instead.
scripts/Makefile.build:57: '/var/lib/dkms/zfs/0.8.1/build/module/avl/zavl.ko' will not be built even though obj-m is specified.
scripts/Makefile.build:58: You cannot use subdir-y/m to visit a module Makefile. Use obj-y/m instead.
scripts/Makefile.build:57: '/var/lib/dkms/zfs/0.8.1/build/module/icp/icp.ko' will not be built even though obj-m is specified.
scripts/Makefile.build:58: You cannot use subdir-y/m to visit a module Makefile. Use obj-y/m instead.
CC [M] /var/lib/dkms/zfs/0.8.1/build/module/nvpair/nvpair.o
CC [M] /var/lib/dkms/zfs/0.8.1/build/module/nvpair/fnvpair.o
CC [M] /var/lib/dkms/zfs/0.8.1/build/module/unicode/u8_textprep.o
CC [M] /var/lib/dkms/zfs/0.8.1/build/module/lua/lapi.o
CC [M] /var/lib/dkms/zfs/0.8.1/build/module/unicode/uconv.o
CC [M] /var/lib/dkms/zfs/0.8.1/build/module/spl/spl-atomic.o
CC [M] /var/lib/dkms/zfs/0.8.1/build/module/lua/lauxlib.o
CC [M] /var/lib/dkms/zfs/0.8.1/build/module/avl/avl.o
scripts/Makefile.build:57: '/var/lib/dkms/zfs/0.8.1/build/module/zfs/zfs.ko' will not be built even though obj-m is specified.
scripts/Makefile.build:58: You cannot use subdir-y/m to visit a module Makefile. Use obj-y/m instead.
scripts/Makefile.build:57: '/var/lib/dkms/zfs/0.8.1/build/module/zcommon/zcommon.ko' will not be built even though obj-m is specified.
scripts/Makefile.build:58: You cannot use subdir-y/m to visit a module Makefile. Use obj-y/m instead.
CC [M] /var/lib/dkms/zfs/0.8.1/build/module/lua/lbaselib.o
CC [M] /var/lib/dkms/zfs/0.8.1/build/module/zcommon/zfeature_common.o
CC [M] /var/lib/dkms/zfs/0.8.1/build/module/icp/illumos-crypto.o
CC [M] /var/lib/dkms/zfs/0.8.1/build/module/zfs/abd.o
CC [M] /var/lib/dkms/zfs/0.8.1/build/module/spl/spl-condvar.o
CC [M] /var/lib/dkms/zfs/0.8.1/build/module/zcommon/zfs_comutil.o
LD [M] /var/lib/dkms/zfs/0.8.1/build/module/avl/zavl.o
In file included from /var/lib/dkms/zfs/0.8.1/build/include/spl/sys/taskq.h:35,
from /var/lib/dkms/zfs/0.8.1/build/include/spl/sys/kmem_cache.h:28,
from /var/lib/dkms/zfs/0.8.1/build/include/sys/zfs_context.h:41,
from /var/lib/dkms/zfs/0.8.1/build/include/sys/lua/lua.h:13,
from /var/lib/dkms/zfs/0.8.1/build/module/lua/lapi.c:12:
/var/lib/dkms/zfs/0.8.1/build/include/spl/sys/rwlock.h: In function ‘rw_owner’:
/var/lib/dkms/zfs/0.8.1/build/include/spl/sys/rwlock.h:121:18: error: incompatible types when returning type ‘atomic_long_t’ {aka ‘struct <anonymous>’} but ‘kthread_t *’ {aka ‘struct task_struct *’} was expected
return (SEM(rwp)->owner);
~~~~~~~~~^~~~~~~~
/var/lib/dkms/zfs/0.8.1/build/include/spl/sys/rwlock.h: In function ‘RW_READ_HELD’:
/var/lib/dkms/zfs/0.8.1/build/include/spl/sys/rwlock.h:199:26: warning: comparison between pointer and integer
if (RWSEM_OWNER_UNKNOWN == (struct task_struct *)-2L) {
^~
/var/lib/dkms/zfs/0.8.1/build/include/spl/sys/rwlock.h:201:3: error: aggregate value used where an integer was expected
return ((unsigned long) SEM(rwp)->owner & 1);
^~~~~~
CC [M] /var/lib/dkms/zfs/0.8.1/build/module/spl/spl-cred.o
In file included from /var/lib/dkms/zfs/0.8.1/build/include/spl/sys/taskq.h:35,
from /var/lib/dkms/zfs/0.8.1/build/include/spl/sys/kmem_cache.h:28,
from /var/lib/dkms/zfs/0.8.1/build/include/sys/zfs_context.h:41,
from /var/lib/dkms/zfs/0.8.1/build/include/sys/lua/lua.h:13,
from /var/lib/dkms/zfs/0.8.1/build/module/lua/lauxlib.c:16:
/var/lib/dkms/zfs/0.8.1/build/include/spl/sys/rwlock.h: In function ‘rw_owner’:
/var/lib/dkms/zfs/0.8.1/build/include/spl/sys/rwlock.h:121:18: error: incompatible types when returning type ‘atomic_long_t’ {aka ‘struct <anonymous>’} but ‘kthread_t *’ {aka ‘struct task_struct *’} was expected
return (SEM(rwp)->owner);
~~~~~~~~~^~~~~~~~
/var/lib/dkms/zfs/0.8.1/build/include/spl/sys/rwlock.h: In function ‘RW_READ_HELD’:
/var/lib/dkms/zfs/0.8.1/build/include/spl/sys/rwlock.h:199:26: warning: comparison between pointer and integer
if (RWSEM_OWNER_UNKNOWN == (struct task_struct *)-2L) {
^~
/var/lib/dkms/zfs/0.8.1/build/include/spl/sys/rwlock.h:201:3: error: aggregate value used where an integer was expected
return ((unsigned long) SEM(rwp)->owner & 1);
^~~~~~
In file included from /var/lib/dkms/zfs/0.8.1/build/include/spl/sys/taskq.h:35,
from /var/lib/dkms/zfs/0.8.1/build/include/spl/sys/kmem_cache.h:28,
from /var/lib/dkms/zfs/0.8.1/build/include/sys/zfs_context.h:41,
from /var/lib/dkms/zfs/0.8.1/build/include/sys/crypto/common.h:39,
from /var/lib/dkms/zfs/0.8.1/build/module/icp/illumos-crypto.c:35:
/var/lib/dkms/zfs/0.8.1/build/include/spl/sys/rwlock.h: In function ‘rw_owner’:
/var/lib/dkms/zfs/0.8.1/build/include/spl/sys/rwlock.h:121:18: error: incompatible types when returning type ‘atomic_long_t’ {aka ‘struct <anonymous>’} but ‘kthread_t *’ {aka ‘struct task_struct *’} was expected
return (SEM(rwp)->owner);
~~~~~~~~~^~~~~~~~
/var/lib/dkms/zfs/0.8.1/build/include/spl/sys/rwlock.h: In function ‘RW_READ_HELD’:
/var/lib/dkms/zfs/0.8.1/build/include/spl/sys/rwlock.h:199:26: warning: comparison between pointer and integer
if (RWSEM_OWNER_UNKNOWN == (struct task_struct *)-2L) {
^~
/var/lib/dkms/zfs/0.8.1/build/include/spl/sys/rwlock.h:201:3: error: aggregate value used where an integer was expected
return ((unsigned long) SEM(rwp)->owner & 1);
^~~~~~
In file included from /var/lib/dkms/zfs/0.8.1/build/include/spl/sys/taskq.h:35,
from /var/lib/dkms/zfs/0.8.1/build/include/spl/sys/kmem_cache.h:28,
from /var/lib/dkms/zfs/0.8.1/build/include/sys/zfs_context.h:41,
from /var/lib/dkms/zfs/0.8.1/build/include/sys/refcount.h:31,
from /var/lib/dkms/zfs/0.8.1/build/include/sys/abd.h:31,
from /var/lib/dkms/zfs/0.8.1/build/module/zfs/abd.c:117:
/var/lib/dkms/zfs/0.8.1/build/include/spl/sys/rwlock.h: In function ‘rw_owner’:
/var/lib/dkms/zfs/0.8.1/build/include/spl/sys/rwlock.h:121:18: error: incompatible types when returning type ‘atomic_long_t’ {aka ‘struct <anonymous>’} but ‘kthread_t *’ {aka ‘struct task_struct *’} was expected
return (SEM(rwp)->owner);
~~~~~~~~~^~~~~~~~
/var/lib/dkms/zfs/0.8.1/build/include/spl/sys/rwlock.h: In function ‘RW_READ_HELD’:
/var/lib/dkms/zfs/0.8.1/build/include/spl/sys/rwlock.h:199:26: warning: comparison between pointer and integer
if (RWSEM_OWNER_UNKNOWN == (struct task_struct *)-2L) {
^~
/var/lib/dkms/zfs/0.8.1/build/include/spl/sys/rwlock.h:201:3: error: aggregate value used where an integer was expected
return ((unsigned long) SEM(rwp)->owner & 1);
^~~~~~
In file included from /var/lib/dkms/zfs/0.8.1/build/include/spl/sys/taskq.h:35,
from /var/lib/dkms/zfs/0.8.1/build/include/spl/sys/kmem_cache.h:28,
from /var/lib/dkms/zfs/0.8.1/build/include/sys/zfs_context.h:41,
from /var/lib/dkms/zfs/0.8.1/build/include/sys/lua/lua.h:13,
from /var/lib/dkms/zfs/0.8.1/build/module/lua/lbaselib.c:23:
/var/lib/dkms/zfs/0.8.1/build/include/spl/sys/rwlock.h: In function ‘rw_owner’:
/var/lib/dkms/zfs/0.8.1/build/include/spl/sys/rwlock.h:121:18: error: incompatible types when returning type ‘atomic_long_t’ {aka ‘struct <anonymous>’} but ‘kthread_t *’ {aka ‘struct task_struct *’} was expected
return (SEM(rwp)->owner);
~~~~~~~~~^~~~~~~~
/var/lib/dkms/zfs/0.8.1/build/include/spl/sys/rwlock.h: In function ‘RW_READ_HELD’:
/var/lib/dkms/zfs/0.8.1/build/include/spl/sys/rwlock.h:199:26: warning: comparison between pointer and integer
if (RWSEM_OWNER_UNKNOWN == (struct task_struct *)-2L) {
^~
/var/lib/dkms/zfs/0.8.1/build/include/spl/sys/rwlock.h:201:3: error: aggregate value used where an integer was expected
return ((unsigned long) SEM(rwp)->owner & 1);
^~~~~~
make[5]: *** [scripts/Makefile.build:281: /var/lib/dkms/zfs/0.8.1/build/module/lua/lauxlib.o] Error 1
make[5]: *** Waiting for unfinished jobs....
CC [M] /var/lib/dkms/zfs/0.8.1/build/module/spl/spl-err.o
make[5]: *** [scripts/Makefile.build:281: /var/lib/dkms/zfs/0.8.1/build/module/lua/lapi.o] Error 1
CC [M] /var/lib/dkms/zfs/0.8.1/build/module/spl/spl-generic.o
make[5]: *** [scripts/Makefile.build:281: /var/lib/dkms/zfs/0.8.1/build/module/icp/illumos-crypto.o] Error 1
make[5]: *** [scripts/Makefile.build:281: /var/lib/dkms/zfs/0.8.1/build/module/lua/lbaselib.o] Error 1
make[4]: *** [scripts/Makefile.build:497: /var/lib/dkms/zfs/0.8.1/build/module/icp] Error 2
make[4]: *** Waiting for unfinished jobs....
make[4]: *** [scripts/Makefile.build:497: /var/lib/dkms/zfs/0.8.1/build/module/lua] Error 2
CC [M] /var/lib/dkms/zfs/0.8.1/build/module/zcommon/zfs_deleg.o
CC [M] /var/lib/dkms/zfs/0.8.1/build/module/nvpair/nvpair_alloc_spl.o
/var/lib/dkms/zfs/0.8.1/build/module/zfs/abd.c: In function ‘abd_raidz_gen_iterate’:
/var/lib/dkms/zfs/0.8.1/build/module/zfs/abd.c:1372:9: warning: this statement may fall through [-Wimplicit-fallthrough=]
len = MIN(caiters[2].iter_mapsize, len);
/var/lib/dkms/zfs/0.8.1/build/module/zfs/abd.c:1373:4: note: here
case 2:
^~~~
/var/lib/dkms/zfs/0.8.1/build/module/zfs/abd.c:1374:9: warning: this statement may fall through [-Wimplicit-fallthrough=]
len = MIN(caiters[1].iter_mapsize, len);
/var/lib/dkms/zfs/0.8.1/build/module/zfs/abd.c:1375:4: note: here
case 1:
^~~~
/var/lib/dkms/zfs/0.8.1/build/module/zfs/abd.c: In function ‘abd_raidz_rec_iterate’:
/var/lib/dkms/zfs/0.8.1/build/module/zfs/abd.c:1463:9: warning: this statement may fall through [-Wimplicit-fallthrough=]
len = MIN(citers[2].iter_mapsize, len);
/var/lib/dkms/zfs/0.8.1/build/module/zfs/abd.c:1464:4: note: here
case 2:
^~~~
/var/lib/dkms/zfs/0.8.1/build/module/zfs/abd.c:1466:9: warning: this statement may fall through [-Wimplicit-fallthrough=]
len = MIN(citers[1].iter_mapsize, len);
/var/lib/dkms/zfs/0.8.1/build/module/zfs/abd.c:1467:4: note: here
case 1:
^~~~
make[5]: *** [scripts/Makefile.build:281: /var/lib/dkms/zfs/0.8.1/build/module/zfs/abd.o] Error 1
make[4]: *** [scripts/Makefile.build:497: /var/lib/dkms/zfs/0.8.1/build/module/zfs] Error 2
CC [M] /var/lib/dkms/zfs/0.8.1/build/module/nvpair/nvpair_alloc_fixed.o
CC [M] /var/lib/dkms/zfs/0.8.1/build/module/zcommon/zfs_fletcher.o
CC [M] /var/lib/dkms/zfs/0.8.1/build/module/spl/spl-kmem.o
CC [M] /var/lib/dkms/zfs/0.8.1/build/module/zcommon/zfs_fletcher_superscalar.o
In file included from /var/lib/dkms/zfs/0.8.1/build/include/spl/sys/taskq.h:35,
from /var/lib/dkms/zfs/0.8.1/build/include/spl/sys/kmem_cache.h:28,
from /var/lib/dkms/zfs/0.8.1/build/include/sys/zfs_context.h:41,
from /var/lib/dkms/zfs/0.8.1/build/include/sys/zfs_ratelimit.h:23,
from /var/lib/dkms/zfs/0.8.1/build/module/zcommon/zfs_comutil.c:40:
/var/lib/dkms/zfs/0.8.1/build/include/spl/sys/rwlock.h: In function ‘rw_owner’:
/var/lib/dkms/zfs/0.8.1/build/include/spl/sys/rwlock.h:121:18: error: incompatible types when returning type ‘atomic_long_t’ {aka ‘struct <anonymous>’} but ‘kthread_t *’ {aka ‘struct task_struct *’} was expected
return (SEM(rwp)->owner);
~~~~~~~~~^~~~~~~~
/var/lib/dkms/zfs/0.8.1/build/include/spl/sys/rwlock.h: In function ‘RW_READ_HELD’:
/var/lib/dkms/zfs/0.8.1/build/include/spl/sys/rwlock.h:199:26: warning: comparison between pointer and integer
if (RWSEM_OWNER_UNKNOWN == (struct task_struct *)-2L) {
^~
/var/lib/dkms/zfs/0.8.1/build/include/spl/sys/rwlock.h:201:3: error: aggregate value used where an integer was expected
return ((unsigned long) SEM(rwp)->owner & 1);
^~~~~~
make[5]: *** [scripts/Makefile.build:281: /var/lib/dkms/zfs/0.8.1/build/module/zcommon/zfs_comutil.o] Error 1
make[5]: *** Waiting for unfinished jobs....
CC [M] /var/lib/dkms/zfs/0.8.1/build/module/spl/spl-kmem-cache.o
CC [M] /var/lib/dkms/zfs/0.8.1/build/module/spl/spl-kobj.o
CC [M] /var/lib/dkms/zfs/0.8.1/build/module/spl/spl-kstat.o
CC [M] /var/lib/dkms/zfs/0.8.1/build/module/spl/spl-proc.o
CC [M] /var/lib/dkms/zfs/0.8.1/build/module/spl/spl-mutex.o
In file included from /var/lib/dkms/zfs/0.8.1/build/include/spl/sys/taskq.h:35,
from /var/lib/dkms/zfs/0.8.1/build/include/spl/sys/kmem_cache.h:28,
from /var/lib/dkms/zfs/0.8.1/build/include/sys/zfs_context.h:41,
from /var/lib/dkms/zfs/0.8.1/build/module/zcommon/zfs_deleg.c:28:
/var/lib/dkms/zfs/0.8.1/build/include/spl/sys/rwlock.h: In function ‘rw_owner’:
/var/lib/dkms/zfs/0.8.1/build/include/spl/sys/rwlock.h:121:18: error: incompatible types when returning type ‘atomic_long_t’ {aka ‘struct <anonymous>’} but ‘kthread_t *’ {aka ‘struct task_struct *’} was expected
return (SEM(rwp)->owner);
~~~~~~~~~^~~~~~~~
/var/lib/dkms/zfs/0.8.1/build/include/spl/sys/rwlock.h: In function ‘RW_READ_HELD’:
/var/lib/dkms/zfs/0.8.1/build/include/spl/sys/rwlock.h:199:26: warning: comparison between pointer and integer
if (RWSEM_OWNER_UNKNOWN == (struct task_struct *)-2L) {
^~
/var/lib/dkms/zfs/0.8.1/build/include/spl/sys/rwlock.h:201:3: error: aggregate value used where an integer was expected
return ((unsigned long) SEM(rwp)->owner & 1);
^~~~~~
In file included from /var/lib/dkms/zfs/0.8.1/build/include/spl/sys/taskq.h:35,
from /var/lib/dkms/zfs/0.8.1/build/include/spl/sys/kmem_cache.h:28,
from /var/lib/dkms/zfs/0.8.1/build/module/spl/spl-generic.c:32:
/var/lib/dkms/zfs/0.8.1/build/include/spl/sys/rwlock.h: In function ‘rw_owner’:
/var/lib/dkms/zfs/0.8.1/build/include/spl/sys/rwlock.h:121:18: error: incompatible types when returning type ‘atomic_long_t’ {aka ‘struct <anonymous>’} but ‘kthread_t *’ {aka ‘struct task_struct *’} was expected
return (SEM(rwp)->owner);
~~~~~~~~~^~~~~~~~
/var/lib/dkms/zfs/0.8.1/build/include/spl/sys/rwlock.h: In function ‘RW_READ_HELD’:
/var/lib/dkms/zfs/0.8.1/build/include/spl/sys/rwlock.h:199:26: warning: comparison between pointer and integer
if (RWSEM_OWNER_UNKNOWN == (struct task_struct *)-2L) {
^~
/var/lib/dkms/zfs/0.8.1/build/include/spl/sys/rwlock.h:201:3: error: aggregate value used where an integer was expected
return ((unsigned long) SEM(rwp)->owner & 1);
^~~~~~
make[5]: *** [scripts/Makefile.build:281: /var/lib/dkms/zfs/0.8.1/build/module/spl/spl-generic.o] Error 1
make[5]: *** Waiting for unfinished jobs....
CC [M] /var/lib/dkms/zfs/0.8.1/build/module/spl/spl-procfs-list.o
make[5]: *** [scripts/Makefile.build:280: /var/lib/dkms/zfs/0.8.1/build/module/zcommon/zfs_deleg.o] Error 1
In file included from /var/lib/dkms/zfs/0.8.1/build/include/spl/sys/taskq.h:35,
from /var/lib/dkms/zfs/0.8.1/build/include/spl/sys/kmem_cache.h:28,
from /var/lib/dkms/zfs/0.8.1/build/include/sys/zfs_context.h:41,
from /var/lib/dkms/zfs/0.8.1/build/include/sys/spa.h:37,
from /var/lib/dkms/zfs/0.8.1/build/module/zcommon/zfs_fletcher.c:139:
/var/lib/dkms/zfs/0.8.1/build/include/spl/sys/rwlock.h: In function ‘rw_owner’:
/var/lib/dkms/zfs/0.8.1/build/include/spl/sys/rwlock.h:121:18: error: incompatible types when returning type ‘atomic_long_t’ {aka ‘struct <anonymous>’} but ‘kthread_t *’ {aka ‘struct task_struct *’} was expected
return (SEM(rwp)->owner);
~~~~~~~~~^~~~~~~~
/var/lib/dkms/zfs/0.8.1/build/include/spl/sys/rwlock.h: In function ‘RW_READ_HELD’:
/var/lib/dkms/zfs/0.8.1/build/include/spl/sys/rwlock.h:199:26: warning: comparison between pointer and integer
if (RWSEM_OWNER_UNKNOWN == (struct task_struct *)-2L) {
^~
/var/lib/dkms/zfs/0.8.1/build/include/spl/sys/rwlock.h:201:3: error: aggregate value used where an integer was expected
return ((unsigned long) SEM(rwp)->owner & 1);
^~~~~~
In file included from /var/lib/dkms/zfs/0.8.1/build/include/spl/sys/taskq.h:35,
from /var/lib/dkms/zfs/0.8.1/build/include/spl/sys/kmem_cache.h:28,
from /var/lib/dkms/zfs/0.8.1/build/module/spl/spl-proc.c:30:
/var/lib/dkms/zfs/0.8.1/build/include/spl/sys/rwlock.h: In function ‘rw_owner’:
/var/lib/dkms/zfs/0.8.1/build/include/spl/sys/rwlock.h:121:18: error: incompatible types when returning type ‘atomic_long_t’ {aka ‘struct <anonymous>’} but ‘kthread_t *’ {aka ‘struct task_struct *’} was expected
return (SEM(rwp)->owner);
~~~~~~~~~^~~~~~~~
/var/lib/dkms/zfs/0.8.1/build/include/spl/sys/rwlock.h: In function ‘RW_READ_HELD’:
/var/lib/dkms/zfs/0.8.1/build/include/spl/sys/rwlock.h:199:26: warning: comparison between pointer and integer
if (RWSEM_OWNER_UNKNOWN == (struct task_struct *)-2L) {
^~
/var/lib/dkms/zfs/0.8.1/build/include/spl/sys/rwlock.h:201:3: error: aggregate value used where an integer was expected
return ((unsigned long) SEM(rwp)->owner & 1);
^~~~~~
make[5]: *** [scripts/Makefile.build:280: /var/lib/dkms/zfs/0.8.1/build/module/spl/spl-proc.o] Error 1
In file included from /var/lib/dkms/zfs/0.8.1/build/include/spl/sys/taskq.h:35,
from /var/lib/dkms/zfs/0.8.1/build/include/spl/sys/kmem_cache.h:28,
from /var/lib/dkms/zfs/0.8.1/build/module/spl/spl-kmem-cache.c:26:
/var/lib/dkms/zfs/0.8.1/build/include/spl/sys/rwlock.h: In function ‘rw_owner’:
/var/lib/dkms/zfs/0.8.1/build/include/spl/sys/rwlock.h:121:18: error: incompatible types when returning type ‘atomic_long_t’ {aka ‘struct <anonymous>’} but ‘kthread_t *’ {aka ‘struct task_struct *’} was expected
return (SEM(rwp)->owner);
~~~~~~~~~^~~~~~~~
/var/lib/dkms/zfs/0.8.1/build/include/spl/sys/rwlock.h: In function ‘RW_READ_HELD’:
/var/lib/dkms/zfs/0.8.1/build/include/spl/sys/rwlock.h:199:26: warning: comparison between pointer and integer
if (RWSEM_OWNER_UNKNOWN == (struct task_struct *)-2L) {
^~
/var/lib/dkms/zfs/0.8.1/build/include/spl/sys/rwlock.h:201:3: error: aggregate value used where an integer was expected
return ((unsigned long) SEM(rwp)->owner & 1);
^~~~~~
make[5]: *** [scripts/Makefile.build:280: /var/lib/dkms/zfs/0.8.1/build/module/zcommon/zfs_fletcher.o] Error 1
make[4]: *** [scripts/Makefile.build:497: /var/lib/dkms/zfs/0.8.1/build/module/zcommon] Error 2
make[5]: *** [scripts/Makefile.build:280: /var/lib/dkms/zfs/0.8.1/build/module/spl/spl-kmem-cache.o] Error 1
LD [M] /var/lib/dkms/zfs/0.8.1/build/module/nvpair/znvpair.o
make[4]: *** [scripts/Makefile.build:497: /var/lib/dkms/zfs/0.8.1/build/module/spl] Error 2
LD [M] /var/lib/dkms/zfs/0.8.1/build/module/unicode/zunicode.o
make[3]: *** [Makefile:1624: _module_/var/lib/dkms/zfs/0.8.1/build/module] Error 2
make[3]: Leaving directory '/usr/src/linux-headers-5.3.0-050300-lowlatency'
make[2]: *** [Makefile:30: modules] Error 2
make[2]: Leaving directory '/var/lib/dkms/zfs/0.8.1/build/module'
make[1]: *** [Makefile:841: all-recursive] Error 1
make[1]: Leaving directory '/var/lib/dkms/zfs/0.8.1/build'
make: *** [Makefile:710: all] Error 2
[id:~/.shadow/copy/etc] $
Sign up for free to join this conversation on GitHub. Already have an account? Sign in to comment
You can’t perform that action at this time.