Create a gist now

Instantly share code, notes, and snippets.

What would you like to do?
rbenv build failure log homebrew, macOS
/var/folders/29/151mkpxs5tx3h4vz2qptg2xm0000gn/T/ruby-build.20170402120157.22586 ~/Downloads/tumblr-to-hugo-master
/var/folders/29/151mkpxs5tx3h4vz2qptg2xm0000gn/T/ruby-build.20170402120157.22586/ruby-2.3.2 /var/folders/29/151mkpxs5tx3h4vz2qptg2xm0000gn/T/ruby-build.20170402120157.22586 ~/Downloads/tumblr-to-hugo-master
checking for ruby... /usr/local/bin/ruby
config.guess already exists
config.sub already exists
checking build system type... x86_64-apple-darwin16.4.0
checking host system type... x86_64-apple-darwin16.4.0
checking target system type... x86_64-apple-darwin16.4.0
checking whether the C compiler works... yes
checking for C compiler default output file name... a.out
checking for suffix of executables...
checking whether we are cross compiling... no
checking for suffix of object files... o
checking whether we are using the GNU C compiler... yes
checking whether clang accepts -g... yes
checking for clang option to accept ISO C89... none needed
checking whether we are using the GNU C++ compiler... yes
checking whether clang++ accepts -g... yes
checking how to run the C preprocessor... clang -E
checking for grep that handles long lines and -e... /usr/bin/grep
checking for egrep... /usr/bin/grep -E
checking whether clang needs -traditional... no
checking for ld... ld
checking whether the linker is GNU ld... no
checking whether clang -E accepts -o... yes
checking for real target cpu... x86_64
checking for ranlib... ranlib
checking for ar... ar
checking for as... as
checking for objdump... objdump
checking for objcopy... no
checking for gobjcopy... no
checking for nm... nm
checking whether ln -s works... yes
checking whether make sets $(MAKE)... yes
checking for a BSD-compatible install... /usr/bin/install -c
checking for a thread-safe mkdir -p... -d
use 'mkdir -p' as MKDIR_P
checking for dtrace... dtrace
checking for dot... no
checking for doxygen... no
checking for pkg-config... pkg-config
checking for ANSI C header files... yes
checking for sys/types.h... yes
checking for sys/stat.h... yes
checking for stdlib.h... yes
checking for string.h... yes
checking for memory.h... yes
checking for strings.h... yes
checking for inttypes.h... yes
checking for stdint.h... yes
checking for unistd.h... yes
checking minix/config.h usability... no
checking minix/config.h presence... no
checking for minix/config.h... no
checking whether it is safe to define __EXTENSIONS__... yes
checking for cd using physical directory... cd -P
checking whether CFLAGS is valid... yes
checking whether LDFLAGS is valid... yes
checking whether -Wno-unused-parameter is accepted as CFLAGS... yes
checking whether -Wno-parentheses is accepted as CFLAGS... yes
checking whether -Wno-long-long is accepted as CFLAGS... yes
checking whether -diag-disable=2259 is accepted as CFLAGS... no
checking whether -Wno-missing-field-initializers is accepted as CFLAGS... yes
checking whether -Wunused-variable is accepted as CFLAGS... yes
checking whether -Wpointer-arith is accepted as CFLAGS... yes
checking whether -Wwrite-strings is accepted as CFLAGS... yes
checking whether -Wdeclaration-after-statement is accepted as CFLAGS... yes
checking whether -Wshorten-64-to-32 is accepted as CFLAGS... yes
checking whether -Wimplicit-function-declaration is accepted as CFLAGS... yes
checking whether -Wdivision-by-zero is accepted as CFLAGS... yes
checking whether -Wdeprecated-declarations is accepted as CFLAGS... yes
checking whether -Wno-packed-bitfield-compat is accepted as CFLAGS... no
checking whether -Wextra-tokens is accepted as CFLAGS... yes
checking whether -Wall -Wextra is accepted as CFLAGS... yes
checking whether -Qunused-arguments is accepted as CFLAGS... yes
checking whether INFINITY is available without C99 option... yes
checking whether NAN is available without C99 option... yes
checking whether -D_FORTIFY_SOURCE=2 is accepted as CFLAGS... yes
checking whether -fstack-protector is accepted as CFLAGS... yes
checking whether -fstack-protector is accepted as LDFLAGS... yes
checking whether -fno-strict-overflow is accepted as CFLAGS... yes
checking whether -ggdb3 is accepted as CFLAGS... yes
checking whether -fvisibility=hidden is accepted as CFLAGS... yes
checking whether -fno-fast-math is accepted as CFLAGS... yes
checking whether -fp-model precise is accepted as CFLAGS... no
checking whether Mac OS X 10.5 or later... yes
checking for broken crypt with 8bit chars... no
checking for codesign... codesign
checking for crt_externs.h... yes
checking for crypt in -lcrypt... (cached) no
checking for dlopen in -ldl... yes
checking for shl_load in -ldld... no
checking for shutdown in -lsocket... no
checking for dirent.h that defines DIR... yes
checking for library containing opendir... none required
checking for stdbool.h that conforms to C99... yes
checking for _Bool... yes
checking for sys/wait.h that is POSIX.1 compatible... yes
checking a.out.h usability... no
checking a.out.h presence... no
checking for a.out.h... no
checking atomic.h usability... no
checking atomic.h presence... no
checking for atomic.h... no
checking direct.h usability... no
checking direct.h presence... no
checking for direct.h... no
checking grp.h usability... yes
checking grp.h presence... yes
checking for grp.h... yes
checking fcntl.h usability... yes
checking fcntl.h presence... yes
checking for fcntl.h... yes
checking float.h usability... yes
checking float.h presence... yes
checking for float.h... yes
checking ieeefp.h usability... no
checking ieeefp.h presence... no
checking for ieeefp.h... no
checking intrinsics.h usability... no
checking intrinsics.h presence... no
checking for intrinsics.h... no
checking langinfo.h usability... yes
checking langinfo.h presence... yes
checking for langinfo.h... yes
checking limits.h usability... yes
checking limits.h presence... yes
checking for limits.h... yes
checking locale.h usability... yes
checking locale.h presence... yes
checking for locale.h... yes
checking malloc.h usability... no
checking malloc.h presence... no
checking for malloc.h... no
checking malloc/malloc.h usability... yes
checking malloc/malloc.h presence... yes
checking for malloc/malloc.h... yes
checking malloc_np.h usability... no
checking malloc_np.h presence... no
checking for malloc_np.h... no
checking net/socket.h usability... no
checking net/socket.h presence... no
checking for net/socket.h... no
checking process.h usability... no
checking process.h presence... no
checking for process.h... no
checking pwd.h usability... yes
checking pwd.h presence... yes
checking for pwd.h... yes
checking setjmpex.h usability... no
checking setjmpex.h presence... no
checking for setjmpex.h... no
checking sys/attr.h usability... yes
checking sys/attr.h presence... yes
checking for sys/attr.h... yes
checking sys/fcntl.h usability... yes
checking sys/fcntl.h presence... yes
checking for sys/fcntl.h... yes
checking sys/file.h usability... yes
checking sys/file.h presence... yes
checking for sys/file.h... yes
checking sys/id.h usability... no
checking sys/id.h presence... no
checking for sys/id.h... no
checking sys/ioctl.h usability... yes
checking sys/ioctl.h presence... yes
checking for sys/ioctl.h... yes
checking sys/mkdev.h usability... no
checking sys/mkdev.h presence... no
checking for sys/mkdev.h... no
checking sys/param.h usability... yes
checking sys/param.h presence... yes
checking for sys/param.h... yes
checking sys/prctl.h usability... no
checking sys/prctl.h presence... no
checking for sys/prctl.h... no
checking sys/resource.h usability... yes
checking sys/resource.h presence... yes
checking for sys/resource.h... yes
checking sys/select.h usability... yes
checking sys/select.h presence... yes
checking for sys/select.h... yes
checking sys/sendfile.h usability... no
checking sys/sendfile.h presence... no
checking for sys/sendfile.h... no
checking sys/socket.h usability... yes
checking sys/socket.h presence... yes
checking for sys/socket.h... yes
checking sys/syscall.h usability... yes
checking sys/syscall.h presence... yes
checking for sys/syscall.h... yes
checking sys/time.h usability... yes
checking sys/time.h presence... yes
checking for sys/time.h... yes
checking sys/times.h usability... yes
checking sys/times.h presence... yes
checking for sys/times.h... yes
checking sys/uio.h usability... yes
checking sys/uio.h presence... yes
checking for sys/uio.h... yes
checking sys/utime.h usability... no
checking sys/utime.h presence... no
checking for sys/utime.h... no
checking syscall.h usability... no
checking syscall.h presence... no
checking for syscall.h... no
checking time.h usability... yes
checking time.h presence... yes
checking for time.h... yes
checking ucontext.h usability... yes
checking ucontext.h presence... yes
checking for ucontext.h... yes
checking utime.h usability... yes
checking utime.h presence... yes
checking for utime.h... yes
checking gmp.h usability... no
checking gmp.h presence... no
checking for gmp.h... no
checking for special C compiler options needed for large files... no
checking for _FILE_OFFSET_BITS value needed for large files... no
checking whether byte ordering is bigendian... no
checking for an ANSI C-conforming const... yes
checking whether char is unsigned... no
checking for inline... inline
checking for working volatile... yes
checking for typeof syntax and keyword spelling... typeof
checking for long long... yes
checking for off_t... yes
checking char bit... 8
checking size of int... 4
checking size of short... 2
checking size of long... 8
checking size of long long... 8
checking size of __int64... 0
checking size of off_t... 8
checking size of void*... 8
checking size of float... 4
checking size of double... 8
checking size of time_t... 8
checking size of clock_t... 8
checking packed struct attribute... x __attribute__((packed))
checking for printf prefix for long long... ll
checking for pid_t... yes
checking for convertible type of pid_t... INT
checking for uid_t... yes
checking for convertible type of uid_t... UINT
checking for gid_t... yes
checking for convertible type of gid_t... UINT
checking for time_t... yes
checking for convertible type of time_t... LONG
checking for dev_t... yes
checking for convertible type of dev_t... INT
checking for mode_t... yes
checking for convertible type of mode_t... UINT
checking for rlim_t... yes
checking for convertible type of rlim_t... ULL
checking for off_t... (cached) yes
checking for convertible type of off_t... LL
checking for clockid_t... no
checking for convertible type of clockid_t... INT
checking for prototypes... yes
checking token paste string... ansi
checking stringization... #expr
checking string literal concatenation... yes
checking for variable length prototypes and stdarg.h... yes
checking for variable length macro... yes
checking for NORETURN function attribute... __attribute__ ((noreturn)) x
checking for DEPRECATED function attribute... __attribute__ ((deprecated)) x
checking for DEPRECATED_BY function attribute... __attribute__ ((deprecated("by "#n))) x
checking for DEPRECATED_TYPE type attribute... x __attribute__ ((deprecated mesg))
checking for NOINLINE function attribute... __attribute__ ((noinline)) x
checking for WEAK function attribute... __attribute__ ((weak)) x
checking for stdcall function attribute... x
checking for cdecl function attribute... __attribute__ ((cdecl)) x
checking for fastcall function attribute... x
checking for FUNC_UNOPTIMIZED function attribute... x
checking for FUNC_MINIMIZED function attribute... x
checking for function alias... no
checking for __atomic builtins... yes
checking for __sync builtins... yes
checking for __builtin_unreachable... yes
checking for exported function attribute... __attribute__ ((visibility("default")))
checking for function name string predefined identifier... __func__
checking if enum over int is allowed... yes
checking whether sys_nerr is declared... yes
checking whether getenv is declared... yes
checking for size_t... yes
checking size of size_t... 8
checking size of ptrdiff_t... 8
checking for printf prefix for size_t... z
checking for printf prefix for ptrdiff_t... t
checking for struct stat.st_blksize... yes
checking for struct stat.st_blocks... yes
checking for struct stat.st_rdev... yes
checking size of struct stat.st_size... SIZEOF_OFF_T
checking size of struct stat.st_blocks... SIZEOF_OFF_T
checking size of struct stat.st_ino... SIZEOF_LONG
checking for struct stat.st_atim... no
checking for struct stat.st_atimespec... yes
checking for struct stat.st_atimensec... no
checking for struct stat.st_mtim... no
checking for struct stat.st_mtimespec... yes
checking for struct stat.st_mtimensec... no
checking for struct stat.st_ctim... no
checking for struct stat.st_ctimespec... yes
checking for struct stat.st_ctimensec... no
checking for struct stat.st_birthtimespec... yes
checking for struct timeval... yes
checking size of struct timeval.tv_sec... SIZEOF_TIME_T
checking for struct timespec... yes
checking for struct timezone... yes
checking for clockid_t... (cached) no
checking for fd_mask... yes
checking for int8_t... yes
checking size of int8_t... 1
checking for uint8_t... yes
checking size of uint8_t... 1
checking for int16_t... yes
checking size of int16_t... 2
checking for uint16_t... yes
checking size of uint16_t... 2
checking for int32_t... yes
checking size of int32_t... 4
checking for uint32_t... yes
checking size of uint32_t... 4
checking for int64_t... yes
checking size of int64_t... 8
checking for uint64_t... yes
checking size of uint64_t... 8
checking for intptr_t... yes
checking size of intptr_t... 8
checking for uintptr_t... yes
checking size of uintptr_t... 8
checking for ssize_t... yes
checking size of ssize_t... 8
checking for stack end address... no
checking for uid_t in sys/types.h... (cached) yes
checking type of array argument to getgroups... (cached) gid_t
checking return type of signal handlers... void
checking for working alloca.h... yes
checking for alloca... yes
checking for dynamic size alloca... ok
checking for working memcmp... yes
checking for broken erfc of glibc-2.3.6 on IA64... no
checking for acosh... yes
checking for cbrt... yes
checking for crypt... yes
checking for dup2... yes
checking for erf... yes
checking for explicit_bzero... no
checking for ffs... yes
checking for finite... yes
checking for flock... yes
checking for hypot... yes
checking for isinf... yes
checking for isnan... yes
checking for lgamma_r... yes
checking for memmove... yes
checking for nextafter... yes
checking for setproctitle... no
checking for strchr... yes
checking for strerror... yes
checking for strlcat... yes
checking for strlcpy... yes
checking for strstr... yes
checking for tgamma... yes
checking sys/pstat.h usability... no
checking sys/pstat.h presence... no
checking for sys/pstat.h... no
checking for signbit... yes
checking for broken memmem... yes
checking for pid_t... (cached) yes
checking vfork.h usability... no
checking vfork.h presence... no
checking for vfork.h... no
checking for fork... yes
checking for vfork... (cached) no
checking for working fork... yes
checking for __syscall... yes
checking for _longjmp... yes
checking for _setjmp... no
checking for _setjmpex... no
checking for atan2l... yes
checking for atan2f... yes
checking for chroot... yes
checking for chsize... no
checking for clock_gettime... yes
checking for cosh... yes
checking for daemon... (cached) no
checking for dirfd... yes
checking for dl_iterate_phdr... no
checking for dlopen... yes
checking for dladdr... yes
checking for dup... yes
checking for dup3... no
checking for eaccess... no
checking for endgrent... yes
checking for fchmod... yes
checking for fchown... yes
checking for fcntl... yes
checking for fdatasync... (cached) no
checking for fgetattrlist... yes
checking for fmod... yes
checking for fsync... yes
checking for ftruncate... yes
checking for ftruncate64... no
checking for getattrlist... yes
checking for getcwd... yes
checking for getgidx... no
checking for getgrnam... yes
checking for getgrnam_r... yes
checking for getgroups... yes
checking for getpgid... yes
checking for getpgrp... yes
checking for getpriority... yes
checking for getpwnam_r... yes
checking for getresgid... no
checking for getresuid... no
checking for getrlimit... yes
checking for getsid... yes
checking for gettimeofday... yes
checking for getuidx... no
checking for gmtime_r... yes
checking for initgroups... yes
checking for ioctl... yes
checking for isfinite... no
checking for issetugid... yes
checking for killpg... yes
checking for lchmod... yes
checking for lchown... yes
checking for link... yes
checking for llabs... yes
checking for lockf... yes
checking for log2... yes
checking for lstat... yes
checking for malloc_usable_size... no
checking for malloc_size... yes
checking for mblen... yes
checking for memalign... no
checking for memset_s... yes
checking for writev... yes
checking for memrchr... no
checking for memmem... (cached) no
checking for mkfifo... yes
checking for mknod... yes
checking for mktime... yes
checking for pipe2... no
checking for poll... yes
checking for posix_fadvise... no
checking for posix_memalign... yes
checking for ppoll... no
checking for pread... yes
checking for qsort_r... yes
checking for readlink... yes
checking for round... yes
checking for sched_getaffinity... no
checking for seekdir... yes
checking for select_large_fdset... no
checking for sendfile... yes
checking for setegid... yes
checking for setenv... yes
checking for seteuid... yes
checking for setgid... yes
checking for setgroups... yes
checking for setpgid... yes
checking for setpgrp... yes
checking for setregid... yes
checking for setresgid... no
checking for setresuid... no
checking for setreuid... yes
checking for setrgid... yes
checking for setrlimit... yes
checking for setruid... yes
checking for setsid... yes
checking for setuid... yes
checking for shutdown... yes
checking for sigaction... yes
checking for sigaltstack... yes
checking for sigprocmask... yes
checking for sinh... yes
checking for spawnv... no
checking for symlink... yes
checking for syscall... yes
checking for sysconf... yes
checking for tanh... yes
checking for telldir... yes
checking for timegm... yes
checking for times... yes
checking for truncate... yes
checking for truncate64... no
checking for unsetenv... yes
checking for utimensat... no
checking for utimes... yes
checking for wait4... yes
checking for waitpid... yes
checking if getcwd allocates buffer if NULL is given... yes
checking for __builtin_bswap16... yes
checking for __builtin_bswap32... yes
checking for __builtin_bswap64... yes
checking for __builtin_clz... yes
checking for __builtin_clzl... yes
checking for __builtin_clzll... yes
checking for __builtin_choose_expr... yes
checking for __builtin_choose_expr_constant_p... yes
checking for __builtin_types_compatible_p... yes
checking whether qsort_r is GNU version... no
checking whether qsort_r is BSD version... yes
checking whether atan2 handles Inf as C99... yes
checking whether lgamma_r handles -0.0... no
checking for clock_getres... yes
checking for unsetenv returns a value... yes
checking for sigsetjmp as a macro or function... yes
checking whether struct tm is in sys/time.h or time.h... time.h
checking for struct tm.tm_zone... yes
checking for struct tm.tm_gmtoff... yes
checking for external int daylight... yes
checking for external timezone... long
checking for external altzone... no
checking for timezone... yes
checking whether timezone requires zero arguments... yes
checking for negative time_t for gmtime(3)... yes
checking for localtime(3) overflow correctly... yes
checking whether right shift preserve sign bit... yes
checking whether _SC_CLK_TCK is supported... yes
checking stack growing direction on x86_64... -1
checking for pthread_kill in -lthr... no
checking for pthread_kill in -lpthread... yes
checking for pthread_np.h... no
checking whether pthread_t is scalar type... yes
checking for sched_yield... yes
checking for pthread_attr_setinheritsched... yes
checking for pthread_attr_get_np... no
checking for pthread_attr_getstack... yes
checking for pthread_get_stackaddr_np... yes
checking for pthread_get_stacksize_np... yes
checking for thr_stksegment... no
checking for pthread_stackseg_np... no
checking for pthread_getthrds_np... no
checking for pthread_cond_init... yes
checking for pthread_condattr_setclock... no
checking for pthread_condattr_init... yes
checking for pthread_sigmask... yes
checking for pthread_setname_np... yes
checking for pthread_set_name_np... no
checking for pthread_getattr_np... no
checking for pthread_attr_init... yes
checking arguments of pthread_setname_np... (name)
checking if mcontext_t is a pointer... yes
checking for getcontext... (cached) no
checking for setcontext... (cached) no
checking if fork works with pthread... yes
checking whether ELF binaries are produced... no
checking whether OS depend dynamic link works... yes
checking whether -Wl,-undefined,dynamic_lookup is accepted as LDFLAGS... yes
checking whether -Wl,-multiply_defined,suppress is accepted as LDFLAGS... yes
checking execinfo.h usability... yes
checking execinfo.h presence... yes
checking for execinfo.h... yes
checking for backtrace in -lexecinfo... no
checking libunwind.h usability... yes
checking libunwind.h presence... yes
checking for libunwind.h... yes
checking for backtrace... yes
checking for broken backtrace... yes
checking valgrind/memcheck.h usability... no
checking valgrind/memcheck.h presence... no
checking for valgrind/memcheck.h... no
checking for strip... strip
checking whether -fPIE is accepted as CFLAGS... yes
checking whether -pie is accepted as LDFLAGS... no
checking whether -Wl,-pie is accepted as LDFLAGS... yes
checking whether wrapper for DYLD_LIBRARY_PATH is needed... yes
checking whether dtrace USDT is available... yes
checking whether dtrace USDT is available... (cached) yes
checking whether dtrace needs post processing... no
checking for __builtin_setjmp... (cached) no
checking for setjmp type... sigsetjmp
checking for prefix of external symbols... _
checking pthread.h usability... yes
checking pthread.h presence... yes
checking for pthread.h... yes
checking if make is GNU make... yes
checking for nroff... /usr/bin/nroff
.ext/include/x86_64-darwin16/ruby/config.h updated
configure: ruby library version = 2.3.0
configure: creating ./config.status
config.status: creating GNUmakefile
config.status: creating Makefile
config.status: creating ruby-2.3.pc
CC = clang
LD = ld
LDSHARED = clang -dynamic -bundle
CFLAGS = -O3 -Wno-error=shorten-64-to-32 -pipe
XCFLAGS = -D_FORTIFY_SOURCE=2 -fstack-protector -fno-strict-overflow -fvisibility=hidden -DRUBY_EXPORT -fPIE
CPPFLAGS = -I/Users/eriq/.rbenv/versions/2.3.2/include -D_XOPEN_SOURCE -D_DARWIN_C_SOURCE -D_DARWIN_UNLIMITED_SELECT -D_REENTRANT -I. -I.ext/include/x86_64-darwin16 -I./include -I.
DLDFLAGS = -Wl,-undefined,dynamic_lookup -Wl,-multiply_defined,suppress -fstack-protector -Wl,-u,_objc_msgSend -Wl,-pie -framework CoreFoundation
SOLIBS =
Apple LLVM version 8.1.0 (clang-802.0.38)
Target: x86_64-apple-darwin16.4.0
Thread model: posix
InstalledDir: /Applications/Xcode.app/Contents/Developer/Toolchains/XcodeDefault.xctoolchain/usr/bin
translating probes probes.d
compiling main.c
compiling dmydln.c
compiling miniinit.c
compiling dmyext.c
compiling miniprelude.c
compiling bignum.c
compiling class.c
compiling compar.c
compiling complex.c
. ./vm_opts.h
compiling dir.c
compiling dln_find.c
compiling encoding.c
compiling enum.c
compiling enumerator.c
compiling error.c
compiling eval.c
compiling load.c
compiling proc.c
compiling file.c
compiling gc.c
compiling hash.c
compiling inits.c
compiling io.c
compiling marshal.c
compiling math.c
compiling node.c
compiling numeric.c
compiling object.c
compiling pack.c
compiling parse.c
compiling process.c
compiling random.c
compiling range.c
compiling rational.c
compiling re.c
compiling regcomp.c
compiling regenc.c
compiling regerror.c
compiling regexec.c
compiling regparse.c
compiling regsyntax.c
compiling ruby.c
compiling safe.c
compiling signal.c
compiling sprintf.c
compiling st.c
compiling strftime.c
compiling string.c
compiling struct.c
compiling symbol.c
compiling time.c
compiling transcode.c
compiling util.c
compiling variable.c
compiling version.c
compiling compile.c
compiling debug.c
compiling iseq.c
compiling vm.c
compiling vm_dump.c
compiling vm_backtrace.c
compiling vm_trace.c
compiling thread.c
compiling cont.c
compiling ./missing/explicit_bzero.c
compiling ./missing/setproctitle.c
compiling dmyenc.c
compiling dln.c
compiling localeinit.c
compiling prelude.c
compiling array.c
config.status: creating ruby-runner.c
compiling enc/ascii.c
compiling enc/us_ascii.c
compiling enc/unicode.c
compiling enc/utf_8.c
compiling enc/trans/newline.c
linking miniruby
generating encdb.h
rbconfig.rb updated
generating enc.mk
creating verconf.h
encdb.h updated
verconf.h updated
compiling loadpath.c
making srcs under enc
make[1]: Nothing to be done for `srcs'.
generating transdb.h
linking static-library libruby-static.a
verifying static-library libruby-static.a
making enc
compiling ./enc/big5.c
compiling ./enc/emacs_mule.c
compiling ./enc/euc_kr.c
compiling ./enc/euc_jp.c
compiling ./enc/cp949.c
compiling ./enc/euc_tw.c
compiling ./enc/encdb.c
transdb.h updated
compiling ./enc/gb2312.c
generating makefile exts.mk
compiling ./enc/gbk.c
compiling ./enc/gb18030.c
making trans
compiling ./enc/trans/transdb.c
configuring -test-/array/resize
configuring -test-/bignum
compiling ./enc/iso_8859_1.c
compiling ./enc/iso_8859_2.c
configuring -test-/bug-3571
configuring -test-/bug-5832
configuring -test-/bug_reporter
configuring -test-/class
compiling ./enc/trans/big5.c
configuring -test-/debug
configuring -test-/dln/empty
compiling ./enc/iso_8859_3.c
configuring -test-/exception
configuring -test-/fatal
configuring -test-/file
compiling ./enc/iso_8859_4.c
compiling ./enc/trans/chinese.c
compiling ./enc/iso_8859_5.c
compiling ./enc/iso_8859_6.c
compiling ./enc/trans/ebcdic.c
compiling ./enc/iso_8859_7.c
compiling ./enc/iso_8859_8.c
compiling ./enc/trans/emoji.c
compiling ./enc/iso_8859_9.c
compiling ./enc/trans/emoji_iso2022_kddi.c
compiling ./enc/iso_8859_10.c
compiling ./enc/trans/emoji_sjis_docomo.c
compiling ./enc/trans/emoji_sjis_kddi.c
compiling ./enc/iso_8859_11.c
compiling ./enc/iso_8859_13.c
compiling ./enc/iso_8859_14.c
compiling ./enc/iso_8859_15.c
compiling ./enc/trans/emoji_sjis_softbank.c
compiling ./enc/iso_8859_16.c
compiling ./enc/koi8_r.c
compiling ./enc/koi8_u.c
compiling ./enc/shift_jis.c
compiling ./enc/utf_16be.c
configuring -test-/float
configuring -test-/funcall
configuring -test-/gvl/call_without_gvl
configuring -test-/hash
configuring -test-/iseq_load
configuring -test-/iter
configuring -test-/load/dot.dot
configuring -test-/marshal/compat
configuring -test-/marshal/internal_ivar
configuring -test-/marshal/usr
configuring -test-/method
configuring -test-/notimplement
configuring -test-/num2int
configuring -test-/path_to_class
configuring -test-/popen_deadlock
compiling ./enc/utf_16le.c
compiling ./enc/trans/escape.c
configuring -test-/postponed_job
configuring -test-/printf
configuring -test-/proc
configuring -test-/rational
configuring -test-/recursion
configuring -test-/st/foreach
configuring -test-/st/numhash
configuring -test-/st/update
configuring -test-/string
configuring -test-/struct
configuring -test-/symbol
compiling ./enc/trans/gb18030.c
compiling ./enc/utf_32be.c
compiling ./enc/utf_32le.c
compiling ./enc/windows_31j.c
compiling ./enc/trans/gbk.c
compiling ./enc/windows_1250.c
configuring -test-/time
compiling ./enc/trans/iso2022.c
configuring -test-/tracepoint
configuring -test-/typeddata
configuring -test-/vm
configuring -test-/wait_for_single_fd
compiling ./enc/windows_1251.c
configuring bigdecimal
compiling ./enc/windows_1252.c
compiling ./enc/trans/japanese.c
linking encoding encdb.bundle
compiling ./enc/trans/japanese_euc.c
compiling ./enc/trans/japanese_sjis.c
linking encoding big5.bundle
linking encoding cp949.bundle
compiling ./enc/trans/korean.c
linking encoding emacs_mule.bundle
linking encoding euc_jp.bundle
linking encoding euc_kr.bundle
linking encoding euc_tw.bundle
linking encoding gb2312.bundle
linking encoding gb18030.bundle
linking encoding gbk.bundle
compiling ./enc/trans/single_byte.c
linking encoding iso_8859_1.bundle
linking encoding iso_8859_2.bundle
linking encoding iso_8859_3.bundle
configuring cgi/escape
configuring continuation
configuring coverage
configuring date
configuring dbm
linking encoding iso_8859_4.bundle
linking encoding iso_8859_5.bundle
linking encoding iso_8859_6.bundle
linking encoding iso_8859_7.bundle
linking encoding iso_8859_8.bundle
linking encoding iso_8859_9.bundle
compiling ./enc/trans/utf8_mac.c
compiling ./enc/trans/utf_16_32.c
linking encoding iso_8859_10.bundle
linking encoding iso_8859_11.bundle
linking encoding iso_8859_13.bundle
linking encoding iso_8859_14.bundle
linking transcoder transdb.bundle
linking encoding iso_8859_15.bundle
linking encoding iso_8859_16.bundle
linking transcoder chinese.bundle
linking encoding koi8_r.bundle
linking encoding koi8_u.bundle
linking transcoder ebcdic.bundle
linking encoding shift_jis.bundle
linking encoding utf_16be.bundle
linking transcoder emoji.bundle
linking encoding utf_16le.bundle
linking encoding utf_32be.bundle
linking transcoder emoji_iso2022_kddi.bundle
linking encoding utf_32le.bundle
linking encoding windows_31j.bundle
linking transcoder emoji_sjis_docomo.bundle
linking transcoder emoji_sjis_kddi.bundle
linking encoding windows_1250.bundle
linking encoding windows_1251.bundle
header: ndbm.h
library: libc
linking encoding windows_1252.bundle
linking transcoder emoji_sjis_softbank.bundle
linking transcoder escape.bundle
linking transcoder gb18030.bundle
linking transcoder gbk.bundle
linking transcoder iso2022.bundle
linking transcoder japanese.bundle
linking transcoder japanese_sjis.bundle
linking transcoder single_byte.bundle
linking transcoder utf_16_32.bundle
linking transcoder korean.bundle
configuring digest
configuring digest/bubblebabble
configuring digest/md5
linking transcoder utf8_mac.bundle
linking transcoder japanese_euc.bundle
linking transcoder big5.bundle
making encs
configuring digest/rmd160
configuring digest/sha1
configuring digest/sha2
configuring etc
configuring fcntl
configuring fiber
configuring fiddle
configuring gdbm
Failed to configure gdbm. It will not be installed.
configuring io/console
configuring io/nonblock
configuring io/wait
configuring json
configuring json/generator
configuring json/parser
configuring mathn/complex
configuring mathn/rational
configuring nkf
configuring objspace
configuring openssl
configuring pathname
configuring psych
configuring pty
configuring racc/cparse
configuring rbconfig/sizeof
configuring readline
configuring ripper
configuring sdbm
configuring socket
configuring stringio
configuring strscan
configuring syslog
configuring thread
configuring tk
............
check struct members..
check libraries....
Use ActiveTcl libraries (if available).
Search tclConfig.sh and tkConfig.sh..................
WARNING: found "/usr/local/lib/tkConfig.sh", but cannot find valid Tk library for the tkConfig.sh. So, ignore it.
WARNING: found "/usr/local/lib/tkconfig.sh", but cannot find valid Tk library for the tkConfig.sh. So, ignore it.
...................
Valid [tclConfig.sh, tkConfig.sh] are found in [["/Users/eriq/anaconda/lib", "/Users/eriq/anaconda/lib"]]
Use [tclConfig.sh, tkConfig.sh] == ["/Users/eriq/anaconda/lib/tclConfig.sh", "/Users/eriq/anaconda/lib/tkConfig.sh"]
Use X11 libraries (or use TK_XINCLUDES/TK_XLIBSW information on tkConfig.sh).
Search tk.h.Search Tk library.
Find Tcl/Tk libraries. Make tcltklib.so which is required by Ruby/Tk.
configuring tk/tkutil
configuring zlib
compiling bug.c
compiling resize.c
compiling big2str.c
compiling bug.c
compiling bug_reporter.c
compiling class2name.c
compiling init.c
compiling empty.c
linking shared-object -test-/dln/empty.bundle
compiling inspector.c
compiling init.c
linking shared-object -test-/bug-3571/bug.bundle
linking shared-object -test-/bug_reporter/bug_reporter.bundle
linking shared-object -test-/array/resize.bundle
linking shared-object -test-/bug-5832/bug.bundle
compiling bigzero.c
compiling dataerror.c
compiling profile_frames.c
compiling div.c
compiling rb_fatal.c
linking shared-object -test-/class.bundle
compiling fs.c
compiling enc_raise.c
compiling ensured.c
compiling init.c
linking shared-object -test-/debug.bundle
linking shared-object -test-/fatal/rb_fatal.bundle
compiling init.c
compiling init.c
compiling init.c
compiling intpack.c
compiling stat.c
compiling nextafter.c
compiling passing_block.c
compiling mul.c
compiling str2big.c
linking shared-object -test-/exception.bundle
compiling call_without_gvl.c
linking shared-object -test-/file.bundle
linking shared-object -test-/float.bundle
linking shared-object -test-/funcall/funcall.bundle
compiling delete.c
compiling iseq_load.c
compiling break.c
linking shared-object -test-/bignum.bundle
compiling dot.dot.c
linking shared-object -test-/gvl/call_without_gvl.bundle
compiling usrcompat.c
compiling internal_ivar.c
compiling init.c
linking shared-object -test-/load/dot.dot/dot.dot.bundle
compiling init.c
linking shared-object -test-/iseq_load/iseq_load.bundle
compiling yield.c
compiling usrmarshal.c
linking shared-object -test-/marshal/internal_ivar.bundle
linking shared-object -test-/marshal/compat.bundle
compiling arity.c
linking shared-object -test-/hash.bundle
compiling bug.c
compiling init.c
compiling num2int.c
compiling path_to_class.c
linking shared-object -test-/iter.bundle
linking shared-object -test-/marshal/usr.bundle
make[2]: Nothing to be done for `all'.
compiling postponed_job.c
linking shared-object -test-/method.bundle
linking shared-object -test-/notimplement.bundle
compiling printf.c
linking shared-object -test-/path_to_class/path_to_class.bundle
compiling init.c
compiling rat.c
compiling receiver.c
linking shared-object -test-/num2int/num2int.bundle
compiling recursion.c
compiling foreach.c
linking shared-object -test-/postponed_job.bundle
compiling numhash.c
compiling super.c
linking shared-object -test-/rational.bundle
linking shared-object -test-/recursion.bundle
linking shared-object -test-/printf.bundle
compiling update.c
compiling coderange.c
compiling duplicate.c
compiling cstr.c
compiling init.c
linking shared-object -test-/proc.bundle
linking shared-object -test-/st/foreach.bundle
linking shared-object -test-/st/numhash.bundle
linking shared-object -test-/st/update.bundle
compiling init.c
compiling init.c
compiling ellipsize.c
compiling type.c
compiling gc_hook.c
compiling typeddata.c
compiling at_exit.c
compiling member.c
compiling new.c
compiling tracepoint.c
compiling enc_associate.c
linking shared-object -test-/symbol.bundle
linking shared-object -test-/typeddata/typeddata.bundle
compiling wait_for_single_fd.c
linking shared-object -test-/struct.bundle
linking shared-object -test-/vm/at_exit.bundle
compiling enc_str_buf_cat.c
linking shared-object -test-/time.bundle
compiling fstring.c
linking shared-object -test-/tracepoint.bundle
compiling init.c
compiling modify.c
compiling bigdecimal.c
linking shared-object -test-/wait_for_single_fd/wait_for_single_fd.bundle
compiling escape.c
compiling continuation.c
compiling coverage.c
installing default bigdecimal libraries
compiling date_core.c
compiling dbm.c
compiling nofree.c
compiling digest.c
linking shared-object cgi/escape.bundle
linking shared-object continuation.bundle
compiling normalize.c
linking shared-object coverage.bundle
compiling date_parse.c
compiling qsort.c
compiling date_strftime.c
compiling date_strptime.c
linking shared-object digest.bundle
compiling set_len.c
installing digest libraries
installing default digest libraries
compiling bubblebabble.c
linking shared-object -test-/string.bundle
linking shared-object dbm.bundle
installing default date_core libraries
compiling md5init.c
linking shared-object digest/bubblebabble.bundle
compiling rmd160init.c
linking shared-object digest/md5.bundle
linking shared-object digest/rmd160.bundle
compiling sha1init.c
compiling sha2init.c
generating constant definitions
installing default sha2 libraries
linking shared-object digest/sha1.bundle
compiling fcntl.c
compiling etc.c
compiling fiber.c
linking shared-object digest/sha2.bundle
linking shared-object fiber.bundle
linking shared-object fcntl.bundle
compiling closure.c
compiling conversions.c
make[2]: Nothing to be done for `all'.
compiling fiddle.c
compiling console.c
linking shared-object etc.bundle
compiling nonblock.c
compiling function.c
compiling wait.c
installing default console libraries
linking shared-object io/nonblock.bundle
linking shared-object io/console.bundle
linking shared-object io/wait.bundle
compiling handle.c
compiling generator.c
compiling parser.c
compiling pointer.c
installing default libraries
compiling complex.c
linking shared-object mathn/complex.bundle
compiling rational.c
linking shared-object mathn/rational.bundle
compiling nkf.c
installing default fiddle libraries
compiling object_tracing.c
linking shared-object fiddle.bundle
compiling openssl_missing.c
installing default nkf libraries
compiling pathname.c
compiling objspace.c
compiling ossl.c
linking shared-object json/ext/parser.bundle
installing default pathname libraries
linking shared-object json/ext/generator.bundle
compiling objspace_dump.c
compiling ossl_asn1.c
compiling psych.c
linking shared-object pathname.bundle
linking shared-object objspace.bundle
compiling pty.c
compiling ossl_bio.c
compiling psych_emitter.c
installing default pty libraries
compiling cparse.c
linking shared-object pty.bundle
compiling psych_parser.c
compiling ossl_bn.c
compiling sizes.c
linking shared-object racc/cparse.bundle
linking shared-object rbconfig/sizeof.bundle
compiling psych_to_ruby.c
compiling ossl_cipher.c
compiling psych_yaml_tree.c
linking shared-object bigdecimal.bundle
compiling ossl_config.c
compiling ../.././ext/psych/yaml/api.c
compiling readline.c
compiling ossl_digest.c
compiling ../.././ext/psych/yaml/dumper.c
compiling ripper.c
compiling ../.././ext/psych/yaml/emitter.c
compiling ossl_engine.c
compiling ../.././ext/psych/yaml/loader.c
compiling _sdbm.c
linking shared-object readline.bundle
compiling ossl_hmac.c
compiling ../.././ext/psych/yaml/parser.c
compiling ossl_ns_spki.c
compiling init.c
compiling ossl_ocsp.c
compiling ../.././ext/psych/yaml/reader.c
checking ../.././parse.y and ../.././ext/ripper/eventids2.c
generating constant definitions
compiling ossl_pkcs12.c
generating constant definitions
linking shared-object sdbm.bundle
compiling ../.././ext/psych/yaml/scanner.c
compiling basicsocket.c
compiling stringio.c
compiling ossl_pkcs5.c
compiling socket.c
compiling ossl_pkcs7.c
compiling ipsocket.c
linking shared-object stringio.bundle
installing default ripper libraries
compiling strscan.c
compiling ossl_pkey.c
compiling ../.././ext/psych/yaml/writer.c
compiling tcpsocket.c
linking shared-object date_core.bundle
compiling syslog.c
compiling tcpserver.c
compiling ossl_pkey_dh.c
compiling thread.c
installing default syslog libraries
linking shared-object strscan.bundle
linking shared-object syslog.bundle
compiling sockssocket.c
linking shared-object thread.bundle
compiling ossl_pkey_dsa.c
compiling udpsocket.c
compiling ossl_pkey_ec.c
compiling stubs.c
compiling ossl_pkey_rsa.c
linking shared-object nkf.bundle
compiling unixsocket.c
compiling tcltklib.c
compiling tkutil.c
compiling unixserver.c
compiling zlib.c
compiling option.c
compiling ossl_rand.c
installing tcltklib libraries
compiling ossl_ssl.c
ossl_ssl.c:95:5: error: use of undeclared identifier 'TLSv1_2_method'
OSSL_SSL_METHOD_ENTRY(TLSv1_2),
^
ossl_ssl.c:89:69: note: expanded from macro 'OSSL_SSL_METHOD_ENTRY'
#define OSSL_SSL_METHOD_ENTRY(name) { #name, (SSL_METHOD *(*)(void))name##_method }
^
<scratch space>:148:1: note: expanded from here
TLSv1_2_method
^
compiling ancdata.c
ossl_ssl.c:96:5: error: use of undeclared identifier 'TLSv1_2_server_method'
OSSL_SSL_METHOD_ENTRY(TLSv1_2_server),
^
ossl_ssl.c:89:69: note: expanded from macro 'OSSL_SSL_METHOD_ENTRY'
#define OSSL_SSL_METHOD_ENTRY(name) { #name, (SSL_METHOD *(*)(void))name##_method }
^
<scratch space>:148:1: note: expanded from here
TLSv1_2_server_method
^
ossl_ssl.c:97:5: error: use of undeclared identifier 'TLSv1_2_client_method'
OSSL_SSL_METHOD_ENTRY(TLSv1_2_client),
^
ossl_ssl.c:89:69: note: expanded from macro 'OSSL_SSL_METHOD_ENTRY'
#define OSSL_SSL_METHOD_ENTRY(name) { #name, (SSL_METHOD *(*)(void))name##_method }
^
<scratch space>:148:1: note: expanded from here
TLSv1_2_client_method
^
ossl_ssl.c:101:5: error: use of undeclared identifier 'TLSv1_1_method'
OSSL_SSL_METHOD_ENTRY(TLSv1_1),
^
ossl_ssl.c:89:69: note: expanded from macro 'OSSL_SSL_METHOD_ENTRY'
#define OSSL_SSL_METHOD_ENTRY(name) { #name, (SSL_METHOD *(*)(void))name##_method }
^
<scratch space>:148:1: note: expanded from here
TLSv1_1_method
^
ossl_ssl.c:102:5: error: use of undeclared identifier 'TLSv1_1_server_method'
OSSL_SSL_METHOD_ENTRY(TLSv1_1_server),
^
ossl_ssl.c:89:69: note: expanded from macro 'OSSL_SSL_METHOD_ENTRY'
#define OSSL_SSL_METHOD_ENTRY(name) { #name, (SSL_METHOD *(*)(void))name##_method }
^
<scratch space>:148:1: note: expanded from here
TLSv1_1_server_method
^
ossl_ssl.c:103:5: error: use of undeclared identifier 'TLSv1_1_client_method'
OSSL_SSL_METHOD_ENTRY(TLSv1_1_client),
^
ossl_ssl.c:89:69: note: expanded from macro 'OSSL_SSL_METHOD_ENTRY'
#define OSSL_SSL_METHOD_ENTRY(name) { #name, (SSL_METHOD *(*)(void))name##_method }
^
<scratch space>:148:1: note: expanded from here
TLSv1_1_client_method
^
ossl_ssl.c:186:21: error: invalid application of 'sizeof' to an incomplete type 'const struct (anonymous struct at ossl_ssl.c:85:14) []'
for (i = 0; i < numberof(ossl_ssl_method_tab); i++) {
^~~~~~~~~~~~~~~~~~~~~~~~~~~~~
ossl_ssl.c:18:35: note: expanded from macro 'numberof'
#define numberof(ary) (int)(sizeof(ary)/sizeof((ary)[0]))
^~~~~
ossl_ssl.c:801:2: warning: implicit declaration of function 'SSL_CTX_set_next_protos_advertised_cb' is invalid in C99 [-Wimplicit-function-declaration]
SSL_CTX_set_next_protos_advertised_cb(ctx, ssl_npn_advertise_cb, (void *) self);
^
ossl_ssl.c:805:2: warning: implicit declaration of function 'SSL_CTX_set_next_proto_select_cb' is invalid in C99 [-Wimplicit-function-declaration]
SSL_CTX_set_next_proto_select_cb(ctx, ssl_npn_select_cb, (void *) self);
^
ossl_ssl.c:814:2: warning: implicit declaration of function 'SSL_CTX_set_alpn_protos' is invalid in C99 [-Wimplicit-function-declaration]
SSL_CTX_set_alpn_protos(ctx, (const unsigned char *)StringValueCStr(rprotos), RSTRING_LENINT(rprotos));
^
ossl_ssl.c:818:2: warning: implicit declaration of function 'SSL_CTX_set_alpn_select_cb' is invalid in C99 [-Wimplicit-function-declaration]
SSL_CTX_set_alpn_select_cb(ctx, ssl_alpn_select_cb, (void *) self);
^
ossl_ssl.c:1882:5: warning: implicit declaration of function 'SSL_get0_next_proto_negotiated' is invalid in C99 [-Wimplicit-function-declaration]
SSL_get0_next_proto_negotiated(ssl, &out, &outlen);
^
ossl_ssl.c:1907:5: warning: implicit declaration of function 'SSL_get0_alpn_selected' is invalid in C99 [-Wimplicit-function-declaration]
SSL_get0_alpn_selected(ssl, &out, &outlen);
^
compiling raddrinfo.c
ossl_ssl.c:2266:23: error: invalid application of 'sizeof' to an incomplete type 'const struct (anonymous struct at ossl_ssl.c:85:14) []'
ary = rb_ary_new2(numberof(ossl_ssl_method_tab));
^~~~~~~~~~~~~~~~~~~~~~~~~~~~~
ossl_ssl.c:18:35: note: expanded from macro 'numberof'
#define numberof(ary) (int)(sizeof(ary)/sizeof((ary)[0]))
^~~~~
ossl_ssl.c:2267:21: error: invalid application of 'sizeof' to an incomplete type 'const struct (anonymous struct at ossl_ssl.c:85:14) []'
for (i = 0; i < numberof(ossl_ssl_method_tab); i++) {
^~~~~~~~~~~~~~~~~~~~~~~~~~~~~
ossl_ssl.c:18:35: note: expanded from macro 'numberof'
#define numberof(ary) (int)(sizeof(ary)/sizeof((ary)[0]))
^~~~~
6 warnings and 9 errors generated.
make[2]: *** [ossl_ssl.o] Error 1
make[1]: *** [ext/openssl/all] Error 2
make[1]: *** Waiting for unfinished jobs....
compiling ifaddr.c
linking shared-object tkutil.bundle
installing default socket libraries
compiling init.c
compiling constants.c
linking shared-object psych.bundle
installing default psych libraries
linking shared-object zlib.bundle
linking shared-object socket.bundle
linking shared-object tcltklib.bundle
installing default tcltklib libraries
linking shared-object ripper.bundle
make: *** [build-ext] Error 2
Sign up for free to join this conversation on GitHub. Already have an account? Sign in to comment