Skip to content

Instantly share code, notes, and snippets.

Embed
What would you like to do?
-- test finished --
--- Finished tests for llbuild ---
--- Running tests for swiftpm ---
+ /home/ec2-user/swiftpm/Utilities/bootstrap --release --swiftc=/home/ec2-user/build/buildbot_linux/swift-linux-x86_64/bin/swiftc --sbt=/home/ec2-user/build/buildbot_linux/llbuild-linux-x86_64/bin/swift-build-tool --build=/home/ec2-user/build/buildbot_linux/swiftpm-linux-x86_64 --link-llbuild --llbuild-source-dir=/home/ec2-user/llbuild --llbuild-build-dir=/home/ec2-user/build/buildbot_linux/llbuild-linux-x86_64 --foundation=/home/ec2-user/build/buildbot_linux/foundation-linux-x86_64 --libdispatch-source-dir=/home/ec2-user/swift-corelibs-libdispatch --libdispatch-build-dir=/home/ec2-user/build/buildbot_linux/libdispatch-linux-x86_64 --xctest=/home/ec2-user/build/buildbot_linux/xctest-linux-x86_64 test --test-parallel
--- bootstrap: note: building runtime v4_2 target: PackageDescription4:
--- bootstrap: note: building runtime v4 target: PackageDescription4:
--- bootstrap: note: building stage1
--- bootstrap: note: building self-hosted 'swift-build': env SWIFT_EXEC=/home/ec2-user/build/buildbot_linux/swiftpm-linux-x86_64/x86_64-unknown-linux/release/swiftc SWIFTPM_BUILD_DIR=/home/ec2-user/build/buildbot_linux/swiftpm-linux-x86_64 SWIFTPM_BOOTSTRAP=1 /home/ec2-user/build/buildbot_linux/swiftpm-linux-x86_64/x86_64-unknown-linux/release/swift-build-stage1 --disable-sandbox -Xlinker -rpath -Xlinker $ORIGIN/../lib/swift/linux -Xswiftc -Xcc -Xswiftc -DSPM_BUILD_IDENT=331fa5cb -Xswiftc -I/home/ec2-user/build/buildbot_linux/swiftpm-linux-x86_64/.bootstrap/lib/swift/linux/x86_64 -Xswiftc -Xcc -Xswiftc -F/home/ec2-user/build/buildbot_linux/swiftpm-linux-x86_64/.bootstrap/lib/swift/linux/x86_64 -Xswiftc -I/home/ec2-user/build/buildbot_linux/swiftpm-linux-x86_64/.bootstrap/lib/swift/linux/x86_64/dispatch -Xlinker -L/home/ec2-user/build/buildbot_linux/swiftpm-linux-x86_64/.bootstrap/lib/swift/linux -Xlinker -rpath -Xlinker /home/ec2-user/build/buildbot_linux/swiftpm-linux-x86_64/.bootstrap/lib/swift/linux -Xswiftc -I/home/ec2-user/build/buildbot_linux/llbuild-linux-x86_64/products/llbuildSwift -Xswiftc -I/home/ec2-user/llbuild/products/libllbuild/include -Xlinker -rpath -Xlinker $ORIGIN/../lib/swift/pm/llbuild -Xlinker -L/home/ec2-user/build/buildbot_linux/llbuild-linux-x86_64/lib -Xlinker -rpath -Xlinker /home/ec2-user/build/buildbot_linux/llbuild-linux-x86_64/lib -Xswiftc -enable-testing --configuration release --build-tests
--- bootstrap: note: testing with command: env SWIFT_EXEC=/home/ec2-user/build/buildbot_linux/swiftpm-linux-x86_64/x86_64-unknown-linux/release/swiftc SWIFTPM_BUILD_DIR=/home/ec2-user/build/buildbot_linux/swiftpm-linux-x86_64 SWIFTPM_BOOTSTRAP=1 /home/ec2-user/build/buildbot_linux/swiftpm-linux-x86_64/x86_64-unknown-linux/release/swift-test --disable-sandbox -Xlinker -rpath -Xlinker $ORIGIN/../lib/swift/linux -Xswiftc -Xcc -Xswiftc -DSPM_BUILD_IDENT=331fa5cb -Xswiftc -I/home/ec2-user/build/buildbot_linux/swiftpm-linux-x86_64/.bootstrap/lib/swift/linux/x86_64 -Xswiftc -Xcc -Xswiftc -F/home/ec2-user/build/buildbot_linux/swiftpm-linux-x86_64/.bootstrap/lib/swift/linux/x86_64 -Xswiftc -I/home/ec2-user/build/buildbot_linux/swiftpm-linux-x86_64/.bootstrap/lib/swift/linux/x86_64/dispatch -Xlinker -L/home/ec2-user/build/buildbot_linux/swiftpm-linux-x86_64/.bootstrap/lib/swift/linux -Xlinker -rpath -Xlinker /home/ec2-user/build/buildbot_linux/swiftpm-linux-x86_64/.bootstrap/lib/swift/linux -Xswiftc -I/home/ec2-user/build/buildbot_linux/llbuild-linux-x86_64/products/llbuildSwift -Xswiftc -I/home/ec2-user/llbuild/products/libllbuild/include -Xlinker -rpath -Xlinker $ORIGIN/../lib/swift/pm/llbuild -Xlinker -L/home/ec2-user/build/buildbot_linux/llbuild-linux-x86_64/lib -Xlinker -rpath -Xlinker /home/ec2-user/build/buildbot_linux/llbuild-linux-x86_64/lib -Xswiftc -enable-testing --configuration release --parallel
[1/581] Testing BasicTests.ByteStringTests/testAsString
[2/581] Testing BasicTests.ByteStringTests/testByteStreamable
[3/581] Testing BasicTests.ByteStringTests/testDescription
[4/581] Testing BasicTests.AwaitTests/testBasics
[5/581] Testing BasicTests.ByteStringTests/testInitializers
[6/581] Testing BasicTests.ByteStringTests/testHashable
[7/581] Testing BasicTests.ByteStringTests/testAccessors
[8/581] Testing BasicTests.CollectionExtensionsTests/testOnly
[9/581] Testing BasicTests.CStringArrayTests/testInitialization
[10/581] Testing BasicTests.CollectionAlgorithmsTests/testFindDuplicates
[11/581] Testing BasicTests.CacheableSequenceTests/testBasics
[12/581] Testing BasicTests.DiagnosticsEngineTests/testBasics
[13/581] Testing BasicTests.DictionaryExtensionTests/testBasics
[14/581] Testing BasicTests.DiagnosticsEngineTests/testHandlers
[15/581] Testing BasicTests.DiagnosticsEngineTests/testMerging
[16/581] Testing BasicTests.DictionaryExtensionTests/testCreateDictionary
[17/581] Testing BasicTests.FileSystemTests/testInMemoryBasics
[18/581] Testing BasicTests.EditDistanceTests/testBasics
[19/581] Testing BasicTests.DictionaryLiteralExtensionsTests/testDescription
[20/581] Testing BasicTests.DictionaryLiteralExtensionsTests/testEquality
[21/581] Testing BasicTests.FileSystemTests/testInMemoryReadWriteFile
[22/581] Testing BasicTests.FileSystemTests/testInMemoryCreateDirectory
[23/581] Testing BasicTests.FileSystemTests/testInMemoryFsCopy
[24/581] Testing BasicTests.FileSystemTests/testInMemRemoveFileTree
[25/581] Testing BasicTests.FileSystemTests/testLocalReadWriteFile
[26/581] Testing BasicTests.FileSystemTests/testLocalExistsSymlink
[27/581] Testing BasicTests.FileSystemTests/testLocalCreateDirectory
[28/581] Testing BasicTests.FileSystemTests/testLocalBasics
[29/581] Testing BasicTests.FileSystemTests/testSetAttribute
[30/581] Testing BasicTests.FileSystemTests/testRootedFileSystem
[31/581] Testing BasicTests.FileSystemTests/testRemoveFileTree
[32/581] Testing BasicTests.GraphAlgorithmsTests/testCycleDetection
[33/581] Testing BasicTests.JSONMapperTests/testErrors
[34/581] Testing BasicTests.GraphAlgorithmsTests/testTransitiveClosure
[35/581] Testing BasicTests.GraphAlgorithmsTests/testTopologicalSort
[36/581] Testing BasicTests.JSONMapperTests/testBasics
[37/581] Testing BasicTests.JSONTests/testDecoding
[38/581] Testing BasicTests.JSONTests/testEncoding
[39/581] Testing BasicTests.JSONTests/testPrettyPrinting
[40/581] Testing BasicTests.ConditionTests/testBroadcast
[41/581] Testing BasicTests.DeltaAlgorithmTests/testBasics
[42/581] Testing BasicTests.ConditionTests/testWaitUntil
[43/581] Testing BasicTests.ConditionTests/testSignal
[44/581] Testing BasicTests.JSONTests/testStringInitalizer
[45/581] Testing BasicTests.OrderedDictionaryTests/testBasics
[46/581] Testing BasicTests.OrderedSetTests/testBasics
[47/581] Testing BasicTests.OutputByteStreamTests/testJSONEncoding
[48/581] Testing BasicTests.OutputByteStreamTests/testBasics
[49/581] Testing BasicTests.OutputByteStreamTests/testFormattedOutput
[50/581] Testing BasicTests.OutputByteStreamTests/testBufferCorrectness
[51/581] Testing BasicTests.OutputByteStreamTests/testLocalFileStream
[52/581] Testing BasicTests.LazyCacheTests/testBasics
[53/581] Testing BasicTests.ObjectIdentifierProtocolTests/testBasics
[54/581] Testing BasicTests.LockTests/testFileLock
[55/581] Testing BasicTests.KeyedPairTests/testBasics
[56/581] Testing BasicTests.LockTests/testBasics
[57/581] Testing BasicTests.OutputByteStreamTests/testStreamOperator
[58/581] Testing BasicTests.OutputByteStreamTests/testLocalFileStreamArraySliceUnbuffered
[59/581] Testing BasicTests.PathShimTests/testResolvingSymlinks
[60/581] Testing BasicTests.POSIXTests/testFileStatus
[61/581] Testing BasicTests.PathShimTests/testRescursiveDirectoryCreation
[62/581] Testing BasicTests.OutputByteStreamTests/testThreadSafeStream
[63/581] Testing BasicTests.PathTests/testAbsolutePathValidation
[64/581] Testing BasicTests.PathTests/testCodable
[65/581] Testing BasicTests.PathTests/testBasics
[66/581] Testing BasicTests.PathTests/testComparison
[67/581] Testing BasicTests.PathTests/testCombinationsAndEdgeCases
[68/581] Testing BasicTests.PathTests/testBaseNameExtraction
[69/581] Testing BasicTests.PathTests/testConcatenation
[70/581] Testing BasicTests.PathTests/testContains
[71/581] Testing BasicTests.PathTests/testDirectoryNameExtraction
[72/581] Testing BasicTests.PathTests/testPathComponents
[73/581] Testing BasicTests.PathTests/testDotDotPathComponents
[74/581] Testing BasicTests.PathTests/testDotPathComponents
[75/581] Testing BasicTests.PathTests/testParentDirectory
[76/581] Testing BasicTests.PathTests/testRepeatedPathSeparators
[77/581] Testing BasicTests.PathTests/testStringInitialization
[78/581] Testing BasicTests.PathTests/testRelativePathFromAbsolutePaths
[79/581] Testing BasicTests.PathTests/testRelativePathValidation
[80/581] Testing BasicTests.PathTests/testStringLiteralInitialization
[81/581] Testing BasicTests.ProcessEnvTests/testEnvVars
[82/581] Testing BasicTests.ProcessEnvTests/testChdir
[83/581] Testing BasicTests.PathTests/testTrailingPathSeparators
[84/581] Testing BasicTests.PathTests/testSuffixExtraction
[85/581] Testing BasicTests.ProcessTests/testPopen
[86/581] Testing BasicTests.ProcessTests/testCheckNonZeroExit
[87/581] Testing BasicTests.ProcessTests/testFindExecutable
[88/581] Testing BasicTests.ProcessTests/testNonExecutableLaunch
[89/581] Testing BasicTests.ProcessTests/testBasics
[90/581] Testing BasicTests.ResultTests/testFlatMap
[91/581] Testing BasicTests.ResultTests/testBasics
[92/581] Testing BasicTests.ResultTests/testAnyError
[93/581] Testing BasicTests.RegExTests/testMatchGroups
[94/581] Testing BasicTests.ResultTests/testMap
[95/581] Testing BasicTests.ProcessTests/testSignals
[96/581] Testing BasicTests.SortedArrayTests/testSortedArrayInsertIntoSmallerArray
[97/581] Testing BasicTests.ProcessSetTests/testSigInt
[98/581] Testing BasicTests.ProcessEnvTests/testWithCustomEnv
[99/581] Testing BasicTests.ProcessSetTests/testSigKillEscalation
[100/581] Testing BasicTests.SHA256Tests/testBasics
[101/581] Testing BasicTests.SHA256Tests/testLargeData
[102/581] Testing BasicTests.SortedArrayTests/testSortedArrayInAscendingOrder
[103/581] Testing BasicTests.SortedArrayTests/testSortedArrayInDescendingOrder
[104/581] Testing BasicTests.ResultTests/testMapAny
[105/581] Testing BasicTests.StringConversionTests/testLocalizedJoin
[106/581] Testing BasicTests.SortedArrayTests/testSortedArrayInsertSlice
[107/581] Testing BasicTests.StringConversionTests/testShellEscaped
[108/581] Testing BasicTests.SortedArrayTests/testSortedArrayWithValues
[109/581] Testing BasicTests.TemporaryFileTests/testCanCreateUniqueTempDirectories
[110/581] Testing BasicTests.TemporaryFileTests/testBasicTemporaryDirectory
[111/581] Testing BasicTests.TemporaryFileTests/testLeaks
[112/581] Testing BasicTests.TemporaryFileTests/testCanCreateUniqueTempFiles
[113/581] Testing BasicTests.TemporaryFileTests/testNoCleanupTemporaryFile
[114/581] Testing BasicTests.ThreadTests/testMultipleThread
[115/581] Testing BasicTests.ThreadTests/testSingleThread
[116/581] Testing BasicTests.TupleTests/testBasics
[117/581] Testing BasicTests.ThreadTests/testNotDeinitBeforeExecutingTask
[118/581] Testing BasicTests.TerminalControllerTests/testBasic
[119/581] Testing BasicTests.TemporaryFileTests/testBasicReadWrite
[120/581] Testing BasicTests.WalkTests/testNonRecursive
[121/581] Testing BasicTests.miscTests/testEnvSearchPaths
[122/581] Testing BasicTests.WalkTests/testSymlinksNotWalked
[123/581] Testing BasicTests.WalkTests/testRecursive
[124/581] Testing BasicTests.WalkTests/testWalkingADirectorySymlinkResolvesOnce
[125/581] Testing BasicTests.miscTests/testEmptyEnvSearchPaths
[126/581] Testing BasicTests.RegExTests/testErrors
[127/581] Testing BasicTests.ProcessTests/testStdoutStdErr
[128/581] Testing BasicTests.ProcessTests/testThreadSafetyOnWaitUntilExit
[129/581] Testing BasicTests.miscTests/testExecutableLookup
[130/581] Testing BuildTests.BuildPlanTests/testBasicClangPackage
[131/581] Testing BuildTests.BuildPlanTests/testCppModule
[132/581] Testing BuildTests.BuildPlanTests/testDynamicProducts
[133/581] Testing BuildTests.BuildPlanTests/testBasicExtPackages
[134/581] Testing BuildTests.BuildPlanTests/testBasicReleasePackage
[135/581] Testing BuildTests.BuildPlanTests/testBuildSettings
[136/581] Testing BuildTests.BuildPlanTests/testBasicSwiftPackage
[137/581] Testing BuildTests.BuildPlanTests/testCModule
[138/581] Testing BuildTests.BuildPlanTests/testCLanguageStandard
[139/581] Testing BuildTests.BuildPlanTests/testClangTargets
[140/581] Testing BuildTests.BuildPlanTests/testExecAsDependency
[141/581] Testing BuildTests.BuildPlanTests/testPlatformsValidation
[142/581] Testing BuildTests.BuildPlanTests/testPlatforms
[143/581] Testing BuildTests.BuildPlanTests/testExecBuildTimeDependency
[144/581] Testing BuildTests.BuildPlanTests/testNonReachableProductsAndTargets
[145/581] Testing BuildTests.BuildPlanTests/testIndexStore
[146/581] Testing BuildTests.BuildPlanTests/testPkgConfigGenericDiagnostic
[147/581] Testing BuildTests.BuildPlanTests/testExtraBuildFlags
[148/581] Testing BuildTests.BuildPlanTests/testREPLArguments
[149/581] Testing BuildTests.BuildPlanTests/testPkgConfigHintDiagnostic
[150/581] Testing BuildTests.BuildPlanTests/testSystemPackageBuildPlan
[151/581] Testing BuildTests.BuildPlanTests/testSwiftCAsmMixed
[152/581] Testing BuildTests.BuildPlanTests/testSwiftCMixed
[153/581] Testing BuildTests.SwiftCompilerOutputParserTests/testInvalidMessageMissingField
[154/581] Testing BuildTests.SwiftCompilerOutputParserTests/testInvalidMessageInvalidValue
[155/581] Testing BuildTests.SwiftCompilerOutputParserTests/testInvalidMessageSizeValue
[156/581] Testing BuildTests.SwiftCompilerOutputParserTests/testInvalidMessageSizeBytes
[157/581] Testing BuildTests.SwiftCompilerOutputParserTests/testParse
[158/581] Testing CommandsTests.BuildToolTests/testSeeAlso
[159/581] Testing CommandsTests.BuildToolTests/testUsage
[160/581] Testing CommandsTests.BuildToolTests/testVersion
[161/581] Testing BasicTests.SyncronizedQueueTests/testMultipleProducerConsumer2
[162/581] Testing BasicTests.SyncronizedQueueTests/testMultipleProducerConsumer
[163/581] Testing BasicTests.SyncronizedQueueTests/testSingleProducerConsumer
[164/581] Testing CommandsTests.PackageToolTests/testInitEmpty
[165/581] Testing CommandsTests.PackageToolTests/testInitExecutable
[166/581] Testing CommandsTests.PackageToolTests/testInitLibrary
[167/581] Testing CommandsTests.PackageToolTests/testDescribe
[168/581] Testing CommandsTests.PackageToolTests/testMirrorConfig
[169/581] Testing BuildTests.SwiftCompilerOutputParserTests/testInvalidMessageBytes
[170/581] Testing BuildTests.BuildPlanTests/testWindowsTarget
[171/581] Testing BuildTests.BuildPlanTests/testTestModule
[172/581] Testing BuildTests.IncrementalBuildTests/testIncrementalSingleModuleCLibraryInSources
[173/581] Testing CommandsTests.PackageToolTests/testInitCustomNameExecutable
[174/581] Testing CommandsTests.PackageToolTests/testDumpPackage
[175/581] Testing CommandsTests.PackageToolTests/testSeeAlso
[176/581] Testing CommandsTests.PackageToolTests/testShowDependencies
[177/581] Testing CommandsTests.BuildToolTests/testBinPathAndSymlink
[178/581] Testing CommandsTests.PackageToolTests/testUsage
[179/581] Testing CommandsTests.PackageToolTests/testVersion
[180/581] Testing CommandsTests.PackageToolTests/testWatchmanXcodeprojgen
[181/581] Testing CommandsTests.RunToolTests/testFileDeprecation
[182/581] Testing CommandsTests.PackageToolTests/testPackageClean
[183/581] Testing CommandsTests.RunToolTests/testMutualExclusiveFlags
[184/581] Testing CommandsTests.RunToolTests/testSanitizeThread
[185/581] Testing CommandsTests.PackageToolTests/testUpdate
[186/581] Testing CommandsTests.PackageToolTests/testSymlinkedDependency
[187/581] Testing CommandsTests.RunToolTests/testSeeAlso
[188/581] Testing CommandsTests.RunToolTests/testUsage
[189/581] Testing CommandsTests.RunToolTests/testVersion
[190/581] Testing CommandsTests.TestToolTests/testNumWorkersParallelRequeriment
[191/581] Testing CommandsTests.TestToolTests/testNumWorkersValue
[192/581] Testing CommandsTests.TestToolTests/testSanitizeThread
[193/581] Testing CommandsTests.TestToolTests/testSeeAlso
[194/581] Testing CommandsTests.TestToolTests/testUsage
[195/581] Testing CommandsTests.TestToolTests/testVersion
[196/581] Testing FunctionalTests.CFamilyTargetTestCase/testCanForwardExtraFlagsToClang
[197/581] Testing CommandsTests.PackageToolTests/testPackageEditAndUnedit
[198/581] Testing CommandsTests.PackageToolTests/testPinningBranchAndRevision
[199/581] Testing CommandsTests.PackageToolTests/testPackageReset
[200/581] Testing CommandsTests.PackageToolTests/testPinning
[201/581] Testing CommandsTests.PackageToolTests/testResolve
[202/581] Testing CommandsTests.RunToolTests/testMultipleExecutableAndExplicitExecutable
[203/581] Testing CommandsTests.RunToolTests/testUnreachableExecutable
[204/581] Testing CommandsTests.RunToolTests/testUnkownProductAndArgumentPassing
[205/581] Testing FunctionalTests.CFamilyTargetTestCase/testCLibraryWithSpaces
[206/581] Testing CommandsTests.BuildToolTests/testProductAndTarget
[207/581] Testing CommandsTests.BuildToolTests/testParseableInterfaces
[208/581] Testing FunctionalTests.MiscellaneousTestCase/testCanKillSubprocessOnSigInt
[209/581] Testing CommandsTests.BuildToolTests/testNonReachableProductsAndTargetsFunctional
[210/581] Testing FunctionalTests.CFamilyTargetTestCase/testCUsingCAndSwiftDep
[211/581] Testing FunctionalTests.CFamilyTargetTestCase/testModuleMapGenerationCases
[212/581] Testing FunctionalTests.MiscellaneousTestCase/testNoArgumentsExitsWithOne
[213/581] Testing FunctionalTests.MiscellaneousTestCase/testOverridingSwiftcArguments
[214/581] Testing FunctionalTests.DependencyResolutionTests/testInternalComplex
[215/581] Testing FunctionalTests.DependencyResolutionTests/testExternalSimple
[216/581] Testing FunctionalTests.MiscellaneousTestCase/testCompileFailureExitsGracefully
[217/581] Testing FunctionalTests.DependencyResolutionTests/testInternalExecAsDep
[218/581] Testing FunctionalTests.DependencyResolutionTests/testInternalSimple
[219/581] Testing FunctionalTests.MiscellaneousTestCase/testSecondBuildIsNullInModulemapGen
[220/581] Testing FunctionalTests.MiscellaneousTestCase/testReportingErrorFromGitCommand
[221/581] Testing FunctionalTests.MiscellaneousTestCase/testSwiftTestFilter
[222/581] Testing FunctionalTests.MiscellaneousTestCase/testSwiftTestLinuxMainGeneration
[223/581] Testing FunctionalTests.MiscellaneousTestCase/testSwiftTestParallel
[224/581] Testing FunctionalTests.MiscellaneousTestCase/testPkgConfigCFamilyTargets
[225/581] Testing FunctionalTests.MiscellaneousTestCase/testPackageManagerDefineAndXArgs
[226/581] Testing FunctionalTests.SwiftPMXCTestHelperTests/testBasicXCTestHelper
[227/581] Testing FunctionalTests.CFamilyTargetTestCase/testObjectiveCPackageWithTestTarget
[228/581] Testing FunctionalTests.DependencyResolutionTests/testExternalComplex
[229/581] Testing PackageDescription4Tests.VersionTests/testBasics
[230/581] Testing FunctionalTests.MiscellaneousTestCase/testInternalDependencyEdges
[231/581] Testing PackageGraphTests.DependencyResolverTests/testCompleteness
[232/581] Testing PackageGraphTests.DependencyResolverTests/testBasics
[233/581] Testing FunctionalTests.MiscellaneousTestCase/testSpaces
[234/581] Testing PackageGraphTests.DependencyResolverTests/testCycle
[235/581] Testing PackageGraphTests.DependencyResolverTests/testContainerConstraintSet
[236/581] Testing PackageGraphTests.DependencyResolverTests/testDiagnostics
[237/581] Testing PackageGraphTests.DependencyResolverTests/testExactConstraint
[238/581] Testing PackageGraphTests.DependencyResolverTests/testIncompleteMode
[239/581] Testing PackageGraphTests.DependencyResolverTests/testLazyResolve
[240/581] Testing PackageGraphTests.DependencyResolverTests/testPrereleaseResolve
[241/581] Testing PackageGraphTests.DependencyResolverTests/testResolveSubtree
[242/581] Testing PackageGraphTests.DependencyResolverTests/testResolve
[243/581] Testing PackageGraphTests.DependencyResolverTests/testRevisionConstraint2
[244/581] Testing PackageGraphTests.DependencyResolverTests/testUnversionedConstraint
[245/581] Testing PackageGraphTests.DependencyResolverTests/testRevisionConstraint
[246/581] Testing PackageGraphTests.DependencyResolverTests/testVersionAssignment
[247/581] Testing PackageGraphTests.PackageGraphTests/testBasic
[248/581] Testing PackageGraphTests.PackageGraphTests/testCycle2
[249/581] Testing PackageGraphTests.DependencyResolverTests/testVersionSetSpecifier
[250/581] Testing PackageGraphTests.PackageGraphTests/testCycle
[251/581] Testing PackageGraphTests.PackageGraphTests/testDuplicateInterPackageTargetNames
[252/581] Testing PackageGraphTests.PackageGraphTests/testDuplicateModules
[253/581] Testing PackageGraphTests.PackageGraphTests/testDuplicateProducts
[254/581] Testing PackageGraphTests.PackageGraphTests/testEmptyDependency
[255/581] Testing PackageGraphTests.PackageGraphTests/testMultipleDuplicateModules
[256/581] Testing PackageGraphTests.PackageGraphTests/testNestedDuplicateModules
[257/581] Testing PackageGraphTests.PackageGraphTests/testProductDependencyNotFound
[258/581] Testing PackageGraphTests.PackageGraphTests/testProductDependencies
[259/581] Testing PackageGraphTests.PackageGraphTests/testSeveralDuplicateModules
[260/581] Testing PackageGraphTests.PackageGraphTests/testUnsafeFlags
[261/581] Testing PackageGraphTests.PackageGraphTests/testTestTargetDeclInExternalPackage
[262/581] Testing PackageGraphTests.PackageGraphTests/testUnusedDependency2
[263/581] Testing PackageGraphTests.PubgrubTests/testBranchOverriding3
[264/581] Testing PackageGraphTests.PubgrubTests/testBranchOverriding4
[265/581] Testing PackageGraphTests.PackageGraphTests/testUnusedDependency
[266/581] Testing PackageGraphTests.PubgrubTests/testConflict3
[267/581] Testing PackageGraphTests.PubgrubTests/testConflict2
[268/581] Testing PackageGraphTests.PubgrubTests/testConflict1
[269/581] Testing PackageGraphTests.PubgrubTests/testMissingVersion
[270/581] Testing PackageGraphTests.PubgrubTests/testIncompatibilityNormalizeTermsOnInit
[271/581] Testing PackageGraphTests.PubgrubTests/testNonExistentPackage
[272/581] Testing PackageGraphTests.PubgrubTests/testPositiveTerms
[273/581] Testing PackageGraphTests.PubgrubTests/testResolutionAvoidingConflictResolutionDuringDecisionMaking
[274/581] Testing PackageGraphTests.PubgrubTests/testResolutionBranchingErrorReporting
[275/581] Testing PackageGraphTests.PubgrubTests/testResolutionConflictResolutionWithAPartialSatisfier
[276/581] Testing PackageGraphTests.PubgrubTests/testResolutionLinearErrorReporting
[277/581] Testing PackageGraphTests.PubgrubTests/testResolutionNoConflicts
[278/581] Testing PackageGraphTests.PubgrubTests/testResolutionPerformingConflictResolution
[279/581] Testing PackageGraphTests.PubgrubTests/testResolutionNonExistentVersion
[280/581] Testing PackageGraphTests.PubgrubTests/testResolutionWithOverridingBranchBasedDependency
[281/581] Testing PackageGraphTests.PubgrubTests/testResolutionWithOverridingBranchBasedDependency2
[282/581] Testing PackageGraphTests.PubgrubTests/testResolutionWithRevisionConflict
[283/581] Testing PackageGraphTests.PubgrubTests/testResolutionWithSimpleBranchBasedDependency
[284/581] Testing PackageGraphTests.PubgrubTests/testResolutionWithSimpleBranchBasedDependency2
[285/581] Testing PackageGraphTests.PubgrubTests/testResolverConflictResolution
[286/581] Testing PackageGraphTests.PubgrubTests/testResolverAddIncompatibility
[287/581] Testing PackageGraphTests.PubgrubTests/testResolutionWithUnavailableRevision
[288/581] Testing PackageGraphTests.PubgrubTests/testResolverDecisionMaking
[289/581] Testing PackageGraphTests.PubgrubTests/testSolutionAddAssignments
[290/581] Testing PackageGraphTests.PubgrubTests/testSolutionBacktrack
[291/581] Testing PackageGraphTests.PubgrubTests/testResolverUnitPropagation
[292/581] Testing PackageGraphTests.PubgrubTests/testSolutionFindSatisfiers
[293/581] Testing PackageGraphTests.PubgrubTests/testSolutionPositive
[294/581] Testing PackageGraphTests.PubgrubTests/testSolutionUndecided
[295/581] Testing PackageGraphTests.PubgrubTests/testTermIntersection
[296/581] Testing PackageGraphTests.PubgrubTests/testTermInverse
[297/581] Testing PackageGraphTests.PubgrubTests/testTermIsValidDecision
[298/581] Testing PackageGraphTests.PubgrubTests/testTermSatisfies
[299/581] Testing PackageGraphTests.PubgrubTests/testTermRelation
[300/581] Testing PackageGraphTests.PubgrubTests/testUnversioned1
[301/581] Testing PackageGraphTests.PubgrubTests/testUnversioned2
[302/581] Testing PackageGraphTests.PubgrubTests/testUnversioned3
[303/581] Testing PackageGraphTests.PubgrubTests/testUnversioned4
[304/581] Testing PackageGraphTests.PubgrubTests/testUnversioned5
[305/581] Testing PackageGraphTests.PubgrubTests/testUnversioned6
[306/581] Testing PackageGraphTests.PubgrubTests/testUnversioned7
[307/581] Testing PackageGraphTests.PubgrubTests/testUnversioned8
[308/581] Testing PackageGraphTests.PubgrubTests/testUpdatePackageIdentifierAfterResolution
[309/581] Testing PackageGraphTests.RepositoryPackageContainerProviderTests/testPrereleaseVersions
[310/581] Testing PackageGraphTests.RepositoryPackageContainerProviderTests/testBasics
[311/581] Testing PackageGraphTests.RepositoryPackageContainerProviderTests/testPackageReference
[312/581] Testing PackageGraphTests.RepositoryPackageContainerProviderTests/testSimultaneousVersions
[313/581] Testing PackageGraphTests.RepositoryPackageContainerProviderTests/testVersions
[314/581] Testing PackageLoadingTests.ModuleMapGeneration/testModuleNameDirAndHeaderInInclude
[315/581] Testing PackageGraphTests.RepositoryPackageContainerProviderTests/testVprefixVersions
[316/581] Testing PackageLoadingTests.ModuleMapGeneration/testModuleNameHeaderInInclude
[317/581] Testing PackageLoadingTests.ModuleMapGeneration/testUnsupportedLayouts
[318/581] Testing PackageLoadingTests.ModuleMapGeneration/testOtherCases
[319/581] Testing PackageLoadingTests.ModuleMapGeneration/testWarnings
[320/581] Testing PackageLoadingTests.PackageBuilderTests/testAsmInV5Manifest
[321/581] Testing PackageLoadingTests.PackageBuilderTests/testAsmIsIgnoredInV4_2Manifest
[322/581] Testing PackageLoadingTests.PackageBuilderTests/testBadExecutableProductDecl
[323/581] Testing PackageLoadingTests.PackageBuilderTests/testBadREPLPackage
[324/581] Testing PackageLoadingTests.PackageBuilderTests/testBrokenSymlink
[325/581] Testing PackageLoadingTests.PackageBuilderTests/testBuildSettings
[326/581] Testing PackageLoadingTests.PackageBuilderTests/testCInTests
[327/581] Testing FunctionalTests.MiscellaneousTestCase/testPrintsSelectedDependencyVersion
[328/581] Testing PackageLoadingTests.PackageBuilderTests/testCustomTargetDependencies
[329/581] Testing PackageLoadingTests.PackageBuilderTests/testCustomTargetPaths
[330/581] Testing PackageLoadingTests.PackageBuilderTests/testCompatibleSwiftVersions
[331/581] Testing PackageLoadingTests.PackageBuilderTests/testDotFilesAreIgnored
[332/581] Testing PackageLoadingTests.PackageBuilderTests/testCustomTargetPathsOverlap
[333/581] Testing PackageLoadingTests.PackageBuilderTests/testDuplicateProducts
[334/581] Testing PackageLoadingTests.PackageBuilderTests/testDeclaredExecutableProducts
[335/581] Testing PackageLoadingTests.PackageBuilderTests/testDuplicateTargets
[336/581] Testing PackageLoadingTests.PackageBuilderTests/testExecutableAsADep
[337/581] Testing PackageLoadingTests.PackageBuilderTests/testExcludes
[338/581] Testing PackageLoadingTests.PackageBuilderTests/testDuplicateTargetDependencies
[339/581] Testing PackageLoadingTests.PackageBuilderTests/testInvalidHeaderSearchPath
[340/581] Testing PackageLoadingTests.PackageBuilderTests/testInvalidManifestConfigForNonSystemModules
[341/581] Testing PackageLoadingTests.PackageBuilderTests/testLinuxMain
[342/581] Testing PackageLoadingTests.PackageBuilderTests/testLinuxMainError
[343/581] Testing PackageLoadingTests.PackageBuilderTests/testLinuxMainSearch
[344/581] Testing PackageLoadingTests.PackageBuilderTests/testManifestTargetDeclErrors
[345/581] Testing PackageLoadingTests.PackageBuilderTests/testMultipleTestProducts
[346/581] Testing PackageLoadingTests.PackageBuilderTests/testMixedSources
[347/581] Testing PackageLoadingTests.PackageBuilderTests/testModuleMapLayout
[348/581] Testing PackageLoadingTests.PackageBuilderTests/testPlatforms
[349/581] Testing PackageLoadingTests.PackageBuilderTests/testPublicHeadersPath
[350/581] Testing PackageLoadingTests.PackageBuilderTests/testResolvesSystemModulePackage
[351/581] Testing PackageLoadingTests.PackageBuilderTests/testPredefinedTargetSearchError
[352/581] Testing PackageLoadingTests.PackageBuilderTests/testSpecialTargetDir
[353/581] Testing PackageLoadingTests.PackageBuilderTests/testSystemLibraryTargetDiagnostics
[354/581] Testing PackageLoadingTests.PackageBuilderTests/testSpecifiedCustomPathDoesNotExist
[355/581] Testing PackageLoadingTests.PackageBuilderTests/testSystemLibraryTarget
[356/581] Testing PackageLoadingTests.PackageBuilderTests/testSystemPackageDeclaresTargetsDiagnostic
[357/581] Testing PackageLoadingTests.PackageBuilderTests/testTargetDependencies
[358/581] Testing PackageLoadingTests.PackageBuilderTests/testTestsLayoutsv4
[359/581] Testing PackageLoadingTests.PackageBuilderTests/testValidSources
[360/581] Testing PackageLoadingTests.PackageBuilderTests/testVersionSpecificManifests
[361/581] Testing PackageLoadingTests.PackageDescription4LoadingTests/testManiestVersionToToolsVersion
[362/581] Testing FunctionalTests.MiscellaneousTestCase/testExternalDependencyEdges2
[363/581] Testing FunctionalTests.MiscellaneousTestCase/testCanBuildMoreThanTwiceWithExternalDependencies
[364/581] Testing FunctionalTests.ModuleMapsTestCase/testDirectDependency
[365/581] Testing PackageLoadingTests.PackageDescription4LoadingTests/testLanguageStandards
[366/581] Testing PackageLoadingTests.PackageDescription4LoadingTests/testCTarget
[367/581] Testing PackageLoadingTests.PackageDescription4LoadingTests/testManifestWithWarnings
[368/581] Testing PackageLoadingTests.PackageDescription4LoadingTests/testSystemPackage
[369/581] Testing PackageLoadingTests.PackageDescription4LoadingTests/testTargetDependencies
[370/581] Testing PackageLoadingTests.PackageDescription4LoadingTests/testProducts
[371/581] Testing PackageLoadingTests.PackageDescription4LoadingTests/testPackageDependencies
[372/581] Testing PackageLoadingTests.PackageDescription4LoadingTests/testTrivial
[373/581] Testing PackageLoadingTests.PackageDescription4LoadingTests/testTargetProperties
[374/581] Testing PackageLoadingTests.PackageDescription4LoadingTests/testCompatibleSwiftVersions
[375/581] Testing PackageLoadingTests.PackageDescription4LoadingTests/testUnavailableAPIs
[376/581] Testing FunctionalTests.MiscellaneousTestCase/testPassExactDependenciesToBuildCommand
[377/581] Testing PackageLoadingTests.PackageDescription4_2LoadingTests/testBasics
[378/581] Testing PackageLoadingTests.PackageDescription4_2LoadingTests/testNotAbsoluteDependencyPath
[379/581] Testing PackageLoadingTests.PackageDescription4_2LoadingTests/testLLBuildEngineErrors
[380/581] Testing PackageLoadingTests.PackageDescription4_2LoadingTests/testPackageDependencies
[381/581] Testing PackageLoadingTests.PackageDescription4_2LoadingTests/testDuplicateDependencyDecl
[382/581] Testing PackageLoadingTests.PackageDescription4_2LoadingTests/testPlatforms
[383/581] Testing PackageLoadingTests.PackageDescription4_2LoadingTests/testRuntimeManifestErrors
[384/581] Testing PackageLoadingTests.PackageDescription4_2LoadingTests/testSystemLibraryTargets
[385/581] Testing PackageLoadingTests.PackageDescription4_2LoadingTests/testVersionSpecificLoading
[386/581] Testing PackageLoadingTests.PackageDescription4_2LoadingTests/testSwiftLanguageVersions
[387/581] Testing PackageLoadingTests.PackageDescription4_2LoadingTests/testCaching
[388/581] Testing PackageLoadingTests.PackageDescription4_2LoadingTests/testBuildSettings
[389/581] Testing PackageLoadingTests.PackageDescription4_2LoadingTests/testCacheInvalidationOnEnv
[390/581] Testing FunctionalTests.ToolsVersionTests/testToolsVersion
[391/581] Testing PackageLoadingTests.PkgConfigTests/testBasics
[392/581] Testing PackageLoadingTests.PkgConfigTests/testDependencies
[393/581] Testing PackageLoadingTests.PkgConfigWhitelistTests/testFlagsWithInvalidFlags
[394/581] Testing PackageLoadingTests.PkgConfigWhitelistTests/testFlagsWithValueInNextFlag
[395/581] Testing PackageLoadingTests.PkgConfigWhitelistTests/testRemoveDefaultFlags
[396/581] Testing PackageLoadingTests.PkgConfigWhitelistTests/testSimpleFlags
[397/581] Testing PackageLoadingTests.ToolsVersionLoaderTests/testBasics
[398/581] Testing PackageLoadingTests.ToolsVersionLoaderTests/testNonMatching
[399/581] Testing PackageLoadingTests.ToolsVersionLoaderTests/testVersionSpecificManifest
[400/581] Testing PackageModelTests.PackageModelTests/testProductTypeCodable
[401/581] Testing PackageLoadingTests.ToolsVersionLoaderTests/testVersionSpecificManifestFallbacks
[402/581] Testing PackageModelTests.SwiftLanguageVersionTests/testBasics
[403/581] Testing PackageModelTests.TargetDependencyTests/test1
[404/581] Testing PackageModelTests.SwiftLanguageVersionTests/testComparison
[405/581] Testing PackageModelTests.TargetDependencyTests/test2
[406/581] Testing PackageModelTests.TargetDependencyTests/test4
[407/581] Testing PackageModelTests.TargetDependencyTests/test3
[408/581] Testing PackageModelTests.TargetDependencyTests/test5
[409/581] Testing PackageLoadingTests.PackageDescription5LoadingTests/testBasics
[410/581] Testing PackageModelTests.TargetDependencyTests/test6
[411/581] Testing PackageModelTests.ToolsVersionTests/testBasics
[412/581] Testing FunctionalTests.ModuleMapsTestCase/testTransitiveDependency
[413/581] Testing PackageLoadingTests.PackageDescription5LoadingTests/testSwiftLanguageVersion
[414/581] Testing PackageLoadingTests.PackageDescription5LoadingTests/testSerializedDiagnostics
[415/581] Testing SourceControlTests.GitRepositoryTests/testAreIgnored
[416/581] Testing SourceControlTests.GitRepositoryTests/testAreIgnoredWithSpaceInRepoPath
[417/581] Testing SourceControlTests.GitRepositoryTests/testAlternativeObjectStoreValidation
[418/581] Testing SourceControlTests.GitRepositoryTests/testGitRepositoryHash
[419/581] Testing SourceControlTests.GitRepositoryTests/testBranchOperations
[420/581] Testing PackageLoadingTests.PackageDescription5LoadingTests/testInvalidBuildSettings
[421/581] Testing SourceControlTests.GitRepositoryTests/testRepositorySpecifier
[422/581] Testing PackageLoadingTests.PackageDescription5LoadingTests/testBuildSettings
[423/581] Testing SourceControlTests.GitRepositoryTests/testRawRepository
[424/581] Testing SourceControlTests.GitRepositoryTests/testGitFileView
[425/581] Testing SourceControlTests.GitRepositoryTests/testProvider
[426/581] Testing SourceControlTests.GitRepositoryTests/testFetch
[427/581] Testing SourceControlTests.InMemoryGitRepositoryTests/testBasics
[428/581] Testing SourceControlTests.GitRepositoryTests/testSetRemote
[429/581] Testing SourceControlTests.InMemoryGitRepositoryTests/testProvider
[430/581] Testing PackageLoadingTests.PackageDescription5LoadingTests/testPlatforms
[431/581] Testing SourceControlTests.RepositoryManagerTests/testBasics
[432/581] Testing SourceControlTests.GitRepositoryTests/testHasUnpushedCommits
[433/581] Testing SourceControlTests.GitRepositoryTests/testUncommitedChanges
[434/581] Testing SourceControlTests.RepositoryManagerTests/testReset
[435/581] Testing SourceControlTests.RepositoryManagerTests/testPersistence
[436/581] Testing SourceControlTests.RepositoryManagerTests/testSkipUpdate
[437/581] Testing TestSupportTests.TestSupportTests/testAssertMatchStringLists
[438/581] Testing SourceControlTests.RepositoryManagerTests/testStateFileResilience
[439/581] Testing SourceControlTests.RepositoryManagerTests/testParallelLookups
[440/581] Testing UtilityTests.ArgumentParserTests/testBoolParsing
[441/581] Testing UtilityTests.ArgumentParserTests/testBasics
[442/581] Testing UtilityTests.ArgumentParserTests/testBinderThrows
[443/581] Testing UtilityTests.ArgumentParserTests/testErrors
[444/581] Testing SourceControlTests.GitRepositoryTests/testCheckoutRevision
[445/581] Testing UtilityTests.ArgumentParserTests/testOptionalPositionalArg
[446/581] Testing UtilityTests.ArgumentParserTests/testIntParsing
[447/581] Testing UtilityTests.ArgumentParserTests/testRemainingStrategy
[448/581] Testing UtilityTests.ArgumentParserTests/testSingleValueMultipleTimes
[449/581] Testing UtilityTests.ArgumentParserTests/testOptions
[450/581] Testing UtilityTests.ArgumentParserTests/testShellCompletionGeneration
[451/581] Testing FunctionalTests.VersionSpecificTests/testEndToEndResolution
[452/581] Testing UtilityTests.ArgumentParserTests/testSubparser
[453/581] Testing UtilityTests.ArgumentParserTests/testSubparserBinder
[454/581] Testing UtilityTests.ArgumentParserTests/testSubsubparser
[455/581] Testing UtilityTests.ArgumentParserTests/testUpToNextOptionStrategy
[456/581] Testing UtilityTests.CollectionTests/testSplitAround
[457/581] Testing FunctionalTests.MiscellaneousTestCase/testExternalDependencyEdges1
[458/581] Testing UtilityTests.ArgumentParserTests/testPathArgument
[459/581] Testing UtilityTests.InterruptHandlerTests/testBasics
[460/581] Testing UtilityTests.PkgConfigParserTests/testBrewPrefix
[461/581] Testing UtilityTests.PkgConfigParserTests/testEscapedSpaces
[462/581] Testing UtilityTests.PkgConfigParserTests/testEmptyCFlags
[463/581] Testing UtilityTests.PkgConfigParserTests/testCustomPcFileSearchPath
[464/581] Testing UtilityTests.PkgConfigParserTests/testGTK3PCFile
[465/581] Testing UtilityTests.PkgConfigParserTests/testUnevenQuotes
[466/581] Testing UtilityTests.PkgConfigParserTests/testUnresolvablePCFile
[467/581] Testing UtilityTests.PkgConfigParserTests/testVariableinDependency
[468/581] Testing UtilityTests.ProgressAnimationTests/testPercentProgressAnimationDumbTerminal
[469/581] Testing UtilityTests.ProgressAnimationTests/testNinjaProgressAnimationDumbTerminal
[470/581] Testing UtilityTests.ProgressAnimationTests/testPercentProgressAnimationTTY
[471/581] Testing SourceControlTests.GitRepositoryTests/testSubmoduleRead
[472/581] Testing UtilityTests.ProgressAnimationTests/testNinjaProgressAnimationTTY
[473/581] Testing UtilityTests.SimplePersistenceTests/testBackwardsCompatibleStateFile
[474/581] Testing UtilityTests.SimplePersistenceTests/testBasics
[475/581] Testing UtilityTests.StringConversionTests/testManglingToC99ExtendedIdentifier
[476/581] Testing UtilityTests.StringConversionTests/testManglingToBundleIdentifier
[477/581] Testing UtilityTests.SimplePersistenceTests/testCanLoadFromOldSchema
[478/581] Testing UtilityTests.StringTests/testChuzzle
[479/581] Testing UtilityTests.StringTests/testEmptyChomp
[480/581] Testing UtilityTests.StringTests/testTrailingChomp
[481/581] Testing UtilityTests.URLTests/testSchema
[482/581] Testing UtilityTests.StringTests/testSplitAround
[483/581] Testing UtilityTests.StringTests/testSeparatorChomp
[484/581] Testing UtilityTests.VersionTests/testComparable
[485/581] Testing UtilityTests.VersionTests/testContains
[486/581] Testing UtilityTests.VersionTests/testDescription
[487/581] Testing UtilityTests.VersionTests/testEquality
[488/581] Testing UtilityTests.VersionTests/testFromString
[489/581] Testing UtilityTests.VersionTests/testHashable
[490/581] Testing UtilityTests.VersionTests/testOrder
[491/581] Testing UtilityTests.miscTests/testVersion
[492/581] Testing UtilityTests.VersionTests/testRange
[493/581] Testing UtilityTests.miscTests/testClangVersionOutput
[494/581] Testing WorkspaceTests.InitTests/testInitManifest
[495/581] Testing WorkspaceTests.ToolsVersionWriterTests/testBasics
[496/581] Testing SourceControlTests.GitRepositoryTests/testCheckouts
[497/581] Testing WorkspaceTests.ToolsVersionWriterTests/testZeroedPatchVersion
[498/581] Testing WorkspaceTests.WorkspaceTests/testBranchAndRevision
[499/581] Testing WorkspaceTests.WorkspaceTests/testBasics
[500/581] Testing WorkspaceTests.WorkspaceTests/testCanResolveWithIncompatiblePins
[501/581] Testing WorkspaceTests.WorkspaceTests/testCanUneditRemovedDependencies
[502/581] Testing WorkspaceTests.WorkspaceTests/testCleanAndReset
[503/581] Testing WorkspaceTests.WorkspaceTests/testChangeOneDependency
[504/581] Testing WorkspaceTests.WorkspaceTests/testDeletedCheckoutDirectory
[505/581] Testing WorkspaceTests.WorkspaceTests/testDependencyManifestLoading
[506/581] Testing WorkspaceTests.WorkspaceTests/testDependencyRefsAreIteratedInStableOrder
[507/581] Testing WorkspaceTests.WorkspaceTests/testDependencyManifestsOrder
[508/581] Testing WorkspaceTests.WorkspaceTests/testDependencySwitchWithSameIdentity
[509/581] Testing WorkspaceTests.WorkspaceTests/testDuplicateRootPackages
[510/581] Testing WorkspaceTests.WorkspaceTests/testDependencyResolutionWithEdit
[511/581] Testing WorkspaceTests.WorkspaceTests/testEditDependency
[512/581] Testing WorkspaceTests.WorkspaceTests/testForceResolveToResolvedVersions
[513/581] Testing WorkspaceTests.WorkspaceTests/testForceResolveToResolvedVersionsLocalPackage
[514/581] Testing WorkspaceTests.WorkspaceTests/testGraphRootDependencies
[515/581] Testing WorkspaceTests.WorkspaceTests/testInterpreterFlags
[516/581] Testing WorkspaceTests.WorkspaceTests/testIsResolutionRequired
[517/581] Testing WorkspaceTests.WorkspaceTests/testLoadingRootManifests
[518/581] Testing WorkspaceTests.WorkspaceTests/testLocalDependencyBasics
[519/581] Testing WorkspaceTests.WorkspaceTests/testLocalDependencyTransitive
[520/581] Testing WorkspaceTests.WorkspaceTests/testLocalDependencyWithPackageUpdate
[521/581] Testing WorkspaceTests.WorkspaceTests/testLocalLocalSwitch
[522/581] Testing WorkspaceTests.WorkspaceTests/testMinimumRequiredToolsVersionInDependencyResolution
[523/581] Testing WorkspaceTests.WorkspaceTests/testLocalVersionSwitch
[524/581] Testing WorkspaceTests.WorkspaceTests/testMissingEditCanRestoreOriginalCheckout
[525/581] Testing WorkspaceTests.WorkspaceTests/testMultipleRootPackages
[526/581] Testing WorkspaceTests.WorkspaceTests/testResolutionFailureWithEditedDependency
[527/581] Testing WorkspaceTests.WorkspaceTests/testPackageMirror
[528/581] Testing SourceControlTests.GitRepositoryTests/testSubmodules
[529/581] Testing WorkspaceTests.WorkspaceTests/testResolvedFileUpdate
[530/581] Testing WorkspaceTests.WorkspaceTests/testResolve
[531/581] Testing WorkspaceTests.WorkspaceTests/testResolverCanHaveError
[532/581] Testing WorkspaceTests.WorkspaceTests/testRevisionDepOnLocal
[533/581] Testing WorkspaceTests.WorkspaceTests/testRootAsDependency1
[534/581] Testing WorkspaceTests.WorkspaceTests/testRevisionVersionSwitch
[535/581] Testing WorkspaceTests.WorkspaceTests/testRootAsDependency2
[536/581] Testing WorkspaceTests.WorkspaceTests/testRootPackagesOverride
[537/581] Testing WorkspaceTests.WorkspaceTests/testRootPackagesOverrideBasenameMismatch
[538/581] Testing WorkspaceTests.WorkspaceTests/testSkipUpdate
[539/581] Testing WorkspaceTests.WorkspaceTests/testToolsVersionRootPackages
[540/581] Testing WorkspaceTests.WorkspaceTests/testUpdate
[541/581] Testing WorkspaceTests.WorkspaceTests/testTransitiveDependencySwitchWithSameIdentity
[542/581] Testing XcodeprojTests.FunctionalTests/testModuleNamesWithNonC99Names
[543/581] Testing XcodeprojTests.FunctionalTests/testSingleModuleLibrary
[544/581] Testing XcodeprojTests.FunctionalTests/testSwiftExecWithCDep
[545/581] Testing XcodeprojTests.FunctionalTests/testSystemModule
[546/581] Testing XcodeprojTests.FunctionalTests/testXcodeProjWithPkgConfig
[547/581] Testing XcodeprojTests.GenerateXcodeprojTests/testBuildXcodeprojPath
[548/581] Testing XcodeprojTests.GenerateXcodeprojTests/testGenerateXcodeprojWithDotFiles
[549/581] Testing XcodeprojTests.GenerateXcodeprojTests/testGenerateXcodeprojWithFilesIgnoredByGit
[550/581] Testing XcodeprojTests.GenerateXcodeprojTests/testGenerateXcodeprojWithInvalidModuleNames
[551/581] Testing XcodeprojTests.GenerateXcodeprojTests/testGenerateXcodeprojWithoutGitRepo
[552/581] Testing XcodeprojTests.GenerateXcodeprojTests/testGenerateXcodeprojWithNonSourceFilesInSourceDirectories
[553/581] Testing XcodeprojTests.GenerateXcodeprojTests/testXcconfigOverrideValidatesPath
[554/581] Testing XcodeprojTests.GenerateXcodeprojTests/testXcodebuildCanParseIt
[555/581] Testing XcodeprojTests.GenerateXcodeprojTests/testGenerateXcodeprojWithRootFiles
[556/581] Testing XcodeprojTests.PackageGraphTests/testAggregateTarget
[557/581] Testing XcodeprojTests.PackageGraphTests/testBasics
[558/581] Testing XcodeprojTests.PackageGraphTests/testModuleLinkage
[559/581] Testing XcodeprojTests.PackageGraphTests/testModulemap
[560/581] Testing XcodeprojTests.PackageGraphTests/testSchemes
[561/581] Testing XcodeprojTests.PackageGraphTests/testSwiftVersion
[562/581] Testing XcodeprojTests.PropertyListTests/testBasics
[563/581] Testing XcodeprojTests.XcodeProjectModelSerializationTests/testBasicProjectSerialization
[564/581] Testing XcodeprojTests.XcodeProjectModelSerializationTests/testBuildFileSettingsSerialization
[565/581] Testing XcodeprojTests.XcodeProjectModelSerializationTests/testBuildSettingsSerialization
[566/581] Testing XcodeprojTests.XcodeProjectModelTests/testBasicProjectCreation
[567/581] Testing XcodeprojTests.XcodeProjectModelTests/testBuildPhases
[568/581] Testing XcodeprojTests.XcodeProjectModelTests/testBuildSettings
[569/581] Testing XcodeprojTests.XcodeProjectModelTests/testProductReferences
[570/581] Testing XcodeprojTests.XcodeProjectModelTests/testTargetCreation
[571/581] Testing XcodeprojTests.XcodeProjectModelTests/testTargetDependencies
[572/581] Testing WorkspaceTests.InitTests/testInitPackageNonc99Directory
[573/581] Testing WorkspaceTests.InitTests/testInitPackageLibrary
[574/581] Testing WorkspaceTests.InitTests/testInitPackageEmpty
[575/581] Testing WorkspaceTests.InitTests/testInitPackageExecutable
[576/581] Testing WorkspaceTests.PinsStoreTests/testEmptyPins
[577/581] Testing WorkspaceTests.PinsStoreTests/testBasics
[578/581] Testing WorkspaceTests.PinsStoreTests/testLoadingSchema1
[579/581] Testing WorkspaceTests.InitTests/testInitPackageSystemModule
[580/581] Testing WorkspaceTests.InitTests/testNonC99NameExecutablePackage
[581/581] Testing WorkspaceTests.WorkspaceTests/testSimpleAPI
Test Suite 'Selected tests' started at 2020-03-04 14:52:48.185
Test Suite 'BuildPlanTests' started at 2020-03-04 14:52:48.189
Test Case 'BuildPlanTests.testPkgConfigHintDiagnostic' started at 2020-03-04 14:52:48.189
/home/ec2-user/swiftpm/Tests/BuildTests/BuildPlanTests.swift:1028: error: BuildPlanTests.testPkgConfigHintDiagnostic : XCTAssertTrue failed -
Test Case 'BuildPlanTests.testPkgConfigHintDiagnostic' failed (0.023 seconds)
Test Suite 'BuildPlanTests' failed at 2020-03-04 14:52:48.212
Executed 1 test, with 1 failure (0 unexpected) in 0.023 (0.023) seconds
Test Suite 'Selected tests' failed at 2020-03-04 14:52:48.212
Executed 1 test, with 1 failure (0 unexpected) in 0.023 (0.023) seconds
Test Suite 'Selected tests' started at 2020-03-04 14:53:07.852
Test Suite 'PkgConfigTests' started at 2020-03-04 14:53:07.855
Test Case 'PkgConfigTests.testBasics' started at 2020-03-04 14:53:07.855
/home/ec2-user/swiftpm/Tests/PackageLoadingTests/PkgConfigTests.swift:60: error: PkgConfigTests.testBasics : failed - Expected a provider here
Test Case 'PkgConfigTests.testBasics' failed (0.008 seconds)
Test Suite 'PkgConfigTests' failed at 2020-03-04 14:53:07.863
Executed 1 test, with 1 failure (0 unexpected) in 0.008 (0.008) seconds
Test Suite 'Selected tests' failed at 2020-03-04 14:53:07.863
Executed 1 test, with 1 failure (0 unexpected) in 0.008 (0.008) seconds
--- bootstrap: error: tests failed with exit status 1
/home/ec2-user/swift/utils/build-script: fatal error: command terminated with a non-zero exit status 1, aborting
Building the standard library for: swift-stdlib-linux-x86_64
Running Swift tests for: check-swift-all-linux-x86_64 check-swift-all-optimize-linux-x86_64
/home/ec2-user/swift/utils/build-script: fatal error: command terminated with a non-zero exit status 1, aborting
Sign up for free to join this conversation on GitHub. Already have an account? Sign in to comment