public
Created

  • Download Gist
error
1 2 3 4 5 6 7 8 9 10 11 12 13 14 15 16 17 18 19
DEBUG: Executing shell function do_compile
NOTE: make -j3 -e MAKEFLAGS= KERNEL_PATH=/media/edna/97ece35c-5482-453e-82ec-e277c864b3e1/angstrom/setup-scripts/build/tmp-angstrom_v2012_12-eglibc/sysroots/beaglebone/usr/src/kernel KERNEL_SRC=/media/edna/97ece35c-5482-453e-82ec-e277c864b3e1/angstrom/setup-scripts/build/tmp-angstrom_v2012_12-eglibc/sysroots/beaglebone/usr/src/kernel KERNEL_VERSION=3.8.13 CC=arm-angstrom-linux-gnueabi-gcc -mno-thumb-interwork -marm LD=arm-angstrom-linux-gnueabi-ld AR=arm-angstrom-linux-gnueabi-ar BUILD=release TI_PLATFORM=ti335x
make -C /media/edna/97ece35c-5482-453e-82ec-e277c864b3e1/angstrom/setup-scripts/build/tmp-angstrom_v2012_12-eglibc/sysroots/beaglebone/usr/src/kernel M=`pwd`
make[1]: Entering directory `/media/edna/97ece35c-5482-453e-82ec-e277c864b3e1/angstrom/setup-scripts/build/tmp-angstrom_v2012_12-eglibc/sysroots/beaglebone/usr/src/kernel'
LD /media/edna/97ece35c-5482-453e-82ec-e277c864b3e1/angstrom/setup-scripts/build/tmp-angstrom_v2012_12-eglibc/work/beaglebone-angstrom-linux-gnueabi/omap3-sgx-modules-4.05.00.03-r23b/Graphics_SDK_4_05_00_03/GFX_Linux_KM/services4/3rdparty/bufferclass_ti/built-in.o
CC [M] /media/edna/97ece35c-5482-453e-82ec-e277c864b3e1/angstrom/setup-scripts/build/tmp-angstrom_v2012_12-eglibc/work/beaglebone-angstrom-linux-gnueabi/omap3-sgx-modules-4.05.00.03-r23b/Graphics_SDK_4_05_00_03/GFX_Linux_KM/services4/3rdparty/bufferclass_ti/bc_cat.o
/media/edna/97ece35c-5482-453e-82ec-e277c864b3e1/angstrom/setup-scripts/build/tmp-angstrom_v2012_12-eglibc/work/beaglebone-angstrom-linux-gnueabi/omap3-sgx-modules-4.05.00.03-r23b/Graphics_SDK_4_05_00_03/GFX_Linux_KM/services4/3rdparty/bufferclass_ti/bc_cat.c: In function 'bc_cat_init':
/media/edna/97ece35c-5482-453e-82ec-e277c864b3e1/angstrom/setup-scripts/build/tmp-angstrom_v2012_12-eglibc/work/beaglebone-angstrom-linux-gnueabi/omap3-sgx-modules-4.05.00.03-r23b/Graphics_SDK_4_05_00_03/GFX_Linux_KM/services4/3rdparty/bufferclass_ti/bc_cat.c:612:6: error: implicit declaration of function 'cpu_is_omap3530' [-Werror=implicit-function-declaration]
/media/edna/97ece35c-5482-453e-82ec-e277c864b3e1/angstrom/setup-scripts/build/tmp-angstrom_v2012_12-eglibc/work/beaglebone-angstrom-linux-gnueabi/omap3-sgx-modules-4.05.00.03-r23b/Graphics_SDK_4_05_00_03/GFX_Linux_KM/services4/3rdparty/bufferclass_ti/bc_cat.c:612:6: error: implicit declaration of function 'omap_rev' [-Werror=implicit-function-declaration]
/media/edna/97ece35c-5482-453e-82ec-e277c864b3e1/angstrom/setup-scripts/build/tmp-angstrom_v2012_12-eglibc/work/beaglebone-angstrom-linux-gnueabi/omap3-sgx-modules-4.05.00.03-r23b/Graphics_SDK_4_05_00_03/GFX_Linux_KM/services4/3rdparty/bufferclass_ti/bc_cat.c:612:56: error: 'OMAP3430_REV_ES3_0' undeclared (first use in this function)
/media/edna/97ece35c-5482-453e-82ec-e277c864b3e1/angstrom/setup-scripts/build/tmp-angstrom_v2012_12-eglibc/work/beaglebone-angstrom-linux-gnueabi/omap3-sgx-modules-4.05.00.03-r23b/Graphics_SDK_4_05_00_03/GFX_Linux_KM/services4/3rdparty/bufferclass_ti/bc_cat.c:612:56: note: each undeclared identifier is reported only once for each function it appears in
cc1: some warnings being treated as errors
make[3]: *** [/media/edna/97ece35c-5482-453e-82ec-e277c864b3e1/angstrom/setup-scripts/build/tmp-angstrom_v2012_12-eglibc/work/beaglebone-angstrom-linux-gnueabi/omap3-sgx-modules-4.05.00.03-r23b/Graphics_SDK_4_05_00_03/GFX_Linux_KM/services4/3rdparty/bufferclass_ti/bc_cat.o] Error 1
make[2]: *** [/media/edna/97ece35c-5482-453e-82ec-e277c864b3e1/angstrom/setup-scripts/build/tmp-angstrom_v2012_12-eglibc/work/beaglebone-angstrom-linux-gnueabi/omap3-sgx-modules-4.05.00.03-r23b/Graphics_SDK_4_05_00_03/GFX_Linux_KM/services4/3rdparty/bufferclass_ti] Error 2
make[1]: *** [_module_/media/edna/97ece35c-5482-453e-82ec-e277c864b3e1/angstrom/setup-scripts/build/tmp-angstrom_v2012_12-eglibc/work/beaglebone-angstrom-linux-gnueabi/omap3-sgx-modules-4.05.00.03-r23b/Graphics_SDK_4_05_00_03/GFX_Linux_KM] Error 2
make[1]: Leaving directory `/media/edna/97ece35c-5482-453e-82ec-e277c864b3e1/angstrom/setup-scripts/build/tmp-angstrom_v2012_12-eglibc/sysroots/beaglebone/usr/src/kernel'
make: *** [all] Error 2
ERROR: oe_runmake failed
ERROR: Function failed: do_compile (see /media/edna/97ece35c-5482-453e-82ec-e277c864b3e1/angstrom/setup-scripts/build/tmp-angstrom_v2012_12-eglibc/work/beaglebone-angstrom-linux-gnueabi/omap3-sgx-modules-4.05.00.03-r23b/temp/log.do_compile.15638 for further information)

Please sign in to comment on this gist.

Something went wrong with that request. Please try again.