Skip to content

Instantly share code, notes, and snippets.

Embed
What would you like to do?
rtorrent homebrew installation failure log with gcc v5.1.0 on OS X 10.10.3 - config.log
This file contains any messages produced by compilers while
running configure, to aid debugging if configure makes a mistake.
It was created by rtorrent configure 0.9.4, which was
generated by GNU Autoconf 2.69. Invocation command line was
$ ./configure --disable-debug --disable-dependency-tracking --prefix=/usr/local/Cellar/rtorrent/0.9.4_1
## --------- ##
## Platform. ##
## --------- ##
hostname = Premkumars-MacBook-Pro.local
uname -m = x86_64
uname -r = 14.3.0
uname -s = Darwin
uname -v = Darwin Kernel Version 14.3.0: Mon Mar 23 11:59:05 PDT 2015; root:xnu-2782.20.48~5/RELEASE_X86_64
/usr/bin/uname -p = i386
/bin/uname -X = unknown
/bin/arch = unknown
/usr/bin/arch -k = unknown
/usr/convex/getsysinfo = unknown
/usr/bin/hostinfo = Mach kernel version:
Darwin Kernel Version 14.3.0: Mon Mar 23 11:59:05 PDT 2015; root:xnu-2782.20.48~5/RELEASE_X86_64
Kernel configured for up to 8 processors.
4 processors are physically available.
8 processors are logically available.
Processor type: x86_64h (Intel x86-64h Haswell)
Processors active: 0 1 2 3 4 5 6 7
Primary memory available: 16.00 gigabytes
Default processor set: 273 tasks, 1766 threads, 8 processors
Load average: 1.54, Mach factor: 6.45
/bin/machine = unknown
/usr/bin/oslevel = unknown
/bin/universe = unknown
PATH: /usr/local/Library/ENV/4.3
PATH: /usr/local/opt/pkg-config/bin
PATH: /usr/local/opt/openssl/bin
PATH: /usr/bin
PATH: /bin
PATH: /usr/sbin
PATH: /sbin
PATH: /usr/local/opt/gcc/bin
## ----------- ##
## Core tests. ##
## ----------- ##
configure:2461: checking for a BSD-compatible install
configure:2529: result: /usr/bin/install -c
configure:2540: checking whether build environment is sane
configure:2595: result: yes
configure:2633: WARNING: 'missing' script is too old or missing
configure:2746: checking for a thread-safe mkdir -p
configure:2785: result: ./install-sh -c -d
configure:2792: checking for gawk
configure:2822: result: no
configure:2792: checking for mawk
configure:2822: result: no
configure:2792: checking for nawk
configure:2822: result: no
configure:2792: checking for awk
configure:2808: found /usr/bin/awk
configure:2819: result: awk
configure:2830: checking whether make sets $(MAKE)
configure:2852: result: yes
configure:2881: checking whether make supports nested variables
configure:2898: result: yes
configure:3059: checking for cppunit-config
configure:3090: result: no
configure:3100: checking for Cppunit - version >= 1.9.6
configure:3104: result: no
configure:3279: checking for C++ compiler version
configure:3288: g++-5 --version >&5
gcc-5 (Homebrew gcc 5.1.0) 5.1.0
Copyright (C) 2015 Free Software Foundation, Inc.
This is free software; see the source for copying conditions. There is NO
warranty; not even for MERCHANTABILITY or FITNESS FOR A PARTICULAR PURPOSE.
configure:3299: $? = 0
configure:3288: g++-5 -v >&5
Using built-in specs.
COLLECT_GCC=/usr/local/opt/gcc/bin/gcc-5
COLLECT_LTO_WRAPPER=/usr/local/Cellar/gcc/5.1.0/libexec/gcc/x86_64-apple-darwin14.3.0/5.1.0/lto-wrapper
Target: x86_64-apple-darwin14.3.0
Configured with: ../configure --build=x86_64-apple-darwin14.3.0 --prefix=/usr/local/Cellar/gcc/5.1.0 --libdir=/usr/local/Cellar/gcc/5.1.0/lib/gcc/5 --enable-languages=c,c++,objc,obj-c++,fortran --program-suffix=-5 --with-gmp=/usr/local/opt/gmp --with-mpfr=/usr/local/opt/mpfr --with-mpc=/usr/local/opt/libmpc --with-isl=/usr/local/opt/isl --with-system-zlib --enable-libstdcxx-time=yes --enable-stage1-checking --enable-checking=release --enable-lto --with-build-config=bootstrap-debug --disable-werror --with-pkgversion='Homebrew gcc 5.1.0' --with-bugurl=https://github.com/Homebrew/homebrew/issues --enable-plugin --disable-nls --enable-multilib --with-native-system-header-dir=/usr/include --with-sysroot=/Applications/Xcode.app/Contents/Developer/Platforms/MacOSX.platform/Developer/SDKs/MacOSX10.10.sdk
Thread model: posix
gcc version 5.1.0 (Homebrew gcc 5.1.0)
configure:3299: $? = 0
configure:3288: g++-5 -V >&5
gcc-5: error: unrecognized command line option '-V'
configure:3299: $? = 1
configure:3288: g++-5 -qversion >&5
gcc-5: error: unrecognized command line option '-qversion'
configure:3299: $? = 1
configure:3319: checking whether the C++ compiler works
configure:3341: g++-5 conftest.cpp >&5
configure:3345: $? = 0
configure:3393: result: yes
configure:3396: checking for C++ compiler default output file name
configure:3398: result: a.out
configure:3404: checking for suffix of executables
configure:3411: g++-5 -o conftest conftest.cpp >&5
configure:3415: $? = 0
configure:3437: result:
configure:3459: checking whether we are cross compiling
configure:3467: g++-5 -o conftest conftest.cpp >&5
configure:3471: $? = 0
configure:3478: ./conftest
configure:3482: $? = 0
configure:3497: result: no
configure:3502: checking for suffix of object files
configure:3524: g++-5 -c conftest.cpp >&5
configure:3528: $? = 0
configure:3549: result: o
configure:3553: checking whether we are using the GNU C++ compiler
configure:3572: g++-5 -c conftest.cpp >&5
configure:3572: $? = 0
configure:3581: result: yes
configure:3590: checking whether g++-5 accepts -g
configure:3610: g++-5 -c -g conftest.cpp >&5
configure:3610: $? = 0
configure:3651: result: yes
configure:3685: checking for style of include used by make
configure:3713: result: GNU
configure:3739: checking dependency style of g++-5
configure:3850: result: none
configure:3894: checking build system type
configure:3908: result: x86_64-apple-darwin14.3.0
configure:3928: checking host system type
configure:3941: result: x86_64-apple-darwin14.3.0
configure:3982: checking how to print strings
configure:4009: result: printf
configure:4078: checking for gcc
configure:4105: result: gcc-5
configure:4334: checking for C compiler version
configure:4343: gcc-5 --version >&5
gcc-5 (Homebrew gcc 5.1.0) 5.1.0
Copyright (C) 2015 Free Software Foundation, Inc.
This is free software; see the source for copying conditions. There is NO
warranty; not even for MERCHANTABILITY or FITNESS FOR A PARTICULAR PURPOSE.
configure:4354: $? = 0
configure:4343: gcc-5 -v >&5
Using built-in specs.
COLLECT_GCC=/usr/local/opt/gcc/bin/gcc-5
COLLECT_LTO_WRAPPER=/usr/local/Cellar/gcc/5.1.0/libexec/gcc/x86_64-apple-darwin14.3.0/5.1.0/lto-wrapper
Target: x86_64-apple-darwin14.3.0
Configured with: ../configure --build=x86_64-apple-darwin14.3.0 --prefix=/usr/local/Cellar/gcc/5.1.0 --libdir=/usr/local/Cellar/gcc/5.1.0/lib/gcc/5 --enable-languages=c,c++,objc,obj-c++,fortran --program-suffix=-5 --with-gmp=/usr/local/opt/gmp --with-mpfr=/usr/local/opt/mpfr --with-mpc=/usr/local/opt/libmpc --with-isl=/usr/local/opt/isl --with-system-zlib --enable-libstdcxx-time=yes --enable-stage1-checking --enable-checking=release --enable-lto --with-build-config=bootstrap-debug --disable-werror --with-pkgversion='Homebrew gcc 5.1.0' --with-bugurl=https://github.com/Homebrew/homebrew/issues --enable-plugin --disable-nls --enable-multilib --with-native-system-header-dir=/usr/include --with-sysroot=/Applications/Xcode.app/Contents/Developer/Platforms/MacOSX.platform/Developer/SDKs/MacOSX10.10.sdk
Thread model: posix
gcc version 5.1.0 (Homebrew gcc 5.1.0)
configure:4354: $? = 0
configure:4343: gcc-5 -V >&5
gcc-5: error: unrecognized command line option '-V'
configure:4354: $? = 1
configure:4343: gcc-5 -qversion >&5
gcc-5: error: unrecognized command line option '-qversion'
configure:4354: $? = 1
configure:4358: checking whether we are using the GNU C compiler
configure:4377: gcc-5 -c conftest.c >&5
configure:4377: $? = 0
configure:4386: result: yes
configure:4395: checking whether gcc-5 accepts -g
configure:4415: gcc-5 -c -g conftest.c >&5
configure:4415: $? = 0
configure:4456: result: yes
configure:4473: checking for gcc-5 option to accept ISO C89
configure:4536: gcc-5 -c -g -O2 conftest.c >&5
configure:4536: $? = 0
configure:4549: result: none needed
configure:4574: checking whether gcc-5 understands -c and -o together
configure:4596: gcc-5 -c conftest.c -o conftest2.o
configure:4599: $? = 0
configure:4596: gcc-5 -c conftest.c -o conftest2.o
configure:4599: $? = 0
configure:4611: result: yes
configure:4630: checking dependency style of gcc-5
configure:4741: result: none
configure:4756: checking for a sed that does not truncate output
configure:4820: result: /usr/local/Library/ENV/4.3/sed
configure:4838: checking for grep that handles long lines and -e
configure:4896: result: /usr/bin/grep
configure:4901: checking for egrep
configure:4963: result: /usr/bin/grep -E
configure:4968: checking for fgrep
configure:5030: result: /usr/bin/grep -F
configure:5065: checking for ld used by gcc-5
configure:5132: result: /usr/local/Library/ENV/4.3/ld
configure:5139: checking if the linker (/usr/local/Library/ENV/4.3/ld) is GNU ld
configure:5154: result: no
configure:5166: checking for BSD- or MS-compatible name lister (nm)
configure:5215: result: /usr/bin/nm
configure:5345: checking the name lister (/usr/bin/nm) interface
configure:5352: gcc-5 -c -g -O2 conftest.c >&5
configure:5355: /usr/bin/nm "conftest.o"
configure:5358: output
00000000000001b0 S _some_variable
configure:5365: result: BSD nm
configure:5368: checking whether ln -s works
configure:5372: result: yes
configure:5380: checking the maximum length of command line arguments
configure:5510: result: 196608
configure:5527: checking whether the shell understands some XSI constructs
configure:5537: result: yes
configure:5541: checking whether the shell understands "+="
configure:5547: result: yes
configure:5582: checking how to convert x86_64-apple-darwin14.3.0 file names to x86_64-apple-darwin14.3.0 format
configure:5622: result: func_convert_file_noop
configure:5629: checking how to convert x86_64-apple-darwin14.3.0 file names to toolchain format
configure:5649: result: func_convert_file_noop
configure:5656: checking for /usr/local/Library/ENV/4.3/ld option to reload object files
configure:5663: result: -r
configure:5737: checking for objdump
configure:5767: result: no
configure:5796: checking how to recognize dependent libraries
configure:5998: result: pass_all
configure:6083: checking for dlltool
configure:6113: result: no
configure:6143: checking how to associate runtime and link libraries
configure:6170: result: printf %s\n
configure:6231: checking for ar
configure:6247: found /usr/bin/ar
configure:6258: result: ar
configure:6295: checking for archiver @FILE support
configure:6312: gcc-5 -c -g -O2 conftest.c >&5
configure:6312: $? = 0
configure:6315: ar cru libconftest.a @conftest.lst >&5
ar: @conftest.lst: No such file or directory
configure:6318: $? = 1
configure:6338: result: no
configure:6396: checking for strip
configure:6412: found /usr/bin/strip
configure:6423: result: strip
configure:6495: checking for ranlib
configure:6511: found /usr/bin/ranlib
configure:6522: result: ranlib
configure:6624: checking command to parse /usr/bin/nm output from gcc-5 object
configure:6744: gcc-5 -c -g -O2 conftest.c >&5
configure:6747: $? = 0
configure:6751: /usr/bin/nm conftest.o \| sed -n -e 's/^.*[ ]\([BCDEGRST][BCDEGRST]*\)[ ][ ]*\([_A-Za-z][_A-Za-z0-9]*\)$/\1 \2 \2/p' | sed '/ __gnu_lto/d' \> conftest.nm
configure:6754: $? = 0
cannot find nm_test_var in conftest.nm
configure:6744: gcc-5 -c -g -O2 conftest.c >&5
configure:6747: $? = 0
configure:6751: /usr/bin/nm conftest.o \| sed -n -e 's/^.*[ ]\([BCDEGRST][BCDEGRST]*\)[ ][ ]*_\([_A-Za-z][_A-Za-z0-9]*\)$/\1 _\2 \2/p' | sed '/ __gnu_lto/d' \> conftest.nm
configure:6754: $? = 0
configure:6820: gcc-5 -o conftest -g -O2 conftest.c conftstm.o >&5
configure:6823: $? = 0
configure:6861: result: ok
configure:6898: checking for sysroot
configure:6928: result: no
configure:7184: checking for mt
configure:7214: result: no
configure:7234: checking if : is a manifest tool
configure:7240: : '-?'
configure:7248: result: no
configure:7304: checking for dsymutil
configure:7320: found /usr/bin/dsymutil
configure:7331: result: dsymutil
configure:7396: checking for nmedit
configure:7412: found /usr/bin/nmedit
configure:7423: result: nmedit
configure:7488: checking for lipo
configure:7504: found /usr/bin/lipo
configure:7515: result: lipo
configure:7580: checking for otool
configure:7596: found /usr/bin/otool
configure:7607: result: otool
configure:7672: checking for otool64
configure:7702: result: no
configure:7747: checking for -single_module linker flag
gcc-5 -g -O2 -o libconftest.dylib -dynamiclib -Wl,-single_module conftest.c
configure:7780: result: yes
configure:7783: checking for -exported_symbols_list linker flag
configure:7803: gcc-5 -o conftest -g -O2 -Wl,-exported_symbols_list,conftest.sym conftest.c >&5
configure:7803: $? = 0
configure:7813: result: yes
configure:7816: checking for -force_load linker flag
gcc-5 -g -O2 -c -o conftest.o conftest.c
ar cru libconftest.a conftest.o
ranlib libconftest.a
gcc-5 -g -O2 -o conftest conftest.c -Wl,-force_load,./libconftest.a
configure:7848: result: yes
configure:7890: checking how to run the C preprocessor
configure:7921: gcc-5 -E conftest.c
configure:7921: $? = 0
configure:7935: gcc-5 -E conftest.c
conftest.c:12:28: fatal error: ac_nonexistent.h: No such file or directory
compilation terminated.
configure:7935: $? = 1
configure: failed program was:
| /* confdefs.h */
| #define PACKAGE_NAME "rtorrent"
| #define PACKAGE_TARNAME "rtorrent"
| #define PACKAGE_VERSION "0.9.4"
| #define PACKAGE_STRING "rtorrent 0.9.4"
| #define PACKAGE_BUGREPORT "sundell.software@gmail.com"
| #define PACKAGE_URL ""
| #define API_VERSION 8
| #define PACKAGE "rtorrent"
| #define VERSION "0.9.4"
| /* end confdefs.h. */
| #include <ac_nonexistent.h>
configure:7960: result: gcc-5 -E
configure:7980: gcc-5 -E conftest.c
configure:7980: $? = 0
configure:7994: gcc-5 -E conftest.c
conftest.c:12:28: fatal error: ac_nonexistent.h: No such file or directory
compilation terminated.
configure:7994: $? = 1
configure: failed program was:
| /* confdefs.h */
| #define PACKAGE_NAME "rtorrent"
| #define PACKAGE_TARNAME "rtorrent"
| #define PACKAGE_VERSION "0.9.4"
| #define PACKAGE_STRING "rtorrent 0.9.4"
| #define PACKAGE_BUGREPORT "sundell.software@gmail.com"
| #define PACKAGE_URL ""
| #define API_VERSION 8
| #define PACKAGE "rtorrent"
| #define VERSION "0.9.4"
| /* end confdefs.h. */
| #include <ac_nonexistent.h>
configure:8023: checking for ANSI C header files
configure:8043: gcc-5 -c -g -O2 conftest.c >&5
configure:8043: $? = 0
configure:8116: gcc-5 -o conftest -g -O2 conftest.c >&5
configure:8116: $? = 0
configure:8116: ./conftest
configure:8116: $? = 0
configure:8127: result: yes
configure:8140: checking for sys/types.h
configure:8140: gcc-5 -c -g -O2 conftest.c >&5
configure:8140: $? = 0
configure:8140: result: yes
configure:8140: checking for sys/stat.h
configure:8140: gcc-5 -c -g -O2 conftest.c >&5
configure:8140: $? = 0
configure:8140: result: yes
configure:8140: checking for stdlib.h
configure:8140: gcc-5 -c -g -O2 conftest.c >&5
configure:8140: $? = 0
configure:8140: result: yes
configure:8140: checking for string.h
configure:8140: gcc-5 -c -g -O2 conftest.c >&5
configure:8140: $? = 0
configure:8140: result: yes
configure:8140: checking for memory.h
configure:8140: gcc-5 -c -g -O2 conftest.c >&5
configure:8140: $? = 0
configure:8140: result: yes
configure:8140: checking for strings.h
configure:8140: gcc-5 -c -g -O2 conftest.c >&5
configure:8140: $? = 0
configure:8140: result: yes
configure:8140: checking for inttypes.h
configure:8140: gcc-5 -c -g -O2 conftest.c >&5
configure:8140: $? = 0
configure:8140: result: yes
configure:8140: checking for stdint.h
configure:8140: gcc-5 -c -g -O2 conftest.c >&5
configure:8140: $? = 0
configure:8140: result: yes
configure:8140: checking for unistd.h
configure:8140: gcc-5 -c -g -O2 conftest.c >&5
configure:8140: $? = 0
configure:8140: result: yes
configure:8154: checking for dlfcn.h
configure:8154: gcc-5 -c -g -O2 conftest.c >&5
configure:8154: $? = 0
configure:8154: result: yes
configure:8371: checking for objdir
configure:8386: result: .libs
configure:8657: checking if gcc-5 supports -fno-rtti -fno-exceptions
configure:8675: gcc-5 -c -g -O2 -fno-rtti -fno-exceptions conftest.c >&5
cc1: warning: command line option '-fno-rtti' is valid for C++/ObjC++ but not for C
configure:8679: $? = 0
configure:8692: result: no
configure:9019: checking for gcc-5 option to produce PIC
configure:9026: result: -fno-common -DPIC
configure:9034: checking if gcc-5 PIC flag -fno-common -DPIC works
configure:9052: gcc-5 -c -g -O2 -fno-common -DPIC -DPIC conftest.c >&5
configure:9056: $? = 0
configure:9069: result: yes
configure:9098: checking if gcc-5 static flag -static works
configure:9126: result: no
configure:9141: checking if gcc-5 supports -c -o file.o
configure:9162: gcc-5 -c -g -O2 -o out/conftest2.o conftest.c >&5
configure:9166: $? = 0
configure:9188: result: yes
configure:9196: checking if gcc-5 supports -c -o file.o
configure:9243: result: yes
configure:9276: checking whether the gcc-5 linker (/usr/local/Library/ENV/4.3/ld) supports shared libraries
configure:10429: result: yes
configure:10669: checking dynamic linker characteristics
configure:11402: result: darwin14.3.0 dyld
configure:11509: checking how to hardcode library paths into programs
configure:11534: result: immediate
configure:12074: checking whether stripping libraries is possible
configure:12088: result: yes
configure:12114: checking if libtool supports shared libraries
configure:12116: result: yes
configure:12119: checking whether to build shared libraries
configure:12140: result: yes
configure:12143: checking whether to build static libraries
configure:12147: result: yes
configure:12170: checking how to run the C++ preprocessor
configure:12197: g++-5 -E conftest.cpp
configure:12197: $? = 0
configure:12211: g++-5 -E conftest.cpp
conftest.cpp:24:28: fatal error: ac_nonexistent.h: No such file or directory
compilation terminated.
configure:12211: $? = 1
configure: failed program was:
| /* confdefs.h */
| #define PACKAGE_NAME "rtorrent"
| #define PACKAGE_TARNAME "rtorrent"
| #define PACKAGE_VERSION "0.9.4"
| #define PACKAGE_STRING "rtorrent 0.9.4"
| #define PACKAGE_BUGREPORT "sundell.software@gmail.com"
| #define PACKAGE_URL ""
| #define API_VERSION 8
| #define PACKAGE "rtorrent"
| #define VERSION "0.9.4"
| #define STDC_HEADERS 1
| #define HAVE_SYS_TYPES_H 1
| #define HAVE_SYS_STAT_H 1
| #define HAVE_STDLIB_H 1
| #define HAVE_STRING_H 1
| #define HAVE_MEMORY_H 1
| #define HAVE_STRINGS_H 1
| #define HAVE_INTTYPES_H 1
| #define HAVE_STDINT_H 1
| #define HAVE_UNISTD_H 1
| #define HAVE_DLFCN_H 1
| #define LT_OBJDIR ".libs/"
| /* end confdefs.h. */
| #include <ac_nonexistent.h>
configure:12236: result: g++-5 -E
configure:12256: g++-5 -E conftest.cpp
configure:12256: $? = 0
configure:12270: g++-5 -E conftest.cpp
conftest.cpp:24:28: fatal error: ac_nonexistent.h: No such file or directory
compilation terminated.
configure:12270: $? = 1
configure: failed program was:
| /* confdefs.h */
| #define PACKAGE_NAME "rtorrent"
| #define PACKAGE_TARNAME "rtorrent"
| #define PACKAGE_VERSION "0.9.4"
| #define PACKAGE_STRING "rtorrent 0.9.4"
| #define PACKAGE_BUGREPORT "sundell.software@gmail.com"
| #define PACKAGE_URL ""
| #define API_VERSION 8
| #define PACKAGE "rtorrent"
| #define VERSION "0.9.4"
| #define STDC_HEADERS 1
| #define HAVE_SYS_TYPES_H 1
| #define HAVE_SYS_STAT_H 1
| #define HAVE_STDLIB_H 1
| #define HAVE_STRING_H 1
| #define HAVE_MEMORY_H 1
| #define HAVE_STRINGS_H 1
| #define HAVE_INTTYPES_H 1
| #define HAVE_STDINT_H 1
| #define HAVE_UNISTD_H 1
| #define HAVE_DLFCN_H 1
| #define LT_OBJDIR ".libs/"
| /* end confdefs.h. */
| #include <ac_nonexistent.h>
configure:12439: checking for ld used by g++-5
configure:12506: result: /usr/local/Library/ENV/4.3/ld
configure:12513: checking if the linker (/usr/local/Library/ENV/4.3/ld) is GNU ld
configure:12528: result: no
configure:12583: checking whether the g++-5 linker (/usr/local/Library/ENV/4.3/ld) supports shared libraries
configure:13588: result: yes
configure:13624: g++-5 -c -g -O2 conftest.cpp >&5
configure:13627: $? = 0
configure:14147: checking for g++-5 option to produce PIC
configure:14154: result: -fno-common -DPIC
configure:14162: checking if g++-5 PIC flag -fno-common -DPIC works
configure:14180: g++-5 -c -g -O2 -fno-common -DPIC -DPIC conftest.cpp >&5
configure:14184: $? = 0
configure:14197: result: yes
configure:14220: checking if g++-5 static flag -static works
configure:14248: result: no
configure:14260: checking if g++-5 supports -c -o file.o
configure:14281: g++-5 -c -g -O2 -o out/conftest2.o conftest.cpp >&5
configure:14285: $? = 0
configure:14307: result: yes
configure:14312: checking if g++-5 supports -c -o file.o
configure:14359: result: yes
configure:14389: checking whether the g++-5 linker (/usr/local/Library/ENV/4.3/ld) supports shared libraries
configure:14425: result: yes
configure:14566: checking dynamic linker characteristics
configure:15233: result: darwin14.3.0 dyld
configure:15286: checking how to hardcode library paths into programs
configure:15311: result: immediate
configure:15375: checking for user-defined CXXFLAGS
configure:15379: result: user-defined "-g -O2"
configure:15491: checking for TR1 support
configure:15502: g++-5 -c -g -O2 -DNDEBUG conftest.cpp >&5
configure:15502: $? = 0
configure:15504: result: yes
configure:15596: checking for C++11 support
configure:15610: g++-5 -c -g -O2 -DNDEBUG conftest.cpp >&5
In file included from /usr/local/Cellar/gcc/5.1.0/include/c++/5.1.0/unordered_map:35:0,
from conftest.cpp:27:
/usr/local/Cellar/gcc/5.1.0/include/c++/5.1.0/bits/c++0x_warning.h:32:2: error: #error This file requires compiler and library support for the ISO C++ 2011 standard. This support is currently experimental, and must be enabled with the -std=c++11 or -std=gnu++11 compiler options.
#error This file requires compiler and library support for the \
^
conftest.cpp:29:20: error: 'unordered_map' in namespace 'std' does not name a template type
typedef std::unordered_map<Foo*, int> Bar;
^
conftest.cpp:31:20: error: 'Bar' does not name a type
union test { Bar b1; };
^
configure:15610: $? = 1
configure: failed program was:
| /* confdefs.h */
| #define PACKAGE_NAME "rtorrent"
| #define PACKAGE_TARNAME "rtorrent"
| #define PACKAGE_VERSION "0.9.4"
| #define PACKAGE_STRING "rtorrent 0.9.4"
| #define PACKAGE_BUGREPORT "sundell.software@gmail.com"
| #define PACKAGE_URL ""
| #define API_VERSION 8
| #define PACKAGE "rtorrent"
| #define VERSION "0.9.4"
| #define STDC_HEADERS 1
| #define HAVE_SYS_TYPES_H 1
| #define HAVE_SYS_STAT_H 1
| #define HAVE_STDLIB_H 1
| #define HAVE_STRING_H 1
| #define HAVE_MEMORY_H 1
| #define HAVE_STRINGS_H 1
| #define HAVE_INTTYPES_H 1
| #define HAVE_STDINT_H 1
| #define HAVE_UNISTD_H 1
| #define HAVE_DLFCN_H 1
| #define LT_OBJDIR ".libs/"
| #define HAVE_TR1 1
| /* end confdefs.h. */
|
| #include <functional>
| #include <unordered_map>
| class Foo;
| typedef std::unordered_map<Foo*, int> Bar;
|
| union test { Bar b1; };
|
configure:15620: result: no
configure:15661: checking for special C compiler options needed for large files
configure:15706: result: no
configure:15712: checking for _FILE_OFFSET_BITS value needed for large files
configure:15737: gcc-5 -c -g -O2 conftest.c >&5
configure:15737: $? = 0
configure:15769: result: no
configure:15856: checking for execinfo.h
configure:15872: gcc-5 -o conftest -g -O2 conftest.c >&5
conftest.c: In function 'main':
conftest.c:27:63: warning: passing argument 1 of 'backtrace_symbols' from incompatible pointer type [-Wincompatible-pointer-types]
int main() { backtrace((void**)0, 0); backtrace_symbols((char**)0, 0); return 0;}
^
In file included from conftest.c:26:0:
/Applications/Xcode.app/Contents/Developer/Platforms/MacOSX.platform/Developer/SDKs/MacOSX10.10.sdk/usr/include/execinfo.h:32:8: note: expected 'void * const*' but argument is of type 'char **'
char** backtrace_symbols(void* const*,int) __OSX_AVAILABLE_STARTING(__MAC_10_5, __IPHONE_2_0);
^
configure:15872: $? = 0
configure:15872: ./conftest
configure:15872: $? = 0
configure:15874: result: yes
configure:15898: checking for proper overloaded template function disambiguation
configure:15909: g++-5 -c -g -O2 -DNDEBUG conftest.cpp >&5
configure:15909: $? = 0
configure:15911: result: yes
configure:15964: checking for sysroot
configure:15968: result: no
configure:16100: checking sys/vfs.h usability
configure:16100: gcc-5 -c -g -O2 conftest.c >&5
conftest.c:60:21: fatal error: sys/vfs.h: No such file or directory
compilation terminated.
configure:16100: $? = 1
configure: failed program was:
| /* confdefs.h */
| #define PACKAGE_NAME "rtorrent"
| #define PACKAGE_TARNAME "rtorrent"
| #define PACKAGE_VERSION "0.9.4"
| #define PACKAGE_STRING "rtorrent 0.9.4"
| #define PACKAGE_BUGREPORT "sundell.software@gmail.com"
| #define PACKAGE_URL ""
| #define API_VERSION 8
| #define PACKAGE "rtorrent"
| #define VERSION "0.9.4"
| #define STDC_HEADERS 1
| #define HAVE_SYS_TYPES_H 1
| #define HAVE_SYS_STAT_H 1
| #define HAVE_STDLIB_H 1
| #define HAVE_STRING_H 1
| #define HAVE_MEMORY_H 1
| #define HAVE_STRINGS_H 1
| #define HAVE_INTTYPES_H 1
| #define HAVE_STDINT_H 1
| #define HAVE_UNISTD_H 1
| #define HAVE_DLFCN_H 1
| #define LT_OBJDIR ".libs/"
| #define HAVE_TR1 1
| #define USE_EXECINFO 1
| #define USE_VARIABLE_FDSET 1
| /* end confdefs.h. */
| #include <stdio.h>
| #ifdef HAVE_SYS_TYPES_H
| # include <sys/types.h>
| #endif
| #ifdef HAVE_SYS_STAT_H
| # include <sys/stat.h>
| #endif
| #ifdef STDC_HEADERS
| # include <stdlib.h>
| # include <stddef.h>
| #else
| # ifdef HAVE_STDLIB_H
| # include <stdlib.h>
| # endif
| #endif
| #ifdef HAVE_STRING_H
| # if !defined STDC_HEADERS && defined HAVE_MEMORY_H
| # include <memory.h>
| # endif
| # include <string.h>
| #endif
| #ifdef HAVE_STRINGS_H
| # include <strings.h>
| #endif
| #ifdef HAVE_INTTYPES_H
| # include <inttypes.h>
| #endif
| #ifdef HAVE_STDINT_H
| # include <stdint.h>
| #endif
| #ifdef HAVE_UNISTD_H
| # include <unistd.h>
| #endif
| #include <sys/vfs.h>
configure:16100: result: no
configure:16100: checking sys/vfs.h presence
configure:16100: gcc-5 -E conftest.c
conftest.c:27:21: fatal error: sys/vfs.h: No such file or directory
compilation terminated.
configure:16100: $? = 1
configure: failed program was:
| /* confdefs.h */
| #define PACKAGE_NAME "rtorrent"
| #define PACKAGE_TARNAME "rtorrent"
| #define PACKAGE_VERSION "0.9.4"
| #define PACKAGE_STRING "rtorrent 0.9.4"
| #define PACKAGE_BUGREPORT "sundell.software@gmail.com"
| #define PACKAGE_URL ""
| #define API_VERSION 8
| #define PACKAGE "rtorrent"
| #define VERSION "0.9.4"
| #define STDC_HEADERS 1
| #define HAVE_SYS_TYPES_H 1
| #define HAVE_SYS_STAT_H 1
| #define HAVE_STDLIB_H 1
| #define HAVE_STRING_H 1
| #define HAVE_MEMORY_H 1
| #define HAVE_STRINGS_H 1
| #define HAVE_INTTYPES_H 1
| #define HAVE_STDINT_H 1
| #define HAVE_UNISTD_H 1
| #define HAVE_DLFCN_H 1
| #define LT_OBJDIR ".libs/"
| #define HAVE_TR1 1
| #define USE_EXECINFO 1
| #define USE_VARIABLE_FDSET 1
| /* end confdefs.h. */
| #include <sys/vfs.h>
configure:16100: result: no
configure:16100: checking for sys/vfs.h
configure:16100: result: no
configure:16100: checking sys/statvfs.h usability
configure:16100: gcc-5 -c -g -O2 conftest.c >&5
configure:16100: $? = 0
configure:16100: result: yes
configure:16100: checking sys/statvfs.h presence
configure:16100: gcc-5 -E conftest.c
configure:16100: $? = 0
configure:16100: result: yes
configure:16100: checking for sys/statvfs.h
configure:16100: result: yes
configure:16100: checking sys/statfs.h usability
configure:16100: gcc-5 -c -g -O2 conftest.c >&5
conftest.c:61:24: fatal error: sys/statfs.h: No such file or directory
compilation terminated.
configure:16100: $? = 1
configure: failed program was:
| /* confdefs.h */
| #define PACKAGE_NAME "rtorrent"
| #define PACKAGE_TARNAME "rtorrent"
| #define PACKAGE_VERSION "0.9.4"
| #define PACKAGE_STRING "rtorrent 0.9.4"
| #define PACKAGE_BUGREPORT "sundell.software@gmail.com"
| #define PACKAGE_URL ""
| #define API_VERSION 8
| #define PACKAGE "rtorrent"
| #define VERSION "0.9.4"
| #define STDC_HEADERS 1
| #define HAVE_SYS_TYPES_H 1
| #define HAVE_SYS_STAT_H 1
| #define HAVE_STDLIB_H 1
| #define HAVE_STRING_H 1
| #define HAVE_MEMORY_H 1
| #define HAVE_STRINGS_H 1
| #define HAVE_INTTYPES_H 1
| #define HAVE_STDINT_H 1
| #define HAVE_UNISTD_H 1
| #define HAVE_DLFCN_H 1
| #define LT_OBJDIR ".libs/"
| #define HAVE_TR1 1
| #define USE_EXECINFO 1
| #define USE_VARIABLE_FDSET 1
| #define HAVE_SYS_STATVFS_H 1
| /* end confdefs.h. */
| #include <stdio.h>
| #ifdef HAVE_SYS_TYPES_H
| # include <sys/types.h>
| #endif
| #ifdef HAVE_SYS_STAT_H
| # include <sys/stat.h>
| #endif
| #ifdef STDC_HEADERS
| # include <stdlib.h>
| # include <stddef.h>
| #else
| # ifdef HAVE_STDLIB_H
| # include <stdlib.h>
| # endif
| #endif
| #ifdef HAVE_STRING_H
| # if !defined STDC_HEADERS && defined HAVE_MEMORY_H
| # include <memory.h>
| # endif
| # include <string.h>
| #endif
| #ifdef HAVE_STRINGS_H
| # include <strings.h>
| #endif
| #ifdef HAVE_INTTYPES_H
| # include <inttypes.h>
| #endif
| #ifdef HAVE_STDINT_H
| # include <stdint.h>
| #endif
| #ifdef HAVE_UNISTD_H
| # include <unistd.h>
| #endif
| #include <sys/statfs.h>
configure:16100: result: no
configure:16100: checking sys/statfs.h presence
configure:16100: gcc-5 -E conftest.c
conftest.c:28:24: fatal error: sys/statfs.h: No such file or directory
compilation terminated.
configure:16100: $? = 1
configure: failed program was:
| /* confdefs.h */
| #define PACKAGE_NAME "rtorrent"
| #define PACKAGE_TARNAME "rtorrent"
| #define PACKAGE_VERSION "0.9.4"
| #define PACKAGE_STRING "rtorrent 0.9.4"
| #define PACKAGE_BUGREPORT "sundell.software@gmail.com"
| #define PACKAGE_URL ""
| #define API_VERSION 8
| #define PACKAGE "rtorrent"
| #define VERSION "0.9.4"
| #define STDC_HEADERS 1
| #define HAVE_SYS_TYPES_H 1
| #define HAVE_SYS_STAT_H 1
| #define HAVE_STDLIB_H 1
| #define HAVE_STRING_H 1
| #define HAVE_MEMORY_H 1
| #define HAVE_STRINGS_H 1
| #define HAVE_INTTYPES_H 1
| #define HAVE_STDINT_H 1
| #define HAVE_UNISTD_H 1
| #define HAVE_DLFCN_H 1
| #define LT_OBJDIR ".libs/"
| #define HAVE_TR1 1
| #define USE_EXECINFO 1
| #define USE_VARIABLE_FDSET 1
| #define HAVE_SYS_STATVFS_H 1
| /* end confdefs.h. */
| #include <sys/statfs.h>
configure:16100: result: no
configure:16100: checking for sys/statfs.h
configure:16100: result: no
configure:16111: checking for statvfs
configure:16139: gcc-5 -o conftest -g -O2 conftest.c >&5
configure:16139: $? = 0
configure:16159: result: ok
configure:16510: checking whether pthreads work without any flags
configure:16603: gcc-5 -o conftest -g -O2 conftest.c >&5
configure:16603: $? = 0
configure:16612: result: yes
configure:16631: checking for joinable pthread attribute
configure:16646: gcc-5 -o conftest -g -O2 conftest.c >&5
configure:16646: $? = 0
configure:16652: result: PTHREAD_CREATE_JOINABLE
configure:16662: checking if more special flags are required for pthreads
configure:16676: result: -D_THREAD_SAFE
configure:16682: checking for PTHREAD_PRIO_INHERIT
configure:16700: gcc-5 -o conftest -g -O2 conftest.c >&5
configure:16700: $? = 0
configure:16709: result: yes
configure:16827: checking for NcursesW wide-character library
configure:16851: gcc-5 -o conftest -g -O2 conftest.c -lncursesw >&5
ld: library not found for -lncursesw
collect2: error: ld returned 1 exit status
configure:16851: $? = 1
configure: failed program was:
| /* confdefs.h */
| #define PACKAGE_NAME "rtorrent"
| #define PACKAGE_TARNAME "rtorrent"
| #define PACKAGE_VERSION "0.9.4"
| #define PACKAGE_STRING "rtorrent 0.9.4"
| #define PACKAGE_BUGREPORT "sundell.software@gmail.com"
| #define PACKAGE_URL ""
| #define API_VERSION 8
| #define PACKAGE "rtorrent"
| #define VERSION "0.9.4"
| #define STDC_HEADERS 1
| #define HAVE_SYS_TYPES_H 1
| #define HAVE_SYS_STAT_H 1
| #define HAVE_STDLIB_H 1
| #define HAVE_STRING_H 1
| #define HAVE_MEMORY_H 1
| #define HAVE_STRINGS_H 1
| #define HAVE_INTTYPES_H 1
| #define HAVE_STDINT_H 1
| #define HAVE_UNISTD_H 1
| #define HAVE_DLFCN_H 1
| #define LT_OBJDIR ".libs/"
| #define HAVE_TR1 1
| #define USE_EXECINFO 1
| #define USE_VARIABLE_FDSET 1
| #define HAVE_SYS_STATVFS_H 1
| #define FS_STAT_FD fstatvfs(fd, &m_stat) == 0
| #define FS_STAT_FN statvfs(fn, &m_stat) == 0
| #define FS_STAT_STRUCT struct statvfs
| #define FS_STAT_SIZE_TYPE unsigned long
| #define FS_STAT_COUNT_TYPE fsblkcnt_t
| #define FS_STAT_BLOCK_SIZE (m_stat.f_frsize)
| #define HAVE_PTHREAD_PRIO_INHERIT 1
| #define HAVE_PTHREAD 1
| /* end confdefs.h. */
|
| /* Override any GCC internal prototype to avoid an error.
| Use char because int might match the return type of a GCC
| builtin and then its argument prototype would still apply. */
| #ifdef __cplusplus
| extern "C"
| #endif
| char initscr ();
| int
| main ()
| {
| return initscr ();
| ;
| return 0;
| }
configure:16860: result: no
configure:17204: checking for Ncurses library
configure:17228: gcc-5 -o conftest -g -O2 conftest.c -lncurses >&5
configure:17228: $? = 0
configure:17237: result: yes
configure:17257: checking for working ncurses/curses.h
configure:17284: gcc-5 -o conftest -g -O2 conftest.c -lncurses >&5
conftest.c:39:52: fatal error: ncurses/curses.h: No such file or directory
compilation terminated.
configure:17284: $? = 1
configure: failed program was:
| /* confdefs.h */
| #define PACKAGE_NAME "rtorrent"
| #define PACKAGE_TARNAME "rtorrent"
| #define PACKAGE_VERSION "0.9.4"
| #define PACKAGE_STRING "rtorrent 0.9.4"
| #define PACKAGE_BUGREPORT "sundell.software@gmail.com"
| #define PACKAGE_URL ""
| #define API_VERSION 8
| #define PACKAGE "rtorrent"
| #define VERSION "0.9.4"
| #define STDC_HEADERS 1
| #define HAVE_SYS_TYPES_H 1
| #define HAVE_SYS_STAT_H 1
| #define HAVE_STDLIB_H 1
| #define HAVE_STRING_H 1
| #define HAVE_MEMORY_H 1
| #define HAVE_STRINGS_H 1
| #define HAVE_INTTYPES_H 1
| #define HAVE_STDINT_H 1
| #define HAVE_UNISTD_H 1
| #define HAVE_DLFCN_H 1
| #define LT_OBJDIR ".libs/"
| #define HAVE_TR1 1
| #define USE_EXECINFO 1
| #define USE_VARIABLE_FDSET 1
| #define HAVE_SYS_STATVFS_H 1
| #define FS_STAT_FD fstatvfs(fd, &m_stat) == 0
| #define FS_STAT_FN statvfs(fn, &m_stat) == 0
| #define FS_STAT_STRUCT struct statvfs
| #define FS_STAT_SIZE_TYPE unsigned long
| #define FS_STAT_COUNT_TYPE fsblkcnt_t
| #define FS_STAT_BLOCK_SIZE (m_stat.f_frsize)
| #define HAVE_PTHREAD_PRIO_INHERIT 1
| #define HAVE_PTHREAD 1
| #define HAVE_NCURSES 1
| #define HAVE_CURSES 1
| /* end confdefs.h. */
|
| #include <ncurses/curses.h>
|
| int
| main ()
| {
|
| chtype a = A_BOLD;
| int b = KEY_LEFT;
| chtype c = COLOR_PAIR(1) & A_COLOR;
| int g = getattrs(stdscr);
| int h = getcurx(stdscr) + getmaxx(stdscr);
| initscr();
| init_pair(1, COLOR_WHITE, COLOR_RED);
|
| ;
| return 0;
| }
configure:17293: result: no
configure:17311: checking for working ncurses.h
configure:17338: gcc-5 -o conftest -g -O2 conftest.c -lncurses >&5
configure:17338: $? = 0
configure:17347: result: yes
configure:17728: checking for pkg-config
configure:17746: found /usr/local/opt/pkg-config/bin/pkg-config
configure:17758: result: /usr/local/opt/pkg-config/bin/pkg-config
configure:17783: checking pkg-config is at least version 0.9.0
configure:17786: result: yes
configure:17796: checking for libcurl
configure:17803: $PKG_CONFIG --exists --print-errors "libcurl >= 7.15.4"
configure:17806: $? = 0
configure:17820: $PKG_CONFIG --exists --print-errors "libcurl >= 7.15.4"
configure:17823: $? = 0
configure:17881: result: yes
configure:17889: checking for libtorrent
configure:17896: $PKG_CONFIG --exists --print-errors "libtorrent >= 0.13.4"
configure:17899: $? = 0
configure:17913: $PKG_CONFIG --exists --print-errors "libtorrent >= 0.13.4"
configure:17916: $? = 0
configure:17974: result: yes
configure:17987: checking for XMLRPC-C
configure:18050: result: ignored
configure:18072: checking for posix_memalign
configure:18072: gcc-5 -o conftest -g -O2 -D_THREAD_SAFE conftest.c -lncurses -lcurl -L/usr/local/Cellar/libtorrent/0.13.4/lib -ltorrent >&5
conftest.c:66:6: warning: conflicting types for built-in function 'posix_memalign'
char posix_memalign ();
^
configure:18072: $? = 0
configure:18072: result: yes
configure:18082: checking for cacheline
configure:18094: gcc-5 -c -g -O2 -D_THREAD_SAFE conftest.c >&5
conftest.c:46:35: fatal error: linux/cache.h: No such file or directory
compilation terminated.
configure:18094: $? = 1
configure: failed program was:
| /* confdefs.h */
| #define PACKAGE_NAME "rtorrent"
| #define PACKAGE_TARNAME "rtorrent"
| #define PACKAGE_VERSION "0.9.4"
| #define PACKAGE_STRING "rtorrent 0.9.4"
| #define PACKAGE_BUGREPORT "sundell.software@gmail.com"
| #define PACKAGE_URL ""
| #define API_VERSION 8
| #define PACKAGE "rtorrent"
| #define VERSION "0.9.4"
| #define STDC_HEADERS 1
| #define HAVE_SYS_TYPES_H 1
| #define HAVE_SYS_STAT_H 1
| #define HAVE_STDLIB_H 1
| #define HAVE_STRING_H 1
| #define HAVE_MEMORY_H 1
| #define HAVE_STRINGS_H 1
| #define HAVE_INTTYPES_H 1
| #define HAVE_STDINT_H 1
| #define HAVE_UNISTD_H 1
| #define HAVE_DLFCN_H 1
| #define LT_OBJDIR ".libs/"
| #define HAVE_TR1 1
| #define USE_EXECINFO 1
| #define USE_VARIABLE_FDSET 1
| #define HAVE_SYS_STATVFS_H 1
| #define FS_STAT_FD fstatvfs(fd, &m_stat) == 0
| #define FS_STAT_FN statvfs(fn, &m_stat) == 0
| #define FS_STAT_STRUCT struct statvfs
| #define FS_STAT_SIZE_TYPE unsigned long
| #define FS_STAT_COUNT_TYPE fsblkcnt_t
| #define FS_STAT_BLOCK_SIZE (m_stat.f_frsize)
| #define HAVE_PTHREAD_PRIO_INHERIT 1
| #define HAVE_PTHREAD 1
| #define HAVE_NCURSES 1
| #define HAVE_CURSES 1
| #define HAVE_CURSES_COLOR 1
| #define HAVE_CURSES_OBSOLETE 1
| #define HAVE_NCURSES_H 1
| #define HAVE_CONFIG_H 1
| #define USER_AGENT std::string(PACKAGE "/" VERSION "/") + torrent::version()
| #define HAVE_POSIX_MEMALIGN 1
| /* end confdefs.h. */
|
| #include <stdlib.h>
| #include <linux/cache.h>
| void* vptr __cacheline_aligned;
| void f() { posix_memalign(&vptr, SMP_CACHE_BYTES, 42); }
|
configure:18109: result: using default 128 bytes
configure:18122: checking for __builtin_popcount
configure:18131: gcc-5 -c -g -O2 -D_THREAD_SAFE conftest.c >&5
configure:18131: $? = 0
configure:18133: result: yes
configure:18149: checking if compiler supports __attribute__((unused))
configure:18160: gcc-5 -c -g -O2 -D_THREAD_SAFE conftest.c >&5
configure:18160: $? = 0
configure:18168: result: yes
configure:18298: checking that generated files are newer than configure
configure:18304: result: done
configure:18331: creating ./config.status
## ---------------------- ##
## Running config.status. ##
## ---------------------- ##
This file was extended by rtorrent config.status 0.9.4, which was
generated by GNU Autoconf 2.69. Invocation command line was
CONFIG_FILES =
CONFIG_HEADERS =
CONFIG_LINKS =
CONFIG_COMMANDS =
$ ./config.status
on Premkumars-MacBook-Pro.local
config.status:1190: creating Makefile
config.status:1190: creating doc/Makefile
config.status:1190: creating src/Makefile
config.status:1190: creating src/core/Makefile
config.status:1190: creating src/display/Makefile
config.status:1190: creating src/input/Makefile
config.status:1190: creating src/rpc/Makefile
config.status:1190: creating src/ui/Makefile
config.status:1190: creating src/utils/Makefile
config.status:1190: creating test/Makefile
config.status:1190: creating config.h
config.status:1419: executing depfiles commands
config.status:1419: executing libtool commands
## ---------------- ##
## Cache variables. ##
## ---------------- ##
ac_cv_build=x86_64-apple-darwin14.3.0
ac_cv_c_compiler_gnu=yes
ac_cv_cxx_compiler_gnu=yes
ac_cv_env_CCC_set=
ac_cv_env_CCC_value=
ac_cv_env_CC_set=set
ac_cv_env_CC_value=gcc-5
ac_cv_env_CFLAGS_set=
ac_cv_env_CFLAGS_value=
ac_cv_env_CPPFLAGS_set=
ac_cv_env_CPPFLAGS_value=
ac_cv_env_CPP_set=
ac_cv_env_CPP_value=
ac_cv_env_CURSES_LIB_set=
ac_cv_env_CURSES_LIB_value=
ac_cv_env_CXXCPP_set=
ac_cv_env_CXXCPP_value=
ac_cv_env_CXXFLAGS_set=
ac_cv_env_CXXFLAGS_value=
ac_cv_env_CXX_set=set
ac_cv_env_CXX_value=g++-5
ac_cv_env_LDFLAGS_set=
ac_cv_env_LDFLAGS_value=
ac_cv_env_LIBS_set=
ac_cv_env_LIBS_value=
ac_cv_env_PKG_CONFIG_LIBDIR_set=set
ac_cv_env_PKG_CONFIG_LIBDIR_value=/usr/lib/pkgconfig:/usr/local/Library/ENV/pkgconfig/10.10
ac_cv_env_PKG_CONFIG_PATH_set=set
ac_cv_env_PKG_CONFIG_PATH_value=/usr/local/opt/openssl/lib/pkgconfig:/usr/local/opt/libtorrent/lib/pkgconfig
ac_cv_env_PKG_CONFIG_set=
ac_cv_env_PKG_CONFIG_value=
ac_cv_env_build_alias_set=
ac_cv_env_build_alias_value=
ac_cv_env_host_alias_set=
ac_cv_env_host_alias_value=
ac_cv_env_libcurl_CFLAGS_set=
ac_cv_env_libcurl_CFLAGS_value=
ac_cv_env_libcurl_LIBS_set=
ac_cv_env_libcurl_LIBS_value=
ac_cv_env_libtorrent_CFLAGS_set=
ac_cv_env_libtorrent_CFLAGS_value=
ac_cv_env_libtorrent_LIBS_set=
ac_cv_env_libtorrent_LIBS_value=
ac_cv_env_target_alias_set=
ac_cv_env_target_alias_value=
ac_cv_func_posix_memalign=yes
ac_cv_header_dlfcn_h=yes
ac_cv_header_inttypes_h=yes
ac_cv_header_memory_h=yes
ac_cv_header_stdc=yes
ac_cv_header_stdint_h=yes
ac_cv_header_stdlib_h=yes
ac_cv_header_string_h=yes
ac_cv_header_strings_h=yes
ac_cv_header_sys_stat_h=yes
ac_cv_header_sys_statfs_h=no
ac_cv_header_sys_statvfs_h=yes
ac_cv_header_sys_types_h=yes
ac_cv_header_sys_vfs_h=no
ac_cv_header_unistd_h=yes
ac_cv_host=x86_64-apple-darwin14.3.0
ac_cv_objext=o
ac_cv_path_CPPUNIT_CONFIG=no
ac_cv_path_EGREP='/usr/bin/grep -E'
ac_cv_path_FGREP='/usr/bin/grep -F'
ac_cv_path_GREP=/usr/bin/grep
ac_cv_path_SED=/usr/local/Library/ENV/4.3/sed
ac_cv_path_ac_pt_PKG_CONFIG=/usr/local/opt/pkg-config/bin/pkg-config
ac_cv_path_install='/usr/bin/install -c'
ac_cv_prog_AWK=awk
ac_cv_prog_CPP='gcc-5 -E'
ac_cv_prog_CXXCPP='g++-5 -E'
ac_cv_prog_ac_ct_AR=ar
ac_cv_prog_ac_ct_CC=gcc-5
ac_cv_prog_ac_ct_DSYMUTIL=dsymutil
ac_cv_prog_ac_ct_LIPO=lipo
ac_cv_prog_ac_ct_NMEDIT=nmedit
ac_cv_prog_ac_ct_OTOOL=otool
ac_cv_prog_ac_ct_RANLIB=ranlib
ac_cv_prog_ac_ct_STRIP=strip
ac_cv_prog_cc_c89=
ac_cv_prog_cc_g=yes
ac_cv_prog_cxx_g=yes
ac_cv_prog_make_make_set=yes
ac_cv_sys_file_offset_bits=no
ac_cv_sys_largefile_CC=no
am_cv_CC_dependencies_compiler_type=none
am_cv_CXX_dependencies_compiler_type=none
am_cv_make_support_nested_variables=yes
am_cv_prog_cc_c_o=yes
ax_cv_PTHREAD_PRIO_INHERIT=yes
ax_cv_curses=yes
ax_cv_curses_color=yes
ax_cv_curses_enhanced=no
ax_cv_curses_obsolete=yes
ax_cv_curses_which=ncurses
ax_cv_header_ncurses_curses_h=no
ax_cv_header_ncurses_h=yes
ax_cv_ncurses=yes
ax_cv_ncursesw=no
cc_cv_attribute_unused=yes
lt_cv_apple_cc_single_mod=yes
lt_cv_ar_at_file=no
lt_cv_deplibs_check_method=pass_all
lt_cv_file_magic_cmd='$MAGIC_CMD'
lt_cv_file_magic_test_file=
lt_cv_ld_exported_symbols_list=yes
lt_cv_ld_force_load=yes
lt_cv_ld_reload_flag=-r
lt_cv_nm_interface='BSD nm'
lt_cv_objdir=.libs
lt_cv_path_LD=/usr/local/Library/ENV/4.3/ld
lt_cv_path_LDCXX=/usr/local/Library/ENV/4.3/ld
lt_cv_path_NM=/usr/bin/nm
lt_cv_path_mainfest_tool=no
lt_cv_prog_compiler_c_o=yes
lt_cv_prog_compiler_c_o_CXX=yes
lt_cv_prog_compiler_pic='-fno-common -DPIC'
lt_cv_prog_compiler_pic_CXX='-fno-common -DPIC'
lt_cv_prog_compiler_pic_works=yes
lt_cv_prog_compiler_pic_works_CXX=yes
lt_cv_prog_compiler_rtti_exceptions=no
lt_cv_prog_compiler_static_works=no
lt_cv_prog_compiler_static_works_CXX=no
lt_cv_prog_gnu_ld=no
lt_cv_prog_gnu_ldcxx=no
lt_cv_sharedlib_from_linklib_cmd='printf %s\n'
lt_cv_sys_global_symbol_pipe='sed -n -e '\''s/^.*[ ]\([BCDEGRST][BCDEGRST]*\)[ ][ ]*_\([_A-Za-z][_A-Za-z0-9]*\)$/\1 _\2 \2/p'\'' | sed '\''/ __gnu_lto/d'\'''
lt_cv_sys_global_symbol_to_c_name_address='sed -n -e '\''s/^: \([^ ]*\)[ ]*$/ {\"\1\", (void *) 0},/p'\'' -e '\''s/^[BCDEGRST]* \([^ ]*\) \([^ ]*\)$/ {"\2", (void *) \&\2},/p'\'''
lt_cv_sys_global_symbol_to_c_name_address_lib_prefix='sed -n -e '\''s/^: \([^ ]*\)[ ]*$/ {\"\1\", (void *) 0},/p'\'' -e '\''s/^[BCDEGRST]* \([^ ]*\) \(lib[^ ]*\)$/ {"\2", (void *) \&\2},/p'\'' -e '\''s/^[BCDEGRST]* \([^ ]*\) \([^ ]*\)$/ {"lib\2", (void *) \&\2},/p'\'''
lt_cv_sys_global_symbol_to_cdecl='sed -n -e '\''s/^T .* \(.*\)$/extern int \1();/p'\'' -e '\''s/^[BCDEGRST]* .* \(.*\)$/extern char \1;/p'\'''
lt_cv_sys_max_cmd_len=196608
lt_cv_to_host_file_cmd=func_convert_file_noop
lt_cv_to_tool_file_cmd=func_convert_file_noop
pkg_cv_libcurl_CFLAGS=
pkg_cv_libcurl_LIBS='-lcurl '
pkg_cv_libtorrent_CFLAGS='-I/usr/local/Cellar/libtorrent/0.13.4/include '
pkg_cv_libtorrent_LIBS='-L/usr/local/Cellar/libtorrent/0.13.4/lib -ltorrent '
## ----------------- ##
## Output variables. ##
## ----------------- ##
ACLOCAL='aclocal-1.14'
AMDEPBACKSLASH=''
AMDEP_FALSE=''
AMDEP_TRUE='#'
AMTAR='$${TAR-tar}'
AM_BACKSLASH='\'
AM_DEFAULT_V='$(AM_DEFAULT_VERBOSITY)'
AM_DEFAULT_VERBOSITY='1'
AM_V='$(V)'
AR='ar'
AUTOCONF='autoconf'
AUTOHEADER='autoheader'
AUTOMAKE='automake-1.14'
AWK='awk'
CC='gcc-5'
CCDEPMODE='depmode=none'
CFLAGS='-g -O2 -D_THREAD_SAFE '
CPP='gcc-5 -E'
CPPFLAGS=''
CPPUNIT_CFLAGS=''
CPPUNIT_CONFIG='no'
CPPUNIT_LIBS=''
CURSES_LIB='-lncurses'
CXX='g++-5'
CXXCPP='g++-5 -E'
CXXDEPMODE='depmode=none'
CXXFLAGS='-g -O2 -DNDEBUG -D_THREAD_SAFE -I/usr/local/Cellar/libtorrent/0.13.4/include '
CYGPATH_W='echo'
DEFS='-DHAVE_CONFIG_H'
DEPDIR='.deps'
DLLTOOL='false'
DSYMUTIL='dsymutil'
DUMPBIN=''
ECHO_C='\c'
ECHO_N=''
ECHO_T=''
EGREP='/usr/bin/grep -E'
EXEEXT=''
FGREP='/usr/bin/grep -F'
GREP='/usr/bin/grep'
INSTALL_DATA='${INSTALL} -m 644'
INSTALL_PROGRAM='${INSTALL}'
INSTALL_SCRIPT='${INSTALL}'
INSTALL_STRIP_PROGRAM='$(install_sh) -c -s'
LD='/usr/local/Library/ENV/4.3/ld'
LDFLAGS=''
LIBOBJS=''
LIBS=' -lncurses -lcurl -L/usr/local/Cellar/libtorrent/0.13.4/lib -ltorrent '
LIBTOOL='$(SHELL) $(top_builddir)/libtool'
LIPO='lipo'
LN_S='ln -s'
LTLIBOBJS=''
MAKEINFO='makeinfo'
MANIFEST_TOOL=':'
MKDIR_P='./install-sh -c -d'
NM='/usr/bin/nm'
NMEDIT='nmedit'
OBJDUMP='false'
OBJEXT='o'
OTOOL64=':'
OTOOL='otool'
PACKAGE='rtorrent'
PACKAGE_BUGREPORT='sundell.software@gmail.com'
PACKAGE_NAME='rtorrent'
PACKAGE_STRING='rtorrent 0.9.4'
PACKAGE_TARNAME='rtorrent'
PACKAGE_URL=''
PACKAGE_VERSION='0.9.4'
PATH_SEPARATOR=':'
PKG_CONFIG='/usr/local/opt/pkg-config/bin/pkg-config'
PKG_CONFIG_LIBDIR='/usr/lib/pkgconfig:/usr/local/Library/ENV/pkgconfig/10.10'
PKG_CONFIG_PATH='/usr/local/opt/openssl/lib/pkgconfig:/usr/local/opt/libtorrent/lib/pkgconfig'
PTHREAD_CC='gcc-5'
PTHREAD_CFLAGS='-D_THREAD_SAFE '
PTHREAD_LIBS=''
RANLIB='ranlib'
SED='/usr/local/Library/ENV/4.3/sed'
SET_MAKE=''
SHELL='/bin/sh'
STRIP='strip'
VERSION='0.9.4'
ac_ct_AR='ar'
ac_ct_CC='gcc-5'
ac_ct_CXX=''
ac_ct_DUMPBIN=''
am__EXEEXT_FALSE=''
am__EXEEXT_TRUE='#'
am__fastdepCC_FALSE=''
am__fastdepCC_TRUE='#'
am__fastdepCXX_FALSE=''
am__fastdepCXX_TRUE='#'
am__include='include'
am__isrc=''
am__leading_dot='.'
am__nodep=''
am__quote=''
am__tar='$${TAR-tar} chof - "$$tardir"'
am__untar='$${TAR-tar} xf -'
ax_pthread_config=''
bindir='${exec_prefix}/bin'
build='x86_64-apple-darwin14.3.0'
build_alias=''
build_cpu='x86_64'
build_os='darwin14.3.0'
build_vendor='apple'
datadir='${datarootdir}'
datarootdir='${prefix}/share'
docdir='${datarootdir}/doc/${PACKAGE_TARNAME}'
dvidir='${docdir}'
exec_prefix='${prefix}'
host='x86_64-apple-darwin14.3.0'
host_alias=''
host_cpu='x86_64'
host_os='darwin14.3.0'
host_vendor='apple'
htmldir='${docdir}'
includedir='${prefix}/include'
infodir='${datarootdir}/info'
install_sh='${SHELL} /private/tmp/rtorrent20150524-78978-1ecjv1i/rtorrent-0.9.4/install-sh'
libcurl_CFLAGS=''
libcurl_LIBS='-lcurl '
libdir='${exec_prefix}/lib'
libexecdir='${exec_prefix}/libexec'
libtorrent_CFLAGS='-I/usr/local/Cellar/libtorrent/0.13.4/include '
libtorrent_LIBS='-L/usr/local/Cellar/libtorrent/0.13.4/lib -ltorrent '
localedir='${datarootdir}/locale'
localstatedir='${prefix}/var'
mandir='${datarootdir}/man'
mkdir_p='$(MKDIR_P)'
oldincludedir='/usr/include'
pdfdir='${docdir}'
prefix='/usr/local/Cellar/rtorrent/0.9.4_1'
program_transform_name='s,x,x,'
psdir='${docdir}'
sbindir='${exec_prefix}/sbin'
sharedstatedir='${prefix}/com'
sysconfdir='${prefix}/etc'
target_alias=''
## ----------- ##
## confdefs.h. ##
## ----------- ##
/* confdefs.h */
#define PACKAGE_NAME "rtorrent"
#define PACKAGE_TARNAME "rtorrent"
#define PACKAGE_VERSION "0.9.4"
#define PACKAGE_STRING "rtorrent 0.9.4"
#define PACKAGE_BUGREPORT "sundell.software@gmail.com"
#define PACKAGE_URL ""
#define API_VERSION 8
#define PACKAGE "rtorrent"
#define VERSION "0.9.4"
#define STDC_HEADERS 1
#define HAVE_SYS_TYPES_H 1
#define HAVE_SYS_STAT_H 1
#define HAVE_STDLIB_H 1
#define HAVE_STRING_H 1
#define HAVE_MEMORY_H 1
#define HAVE_STRINGS_H 1
#define HAVE_INTTYPES_H 1
#define HAVE_STDINT_H 1
#define HAVE_UNISTD_H 1
#define HAVE_DLFCN_H 1
#define LT_OBJDIR ".libs/"
#define HAVE_TR1 1
#define USE_EXECINFO 1
#define USE_VARIABLE_FDSET 1
#define HAVE_SYS_STATVFS_H 1
#define FS_STAT_FD fstatvfs(fd, &m_stat) == 0
#define FS_STAT_FN statvfs(fn, &m_stat) == 0
#define FS_STAT_STRUCT struct statvfs
#define FS_STAT_SIZE_TYPE unsigned long
#define FS_STAT_COUNT_TYPE fsblkcnt_t
#define FS_STAT_BLOCK_SIZE (m_stat.f_frsize)
#define HAVE_PTHREAD_PRIO_INHERIT 1
#define HAVE_PTHREAD 1
#define HAVE_NCURSES 1
#define HAVE_CURSES 1
#define HAVE_CURSES_COLOR 1
#define HAVE_CURSES_OBSOLETE 1
#define HAVE_NCURSES_H 1
#define HAVE_CONFIG_H 1
#define USER_AGENT std::string(PACKAGE "/" VERSION "/") + torrent::version()
#define HAVE_POSIX_MEMALIGN 1
#define LT_SMP_CACHE_BYTES 128
#define lt_cacheline_aligned __attribute__((__aligned__(LT_SMP_CACHE_BYTES)))
#define USE_BUILTIN_POPCOUNT 1
#define SUPPORT_ATTRIBUTE_UNUSED 1
#define __UNUSED __attribute__((unused))
configure: exit 0
Sign up for free to join this conversation on GitHub. Already have an account? Sign in to comment
You can’t perform that action at this time.