Skip to content

Instantly share code, notes, and snippets.

Avatar

Anubhav singh gitexperience

  • Kiprosh
  • Mumbai,India
View GitHub Profile
View AddinMaker Installation Log
Build started 6/11/2017 12:32:58 AM.
1>Project "C:\Users\Anubhav\Desktop\Master\MonoDevelop.AddinMaker\MonoDevelop.AddinMaker.sln" on node 1 (default targets).
1>Building with tools version "15.0".
1>Target "ValidateSolutionConfiguration" in file "C:\Users\Anubhav\Desktop\Master\MonoDevelop.AddinMaker\MonoDevelop.AddinMaker.sln.metaproj" from project "C:\Users\Anubhav\Desktop\Master\MonoDevelop.AddinMaker\MonoDevelop.AddinMaker.sln" (entry point):
Task "Error" skipped, due to false condition; (('$(CurrentSolutionConfigurationContents)' == '') and ('$(SkipInvalidConfigurations)' != 'true')) was evaluated as (('<SolutionConfiguration>
<ProjectConfiguration Project="{10ED7C7D-CD4D-4003-90D6-B36678232B6A}" AbsolutePath="C:\Users\Anubhav\Desktop\Master\MonoDevelop.AddinMaker\MonoDevelop.AddinMaker\MonoDevelop.AddinMaker.csproj" BuildProjectInSolution="True">Debug|AnyCPU<ProjectDependency Project="{AC367EC2-202F-4FB4-A461-5B95827C5DFF}" /></ProjectConfiguration>
<ProjectConfi
View AddinMaker Installation Log
Build started 6/10/2017 2:58:19 AM.
1>Project "C:\Users\Anubhav\Desktop\MonoMaster\MonoDevelop.AddinMaker\MonoDevelop.AddinMaker.sln" on node 1 (default targets).
1>Building with tools version "15.0".
1>Target "ValidateSolutionConfiguration" in file "C:\Users\Anubhav\Desktop\MonoMaster\MonoDevelop.AddinMaker\MonoDevelop.AddinMaker.sln.metaproj" from project "C:\Users\Anubhav\Desktop\MonoMaster\MonoDevelop.AddinMaker\MonoDevelop.AddinMaker.sln" (entry point):
Task "Error" skipped, due to false condition; (('$(CurrentSolutionConfigurationContents)' == '') and ('$(SkipInvalidConfigurations)' != 'true')) was evaluated as (('<SolutionConfiguration>
<ProjectConfiguration Project="{10ED7C7D-CD4D-4003-90D6-B36678232B6A}" AbsolutePath="C:\Users\Anubhav\Desktop\MonoMaster\MonoDevelop.AddinMaker\MonoDevelop.AddinMaker\MonoDevelop.AddinMaker.csproj" BuildProjectInSolution="True">Debug|AnyCPU<ProjectDependency Project="{AC367EC2-202F-4FB4-A461-5B95827C5DFF}" /></ProjectConfiguration>
View MD Build Log
Build FAILED.
"C:\Users\Anubhav\Desktop\MonoMaster\monodevelop\main\Main.sln" (default target) (1) ->
(ValidateProjects target) ->
C:\Users\Anubhav\Desktop\MonoMaster\monodevelop\main\Main.sln.metaproj : warning MSB4121: The project configuration for project "MonoDevelop.Projects.Formats.MSBuild.v12.0" was not specified in the solution file for the solution configuration "DebugWin32|Any CPU". [C:\Users\Anubhav\Desktop\MonoMaster\monodevelop\main\Main.sln]
C:\Users\Anubhav\Desktop\MonoMaster\monodevelop\main\Main.sln.metaproj : warning MSB4121: The project configuration for project "MonoDevelop.Projects.Formats.MSBuild.v14.0" was not specified in the solution file for the solution configuration "DebugWin32|Any CPU". [C:\Users\Anubhav\Desktop\MonoMaster\monodevelop\main\Main.sln]
C:\Users\Anubhav\Desktop\MonoMaster\monodevelop\main\Main.sln.metaproj : warning MSB4121: The project configuration for project "PerformanceDiagnosticsAddIn" was not specified in the solution
View Monodevelop Build Result
This file has been truncated, but you can view the full file.
Build started 6/9/2017 12:16:58 AM.
1>Project "C:\Users\Anubhav\Desktop\Guru\monodevelop\main\Main.sln" on node 1 (default targets).
1>Building with tools version "15.0".
1>Target "ValidateSolutionConfiguration" in file "C:\Users\Anubhav\Desktop\Guru\monodevelop\main\Main.sln.metaproj" from project "C:\Users\Anubhav\Desktop\Guru\monodevelop\main\Main.sln" (entry point):
Task "Error" skipped, due to false condition; (('$(CurrentSolutionConfigurationContents)' == '') and ('$(SkipInvalidConfigurations)' != 'true')) was evaluated as (('<SolutionConfiguration>
<ProjectConfiguration Project="{7525BB88-6142-4A26-93B9-A30C6983390A}" AbsolutePath="C:\Users\Anubhav\Desktop\Guru\monodevelop\main\src\core\MonoDevelop.Core\MonoDevelop.Core.csproj" BuildProjectInSolution="True">DebugWin32|AnyCPU</ProjectConfiguration>
View MD Build log
Building: hellocmake ()
-- Building for: Visual Studio 14 2015
-- The C compiler identification is unknown
-- The CXX compiler identification is unknown
-- Configuring incomplete, errors occurred!
See also "C:/Users/Experience/Desktop/cmakeProject/bin/CMakeFiles/CMakeOutput.log".
See also "C:/Users/Experience/Desktop/cmakeProject/bin/CMakeFiles/CMakeError.log".
Microsoft (R) Build Engine version 14.0.24723.2
Copyright (C) Microsoft Corporation. All rights reserved.
View build Log
Building Solution: firstCProject (Debug)
Build started 5/29/2017 2:39:35 PM.
__________________________________________________
Project "C:\Users\Experience\Documents\Projects\firstCProject\firstCProject\firstCProject.cproj" (Build target(s)):
Building with tools version "15.0".
C:\Users\Experience\Documents\Projects\firstCProject\firstCProject\firstCProject.cproj : error MSB4057: The target "Build" does not exist in the project.
Done building project "firstCProject.cproj" -- FAILED.
View Build Log
Building Solution: CBinding (Debug)
Generating GUI code for project 'CBinding'...
Build started 5/28/2017 1:32:26 AM.
__________________________________________________
Project "C:\Users\Experience\Desktop\addin\cbinding\CBinding\CBinding.csproj" (Build target(s)):
Building with tools version "15.0".
Target _CheckForInvalidConfigurationAndPlatform:
Task "Error" skipped, due to false condition; ( '$(_InvalidConfigurationError)' == 'true' ) was evaluated as ( '' == 'true' ).
View current Build Log
Building Solution: CBinding (Debug)
Generating GUI code for project 'CBinding'...
Build started 5/22/2017 4:36:53 PM.
__________________________________________________
Project "C:\Users\Experience\Desktop\addin\cbinding\CBinding\CBinding.csproj" (Build target(s)):
Building with tools version "15.0".
Target _CheckForInvalidConfigurationAndPlatform:
Task "Error" skipped, due to false condition; ( '$(_InvalidConfigurationError)' == 'true' ) was evaluated as ( '' == 'true' ).
View CBinding Build Log
Building Solution: CBinding (Debug)
Generating GUI code for project 'CBinding'...
Build started 5/22/2017 3:34:27 PM.
__________________________________________________
Project "C:\Users\Experience\Desktop\addin\cbinding\CBinding\CBinding.csproj" (Build target(s)):
Building with tools version "15.0".
Target _CheckForInvalidConfigurationAndPlatform:
Task "Error" skipped, due to false condition; ( '$(_InvalidConfigurationError)' == 'true' ) was evaluated as ( '' == 'true' ).
View cBinding build log
Building Solution: CBinding (Debug)
Generating GUI code for project 'CBinding'...
Build started 5/16/2017 2:47:39 PM.
__________________________________________________
Project "C:\Users\Experience\Desktop\addin\cbinding\CBinding\CBinding.csproj" (Build target(s)):
Building with tools version "15.0".
Target _CheckForInvalidConfigurationAndPlatform:
Task "Error" skipped, due to false condition; ( '$(_InvalidConfigurationError)' == 'true' ) was evaluated as ( '' == 'true' ).