public
Created

  • Download Gist
gistfile1.txt
1 2 3 4 5 6 7 8 9 10 11 12 13 14 15 16 17 18 19
~NACL_SDK_ROOT/examples/hello_tutorial ⮀ make
/Users/goonnow/nacl_sdk/pepper_26/toolchain/mac_x86_newlib/bin/i686-nacl-g++ -o hello_tutorial_32.o -c hello_tutorial.cc -m32 -O0 -g -pthread -std=gnu++98 -Wno-long-long -Wall -Wswitch-enum -pedantic -Werror
hello_tutorial.cc:29:32: error: ppapi/cpp/instance.h: No such file or directory
hello_tutorial.cc:30:30: error: ppapi/cpp/module.h: No such file or directory
hello_tutorial.cc:31:27: error: ppapi/cpp/var.h: No such file or directory
hello_tutorial.cc:42: error: ‘pp’ has not been declared
hello_tutorial.cc:42: error: expected ‘{’ before ‘Instance’
hello_tutorial.cc:42: error: invalid type in declaration before ‘{’ token
cc1plus: warnings being treated as errors
hello_tutorial.cc:42: error: extended initializer lists only available with -std=c++0x or -std=gnu++0x
hello_tutorial.cc:43: error: expected primary-expression before ‘public’
hello_tutorial.cc:43: error: expected ‘}’ before ‘public’
hello_tutorial.cc:43: error: expected ‘,’ or ‘;’ before ‘public’
hello_tutorial.cc:48: error: declaration of ‘~HelloTutorialInstance’ as non-member
hello_tutorial.cc:61: error: ISO C++ forbids declaration of ‘pp’ with no type
hello_tutorial.cc:61: error: expected ‘,’ or ‘...’ before ‘::’ token
hello_tutorial.cc:61: error: ‘virtual’ outside class declaration
hello_tutorial.cc:64: error: expected declaration before ‘}’ token
make: *** [hello_tutorial_32.o] Error 1

Please sign in to comment on this gist.

Something went wrong with that request. Please try again.