Skip to content

Instantly share code, notes, and snippets.

Show Gist options
  • Select an option

  • Save hamcoremusic/644eb6f6561e61d629cae22c4770d215 to your computer and use it in GitHub Desktop.

Select an option

Save hamcoremusic/644eb6f6561e61d629cae22c4770d215 to your computer and use it in GitHub Desktop.
Failed akmod build
2026/07/14 19:00:42 akmods: Building RPM using the command '/usr/sbin/akmodsbuild --kernels 7.1.3-201.fc44.x86_64 /usr/src/akmods/nvidia-kmod.latest'
++ jobs -p
+ exit 0
Executing(%build): /bin/sh -e /var/tmp/rpm-tmp.VXj5Xi
+ umask 022
+ cd /tmp/akmodsbuild.zEUczQSz//BUILD/nvidia-kmod-610.43.03-build
+ CFLAGS='-O2 -flto=auto -ffat-lto-objects -fexceptions -g -grecord-gcc-switches -pipe -Wall -Werror=format-security -Wp,-U_FORTIFY_SOURCE,-D_FORTIFY_SOURCE=3 -Wp,-D_GLIBCXX_ASSERTIONS -specs=/usr/lib/rpm/redhat/redhat-hardened-cc1 -fstack-protector-strong -specs=/usr/lib/rpm/redhat/redhat-annobin-cc1 -m64 -march=x86-64 -mtune=generic -fasynchronous-unwind-tables -fstack-clash-protection -fcf-protection -mtls-dialect=gnu2 -fno-omit-frame-pointer -mno-omit-leaf-frame-pointer '
+ export CFLAGS
+ CXXFLAGS='-O2 -flto=auto -ffat-lto-objects -fexceptions -g -grecord-gcc-switches -pipe -Wall -Werror=format-security -Wp,-U_FORTIFY_SOURCE,-D_FORTIFY_SOURCE=3 -Wp,-D_GLIBCXX_ASSERTIONS -specs=/usr/lib/rpm/redhat/redhat-hardened-cc1 -fstack-protector-strong -specs=/usr/lib/rpm/redhat/redhat-annobin-cc1 -m64 -march=x86-64 -mtune=generic -fasynchronous-unwind-tables -fstack-clash-protection -fcf-protection -mtls-dialect=gnu2 -fno-omit-frame-pointer -mno-omit-leaf-frame-pointer '
+ export CXXFLAGS
+ FFLAGS='-O2 -flto=auto -ffat-lto-objects -fexceptions -g -grecord-gcc-switches -pipe -Wall -Wp,-U_FORTIFY_SOURCE,-D_FORTIFY_SOURCE=3 -Wp,-D_GLIBCXX_ASSERTIONS -specs=/usr/lib/rpm/redhat/redhat-hardened-cc1 -fstack-protector-strong -specs=/usr/lib/rpm/redhat/redhat-annobin-cc1 -m64 -march=x86-64 -mtune=generic -fasynchronous-unwind-tables -fstack-clash-protection -fcf-protection -mtls-dialect=gnu2 -fno-omit-frame-pointer -mno-omit-leaf-frame-pointer -I/usr/lib64/gfortran/modules '
+ export FFLAGS
+ FCFLAGS='-O2 -flto=auto -ffat-lto-objects -fexceptions -g -grecord-gcc-switches -pipe -Wall -Wp,-U_FORTIFY_SOURCE,-D_FORTIFY_SOURCE=3 -Wp,-D_GLIBCXX_ASSERTIONS -specs=/usr/lib/rpm/redhat/redhat-hardened-cc1 -fstack-protector-strong -specs=/usr/lib/rpm/redhat/redhat-annobin-cc1 -m64 -march=x86-64 -mtune=generic -fasynchronous-unwind-tables -fstack-clash-protection -fcf-protection -mtls-dialect=gnu2 -fno-omit-frame-pointer -mno-omit-leaf-frame-pointer -I/usr/lib64/gfortran/modules '
+ export FCFLAGS
+ VALAFLAGS=-g
+ export VALAFLAGS
+ RUSTFLAGS='-Copt-level=3 -Cdebuginfo=2 -Ccodegen-units=1 -Cstrip=none -Cforce-frame-pointers=yes -Clink-arg=-specs=/usr/lib/rpm/redhat/redhat-package-notes --cap-lints=warn'
+ export RUSTFLAGS
+ LDFLAGS='-Wl,-z,relro -Wl,--as-needed -Wl,-z,pack-relative-relocs -Wl,-z,now -specs=/usr/lib/rpm/redhat/redhat-hardened-ld -specs=/usr/lib/rpm/redhat/redhat-hardened-ld-errors -specs=/usr/lib/rpm/redhat/redhat-annobin-cc1 -Wl,--build-id=sha1 -specs=/usr/lib/rpm/redhat/redhat-package-notes '
+ export LDFLAGS
+ LT_SYS_LIBRARY_PATH=/usr/lib64:
+ export LT_SYS_LIBRARY_PATH
+ CC=gcc
+ export CC
+ CXX=g++
+ export CXX
+ cd nvidia-kmod-610.43.03
+ for kernel_version in 7.1.3-201.fc44.x86_64___/usr/src/kernels/7.1.3-201.fc44.x86_64
+ pushd _kmod_build_7.1.3-201.fc44.x86_64/
/tmp/akmodsbuild.zEUczQSz/BUILD/nvidia-kmod-610.43.03-build/nvidia-kmod-610.43.03/_kmod_build_7.1.3-201.fc44.x86_64 /tmp/akmodsbuild.zEUczQSz/BUILD/nvidia-kmod-610.43.03-build/nvidia-kmod-610.43.03
+ /usr/bin/make -O -j24 V=1 VERBOSE=1 KERNEL_UNAME=7.1.3-201.fc44.x86_64 SYSSRC=/usr/src/kernels/7.1.3-201.fc44.x86_64 IGNORE_CC_MISMATCH=1 IGNORE_XEN_PRESENCE=1 IGNORE_PREEMPT_RT_PRESENCE=1 module
make: *** [Makefile:115: modules] Segmentation fault (core dumped)
error: Bad exit status from /var/tmp/rpm-tmp.VXj5Xi (%build)
RPM build errors:
Bad exit status from /var/tmp/rpm-tmp.VXj5Xi (%build)
2026/07/14 19:00:44 akmodsbuild: * Rebuilding /usr/src/akmods/nvidia-kmod.latest for kernel(s) 7.1.3-201.fc44.x86_64: Building target platforms: x86_64
2026/07/14 19:00:44 akmodsbuild: Building for target x86_64
2026/07/14 19:00:44 akmodsbuild: Installing /usr/src/akmods/nvidia-kmod.latest
2026/07/14 19:00:44 akmodsbuild: setting SOURCE_DATE_EPOCH=1783468800
2026/07/14 19:00:44 akmodsbuild: Executing(%mkbuilddir): /bin/sh -e /var/tmp/rpm-tmp.aWYner
2026/07/14 19:00:44 akmodsbuild: Executing(%prep): /bin/sh -e /var/tmp/rpm-tmp.OCmCaG
2026/07/14 19:00:44 akmodsbuild: + umask 022
2026/07/14 19:00:44 akmodsbuild: + cd /tmp/akmodsbuild.zEUczQSz//BUILD/nvidia-kmod-610.43.03-build
2026/07/14 19:00:44 akmodsbuild: + kmodtool --target x86_64 --repo rpmfusion --kmodname nvidia-kmod --filterfile /tmp/akmodsbuild.zEUczQSz/SOURCES/nvidia-kmodtool-excludekernel-filterfile --obsolete-name nvidia-newest --obsolete-version 3:610.43.03-1.fc44 --akmod --for-kernels 7.1.3-201.fc44.x86_64
2026/07/14 19:00:44 akmodsbuild: %global obsolete_name nvidia-newest
2026/07/14 19:00:44 akmodsbuild:
2026/07/14 19:00:44 akmodsbuild: %{?rhel:%global with_rhel_kabi 1}
2026/07/14 19:00:44 akmodsbuild:
2026/07/14 19:00:44 akmodsbuild: %if 0%{?rhel} || 0%{?fedora}
2026/07/14 19:00:44 akmodsbuild: %global kmod_pkg_name kmod-nvidia
2026/07/14 19:00:44 akmodsbuild: %global pkg_kmod_name nvidia-kmod
2026/07/14 19:00:44 akmodsbuild: %{?obsolete_name:%global kmod_obsolete_name kmod-%{obsolete_name}}
2026/07/14 19:00:44 akmodsbuild: %endif
2026/07/14 19:00:44 akmodsbuild:
2026/07/14 19:00:44 akmodsbuild: %if 0%{?rhel} || 0%{?fedora}
2026/07/14 19:00:44 akmodsbuild: %global kmod_for_kernel %{?with_rhel_kabi:7.1.3-201.fc44}%{!?with_rhel_kabi:7.1.3-201.fc44.x86_64}
2026/07/14 19:00:44 akmodsbuild: %global package_kmod_name %{kmod_pkg_name}-%{kmod_for_kernel}
2026/07/14 19:00:44 akmodsbuild: %endif
2026/07/14 19:00:44 akmodsbuild: %global _prefix_usr /usr
2026/07/14 19:00:44 akmodsbuild:
2026/07/14 19:00:44 akmodsbuild: %package -n %{package_kmod_name}
2026/07/14 19:00:44 akmodsbuild: Summary: nvidia kernel module(s) for %{kmod_for_kernel}
2026/07/14 19:00:44 akmodsbuild: Provides: kernel-modules%{!?with_rhel_kabi:-for-kernel} = 7.1.3-201.fc44.x86_64
2026/07/14 19:00:44 akmodsbuild: %if %{with rhel_kabi}
2026/07/14 19:00:44 akmodsbuild: Provides: installonlypkg(kernel-module)
2026/07/14 19:00:44 akmodsbuild: %endif
2026/07/14 19:00:44 akmodsbuild: Provides: %{pkg_kmod_name} = %{?epoch:%{epoch}:}%{version}-%{release}
2026/07/14 19:00:44 akmodsbuild: Requires: %{pkg_kmod_name}-common >= %{?epoch:%{epoch}:}%{version}
2026/07/14 19:00:44 akmodsbuild: Requires(post): %{?_prefix_usr}/sbin/depmod
2026/07/14 19:00:44 akmodsbuild: Requires(postun): %{?_prefix_usr}/sbin/depmod
2026/07/14 19:00:44 akmodsbuild: %if %{with rhel_kabi}
2026/07/14 19:00:44 akmodsbuild: Requires(post): %{?_prefix_usr}/sbin/weak-modules
2026/07/14 19:00:44 akmodsbuild: Requires(postun): %{?_prefix_usr}/sbin/weak-modules
2026/07/14 19:00:44 akmodsbuild: %endif
2026/07/14 19:00:44 akmodsbuild:
2026/07/14 19:00:44 akmodsbuild: Provides: %{kmod_obsolete_name}-7.1.3-201.fc44.x86_64 = 3:610.43.03-1.fc44
2026/07/14 19:00:44 akmodsbuild: Obsoletes: %{kmod_obsolete_name}-7.1.3-201.fc44.x86_64 < 3:610.43.03-1.fc44
2026/07/14 19:00:44 akmodsbuild: %global _kmodtool_depmod_post \if [ -f /boot/System.map-7.1.3-201.fc44.x86_64 ] ; then \ %{?_prefix_usr}/sbin/depmod -aeF /boot/System.map-7.1.3-201.fc44.x86_64 7.1.3-201.fc44.x86_64 >/dev/null ; \elif [ -f /lib/modules/7.1.3-201.fc44.x86_64/System.map ] ; then \ %{?_prefix_usr}/sbin/depmod -aeF /lib/modules/7.1.3-201.fc44.x86_64/System.map 7.1.3-201.fc44.x86_64 >/dev/null ; \else \ %{?_prefix_usr}/sbin/depmod -a >/dev/null ; \fi || :
2026/07/14 19:00:44 akmodsbuild:
2026/07/14 19:00:44 akmodsbuild: %if %{with rhel_kabi}
2026/07/14 19:00:44 akmodsbuild: Requires: kernel-uname-r >= 7.1.3-201.fc44.x86_64
2026/07/14 19:00:44 akmodsbuild: %else
2026/07/14 19:00:44 akmodsbuild: Requires: kernel-uname-r = 7.1.3-201.fc44.x86_64
2026/07/14 19:00:44 akmodsbuild: %endif
2026/07/14 19:00:44 akmodsbuild: BuildRequires: kernel-devel-uname-r = 7.1.3-201.fc44.x86_64
2026/07/14 19:00:44 akmodsbuild: BuildRequires: gcc
2026/07/14 19:00:44 akmodsbuild: BuildRequires: redhat-rpm-config
2026/07/14 19:00:44 akmodsbuild:
2026/07/14 19:00:44 akmodsbuild:
2026/07/14 19:00:44 akmodsbuild: %post -n %{package_kmod_name}
2026/07/14 19:00:44 akmodsbuild: %{_kmodtool_depmod_post}
2026/07/14 19:00:44 akmodsbuild:
2026/07/14 19:00:44 akmodsbuild: %if %{with rhel_kabi}
2026/07/14 19:00:44 akmodsbuild: modules=( $(find /lib/modules/7.1.3-201.fc44.x86_64/extra/nvidia/ -name "*.ko" -o -name "*.ko.xz") )
2026/07/14 19:00:44 akmodsbuild: printf '%s\n' "${modules[@]}" | %{?_prefix_usr}/sbin/weak-modules --add-modules
2026/07/14 19:00:44 akmodsbuild: %endif
2026/07/14 19:00:44 akmodsbuild:
2026/07/14 19:00:44 akmodsbuild: %if %{with rhel_kabi}
2026/07/14 19:00:44 akmodsbuild: %preun -n %{package_kmod_name}
2026/07/14 19:00:44 akmodsbuild: rpm -ql %{package_kmod_name}-%{version}-%{release}.x86_64 | grep -e '\.ko$' -e '\.ko.xz$' > /var/run/rpm-%{package_kmod_name}-modules
2026/07/14 19:00:44 akmodsbuild: %endif
2026/07/14 19:00:44 akmodsbuild:
2026/07/14 19:00:44 akmodsbuild: %postun -n %{package_kmod_name}
2026/07/14 19:00:44 akmodsbuild: %{_kmodtool_depmod_post}
2026/07/14 19:00:44 akmodsbuild:
2026/07/14 19:00:44 akmodsbuild: %if %{with rhel_kabi}
2026/07/14 19:00:44 akmodsbuild: modules=( $(cat /var/run/rpm-%{package_kmod_name}-modules) )
2026/07/14 19:00:44 akmodsbuild: rm -f /var/run/rpm-%{package_kmod_name}-modules
2026/07/14 19:00:44 akmodsbuild: printf '%s\n' "${modules[@]}" | %{?_prefix_usr}/sbin/weak-modules --remove-modules
2026/07/14 19:00:44 akmodsbuild: %endif
2026/07/14 19:00:44 akmodsbuild:
2026/07/14 19:00:44 akmodsbuild: %description -n %{package_kmod_name}
2026/07/14 19:00:44 akmodsbuild: This package provides the nvidia kernel modules built for the Linux
2026/07/14 19:00:44 akmodsbuild: kernel %{kmod_for_kernel} for the %{_target_cpu} family of processors.
2026/07/14 19:00:44 akmodsbuild: %files -n %{package_kmod_name}
2026/07/14 19:00:44 akmodsbuild: %defattr(644,root,root,755)
2026/07/14 19:00:44 akmodsbuild: %dir /lib/modules/7.1.3-201.fc44.x86_64/extra
2026/07/14 19:00:44 akmodsbuild: /lib/modules/7.1.3-201.fc44.x86_64/extra/nvidia/
2026/07/14 19:00:44 akmodsbuild:
2026/07/14 19:00:44 akmodsbuild: %global __kmodtool_kernel_uname_r 7.1.3-201.fc44.x86_64
2026/07/14 19:00:44 akmodsbuild: %global __spec_install_post \
2026/07/14 19:00:44 akmodsbuild: %{?__debug_package:%{__debug_install_post}}\
2026/07/14 19:00:44 akmodsbuild: %{__arch_install_post}\
2026/07/14 19:00:44 akmodsbuild: %{__os_install_post}\
2026/07/14 19:00:44 akmodsbuild: %{?__kmodtool_signmodules:%{__kmodtool_modsign_install_post}}\
2026/07/14 19:00:44 akmodsbuild: %{?__kmodtool_zipmodules:%{__kmodtool_modzip_install_post}}
2026/07/14 19:00:44 akmodsbuild:
2026/07/14 19:00:44 akmodsbuild: %global kmodinstdir_prefix /lib/modules/
2026/07/14 19:00:44 akmodsbuild: %global kmodinstdir_postfix /extra/nvidia/
2026/07/14 19:00:44 akmodsbuild: %global kernel_versions 7.1.3-201.fc44.x86_64___%{_usrsrc}/kernels/7.1.3-201.fc44.x86_64
2026/07/14 19:00:44 akmodsbuild:
2026/07/14 19:00:44 akmodsbuild: + cd /tmp/akmodsbuild.zEUczQSz/BUILD/nvidia-kmod-610.43.03-build
2026/07/14 19:00:44 akmodsbuild: + rm -rf nvidia-kmod-610.43.03
2026/07/14 19:00:44 akmodsbuild: + /usr/bin/mkdir -p nvidia-kmod-610.43.03
2026/07/14 19:00:44 akmodsbuild: + cd nvidia-kmod-610.43.03
2026/07/14 19:00:44 akmodsbuild: + /usr/bin/chmod -Rf a+rX,u+w,g-w,o-w .
2026/07/14 19:00:44 akmodsbuild: + tar --use-compress-program xz -xf /usr/share/nvidia-kmod-610.43.03/nvidia-kmod-610.43.03-x86_64.tar.xz
2026/07/14 19:00:44 akmodsbuild: + echo 'Set nvidia to notifiers=1 and memoryallocations=1'
2026/07/14 19:00:44 akmodsbuild: Set nvidia to notifiers=1 and memoryallocations=1
2026/07/14 19:00:44 akmodsbuild: + echo 'Patch #0 (set_driver_defaults.patch):'
2026/07/14 19:00:44 akmodsbuild: Patch #0 (set_driver_defaults.patch):
2026/07/14 19:00:44 akmodsbuild: + /usr/bin/patch --no-backup-if-mismatch -f -p1 --fuzz=0
2026/07/14 19:00:44 akmodsbuild: patching file kernel/nvidia/nv-reg.h
2026/07/14 19:00:44 akmodsbuild: patching file kernel/nvidia/os-interface.c
2026/07/14 19:00:44 akmodsbuild: patching file kernel-open/nvidia/nv-reg.h
2026/07/14 19:00:44 akmodsbuild: patching file kernel-open/nvidia/os-interface.c
2026/07/14 19:00:44 akmodsbuild: + echo 'Runtime detection of kmod_nvidia_open'
2026/07/14 19:00:44 akmodsbuild: Runtime detection of kmod_nvidia_open
2026/07/14 19:00:44 akmodsbuild: + '[' -f supported-gpus/nvidia-kmod-noopen-pciids.txt ']'
2026/07/14 19:00:44 akmodsbuild: + bash /tmp/akmodsbuild.zEUczQSz/SOURCES/nvidia-kmod-noopen-checks supported-gpus/nvidia-kmod-noopen-pciids.txt
2026/07/14 19:00:44 akmodsbuild: No matching graphics card found.
2026/07/14 19:00:44 akmodsbuild: Using nvidia-open
2026/07/14 19:00:44 akmodsbuild: + for kernel_version in 7.1.3-201.fc44.x86_64___/usr/src/kernels/7.1.3-201.fc44.x86_64
2026/07/14 19:00:44 akmodsbuild: + cp -a kernel _kmod_build_7.1.3-201.fc44.x86_64
2026/07/14 19:00:44 akmodsbuild: + RPM_EC=0
2026/07/14 19:00:44 akmodsbuild: ++ jobs -p
2026/07/14 19:00:44 akmodsbuild: + exit 0
2026/07/14 19:00:44 akmodsbuild: Executing(%build): /bin/sh -e /var/tmp/rpm-tmp.VXj5Xi
2026/07/14 19:00:44 akmodsbuild: + umask 022
2026/07/14 19:00:44 akmodsbuild: + cd /tmp/akmodsbuild.zEUczQSz//BUILD/nvidia-kmod-610.43.03-build
2026/07/14 19:00:44 akmodsbuild: + CFLAGS='-O2 -flto=auto -ffat-lto-objects -fexceptions -g -grecord-gcc-switches -pipe -Wall -Werror=format-security -Wp,-U_FORTIFY_SOURCE,-D_FORTIFY_SOURCE=3 -Wp,-D_GLIBCXX_ASSERTIONS -specs=/usr/lib/rpm/redhat/redhat-hardened-cc1 -fstack-protector-strong -specs=/usr/lib/rpm/redhat/redhat-annobin-cc1 -m64 -march=x86-64 -mtune=generic -fasynchronous-unwind-tables -fstack-clash-protection -fcf-protection -mtls-dialect=gnu2 -fno-omit-frame-pointer -mno-omit-leaf-frame-pointer '
2026/07/14 19:00:44 akmodsbuild: + export CFLAGS
2026/07/14 19:00:44 akmodsbuild: + CXXFLAGS='-O2 -flto=auto -ffat-lto-objects -fexceptions -g -grecord-gcc-switches -pipe -Wall -Werror=format-security -Wp,-U_FORTIFY_SOURCE,-D_FORTIFY_SOURCE=3 -Wp,-D_GLIBCXX_ASSERTIONS -specs=/usr/lib/rpm/redhat/redhat-hardened-cc1 -fstack-protector-strong -specs=/usr/lib/rpm/redhat/redhat-annobin-cc1 -m64 -march=x86-64 -mtune=generic -fasynchronous-unwind-tables -fstack-clash-protection -fcf-protection -mtls-dialect=gnu2 -fno-omit-frame-pointer -mno-omit-leaf-frame-pointer '
2026/07/14 19:00:44 akmodsbuild: + export CXXFLAGS
2026/07/14 19:00:44 akmodsbuild: + FFLAGS='-O2 -flto=auto -ffat-lto-objects -fexceptions -g -grecord-gcc-switches -pipe -Wall -Wp,-U_FORTIFY_SOURCE,-D_FORTIFY_SOURCE=3 -Wp,-D_GLIBCXX_ASSERTIONS -specs=/usr/lib/rpm/redhat/redhat-hardened-cc1 -fstack-protector-strong -specs=/usr/lib/rpm/redhat/redhat-annobin-cc1 -m64 -march=x86-64 -mtune=generic -fasynchronous-unwind-tables -fstack-clash-protection -fcf-protection -mtls-dialect=gnu2 -fno-omit-frame-pointer -mno-omit-leaf-frame-pointer -I/usr/lib64/gfortran/modules '
2026/07/14 19:00:44 akmodsbuild: + export FFLAGS
2026/07/14 19:00:44 akmodsbuild: + FCFLAGS='-O2 -flto=auto -ffat-lto-objects -fexceptions -g -grecord-gcc-switches -pipe -Wall -Wp,-U_FORTIFY_SOURCE,-D_FORTIFY_SOURCE=3 -Wp,-D_GLIBCXX_ASSERTIONS -specs=/usr/lib/rpm/redhat/redhat-hardened-cc1 -fstack-protector-strong -specs=/usr/lib/rpm/redhat/redhat-annobin-cc1 -m64 -march=x86-64 -mtune=generic -fasynchronous-unwind-tables -fstack-clash-protection -fcf-protection -mtls-dialect=gnu2 -fno-omit-frame-pointer -mno-omit-leaf-frame-pointer -I/usr/lib64/gfortran/modules '
2026/07/14 19:00:44 akmodsbuild: + export FCFLAGS
2026/07/14 19:00:44 akmodsbuild: + VALAFLAGS=-g
2026/07/14 19:00:44 akmodsbuild: + export VALAFLAGS
2026/07/14 19:00:44 akmodsbuild: + RUSTFLAGS='-Copt-level=3 -Cdebuginfo=2 -Ccodegen-units=1 -Cstrip=none -Cforce-frame-pointers=yes -Clink-arg=-specs=/usr/lib/rpm/redhat/redhat-package-notes --cap-lints=warn'
2026/07/14 19:00:44 akmodsbuild: + export RUSTFLAGS
2026/07/14 19:00:44 akmodsbuild: + LDFLAGS='-Wl,-z,relro -Wl,--as-needed -Wl,-z,pack-relative-relocs -Wl,-z,now -specs=/usr/lib/rpm/redhat/redhat-hardened-ld -specs=/usr/lib/rpm/redhat/redhat-hardened-ld-errors -specs=/usr/lib/rpm/redhat/redhat-annobin-cc1 -Wl,--build-id=sha1 -specs=/usr/lib/rpm/redhat/redhat-package-notes '
2026/07/14 19:00:44 akmodsbuild: + export LDFLAGS
2026/07/14 19:00:44 akmodsbuild: + LT_SYS_LIBRARY_PATH=/usr/lib64:
2026/07/14 19:00:44 akmodsbuild: + export LT_SYS_LIBRARY_PATH
2026/07/14 19:00:44 akmodsbuild: + CC=gcc
2026/07/14 19:00:44 akmodsbuild: + export CC
2026/07/14 19:00:44 akmodsbuild: + CXX=g++
2026/07/14 19:00:44 akmodsbuild: + export CXX
2026/07/14 19:00:44 akmodsbuild: + cd nvidia-kmod-610.43.03
2026/07/14 19:00:44 akmodsbuild: + for kernel_version in 7.1.3-201.fc44.x86_64___/usr/src/kernels/7.1.3-201.fc44.x86_64
2026/07/14 19:00:44 akmodsbuild: + pushd _kmod_build_7.1.3-201.fc44.x86_64/
2026/07/14 19:00:44 akmodsbuild: /tmp/akmodsbuild.zEUczQSz/BUILD/nvidia-kmod-610.43.03-build/nvidia-kmod-610.43.03/_kmod_build_7.1.3-201.fc44.x86_64 /tmp/akmodsbuild.zEUczQSz/BUILD/nvidia-kmod-610.43.03-build/nvidia-kmod-610.43.03
2026/07/14 19:00:44 akmodsbuild: + /usr/bin/make -O -j24 V=1 VERBOSE=1 KERNEL_UNAME=7.1.3-201.fc44.x86_64 SYSSRC=/usr/src/kernels/7.1.3-201.fc44.x86_64 IGNORE_CC_MISMATCH=1 IGNORE_XEN_PRESENCE=1 IGNORE_PREEMPT_RT_PRESENCE=1 module
2026/07/14 19:00:44 akmodsbuild: make: *** [Makefile:115: modules] Segmentation fault (core dumped)
2026/07/14 19:00:44 akmodsbuild: error: Bad exit status from /var/tmp/rpm-tmp.VXj5Xi (%build)
2026/07/14 19:00:44 akmodsbuild:
2026/07/14 19:00:44 akmodsbuild: RPM build errors:
2026/07/14 19:00:44 akmodsbuild: Bad exit status from /var/tmp/rpm-tmp.VXj5Xi (%build)
2026/07/14 19:00:44 akmodsbuild:
2026/07/14 19:00:49 akmods: Building rpms failed; see /var/cache/akmods/nvidia/610.43.03-1-for-7.1.3-201.fc44.x86_64.failed.log for details
Sign up for free to join this conversation on GitHub. Already have an account? Sign in to comment