Skip to content

Instantly share code, notes, and snippets.

Embed
What would you like to do?
 * Package: media-libs/desurium-cef-9999-r1
 * Repository: hasufell-overlay
 * USE: amd64 elibc_glibc kernel_linux multilib test userland_GNU
 * FEATURES: ccache preserve-libs sandbox splitdebug test
>>> Unpacking source...
GIT update -->
repository: git://github.com/lodle/Desurium.git
at the commit: 40465c5578fcc30f874fec4cf4df68757cc37dce
branch: master
storage directory: "/home/distfiles/egit-src/Desurium.git"
checkout type: bare repository
Cloning into '/var/tmp/portage/media-libs/desurium-cef-9999-r1/work/desurium-cef-9999'...
done.
Branch branch-master set up to track remote branch master from origin.
Switched to a new branch 'branch-master'
>>> Unpacked to /var/tmp/portage/media-libs/desurium-cef-9999-r1/work/desurium-cef-9999
>>> Source unpacked in /var/tmp/portage/media-libs/desurium-cef-9999-r1/work
>>> Preparing source in /var/tmp/portage/media-libs/desurium-cef-9999-r1/work/desurium-cef-9999 ...
>>> Source prepared.
>>> Configuring source in /var/tmp/portage/media-libs/desurium-cef-9999-r1/work/desurium-cef-9999 ...
>>> Working in BUILD_DIR: "/var/tmp/portage/media-libs/desurium-cef-9999-r1/work/desurium-cef-9999_build"
cmake --no-warn-unused-cli -C /var/tmp/portage/media-libs/desurium-cef-9999-r1/work/desurium-cef-9999_build/gentoo_common_config.cmake -G Unix Makefiles -DCMAKE_INSTALL_PREFIX=/usr -DFORCE_SYS_DEPS=TRUE -DCMAKE_INSTALL_PREFIX=/usr/games -DCEF_URL=file:///var/tmp/portage/media-libs/desurium-cef-9999-r1/distdir/cef-291.tar.gz -DCHROMIUM_URL=file:///var/tmp/portage/media-libs/desurium-cef-9999-r1/distdir/chromium-15.0.876.0.tar.bz2 -DDEPOT_TOOLS_URL=file:///var/tmp/portage/media-libs/desurium-cef-9999-r1/distdir/depot_tools-145556-2.tar.gz -DBUILD_ONLY_CEF=TRUE -DRUNTIME_LIBDIR=/usr/games/lib64 -DCMAKE_BUILD_TYPE=Gentoo -DCMAKE_INSTALL_DO_STRIP=OFF -DCMAKE_USER_MAKE_RULES_OVERRIDE=/var/tmp/portage/media-libs/desurium-cef-9999-r1/work/desurium-cef-9999_build/gentoo_rules.cmake /var/tmp/portage/media-libs/desurium-cef-9999-r1/work/desurium-cef-9999
Not searching for unused variables given on the command line.
loading initial cache file /var/tmp/portage/media-libs/desurium-cef-9999-r1/work/desurium-cef-9999_build/gentoo_common_config.cmake
-- The C compiler identification is GNU 4.5.4
-- The CXX compiler identification is GNU 4.5.4
-- Check for working C compiler: /usr/lib64/ccache/bin/x86_64-pc-linux-gnu-gcc
-- Check for working C compiler: /usr/lib64/ccache/bin/x86_64-pc-linux-gnu-gcc -- works
-- Detecting C compiler ABI info
-- Detecting C compiler ABI info - done
-- Check for working CXX compiler: /usr/lib64/ccache/bin/x86_64-pc-linux-gnu-g++
-- Check for working CXX compiler: /usr/lib64/ccache/bin/x86_64-pc-linux-gnu-g++ -- works
-- Detecting CXX compiler ABI info
-- Detecting CXX compiler ABI info - done
-- using GCC
-- detected 64bit
-- Found wxWidgets: TRUE (Required is at least version "2.9")
-- Found PythonInterp: /usr/bin/python (found version "2.7.3")
-- <<< Gentoo configuration >>>
Build type Gentoo
Install path /usr/games
Compiler flags:
C -march=core2 -O2 -pipe -Wall -ggdb -fPIC -pipe -fvisibility=hidden -finline-functions
C++ -march=core2 -O2 -pipe -Wall -ggdb -fPIC -pipe -fvisibility=hidden -finline-functions -fpermissive -std=c++0x
Linker flags:
Executable -Wl,-O1 -Wl,--as-needed -Wl,--hash-style=gnu -Bsymbolic-functions -lpthread
Module -Wl,-O1 -Wl,--as-needed -Wl,--hash-style=gnu
Shared -Wl,-O1 -Wl,--as-needed -Wl,--hash-style=gnu -Bsymbolic-functions -lpthread
-- Configuring done
-- Generating done
-- Build files have been written to: /var/tmp/portage/media-libs/desurium-cef-9999-r1/work/desurium-cef-9999_build
>>> Source configured.
>>> Compiling source in /var/tmp/portage/media-libs/desurium-cef-9999-r1/work/desurium-cef-9999 ...
>>> Working in BUILD_DIR: "/var/tmp/portage/media-libs/desurium-cef-9999-r1/work/desurium-cef-9999_build"
make -j2 VERBOSE=1
/usr/bin/cmake -H/var/tmp/portage/media-libs/desurium-cef-9999-r1/work/desurium-cef-9999 -B/var/tmp/portage/media-libs/desurium-cef-9999-r1/work/desurium-cef-9999_build --check-build-system CMakeFiles/Makefile.cmake 0
/usr/bin/cmake -E cmake_progress_start /var/tmp/portage/media-libs/desurium-cef-9999-r1/work/desurium-cef-9999_build/CMakeFiles /var/tmp/portage/media-libs/desurium-cef-9999-r1/work/desurium-cef-9999_build/CMakeFiles/progress.marks
make -f CMakeFiles/Makefile2 all
make[1]: Entering directory `/var/tmp/portage/media-libs/desurium-cef-9999-r1/work/desurium-cef-9999_build'
make -f CMakeFiles/depot_tools.dir/build.make CMakeFiles/depot_tools.dir/depend
make -f CMakeFiles/chromium.dir/build.make CMakeFiles/chromium.dir/depend
make[2]: Entering directory `/var/tmp/portage/media-libs/desurium-cef-9999-r1/work/desurium-cef-9999_build'
cd /var/tmp/portage/media-libs/desurium-cef-9999-r1/work/desurium-cef-9999_build && /usr/bin/cmake -E cmake_depends "Unix Makefiles" /var/tmp/portage/media-libs/desurium-cef-9999-r1/work/desurium-cef-9999 /var/tmp/portage/media-libs/desurium-cef-9999-r1/work/desurium-cef-9999 /var/tmp/portage/media-libs/desurium-cef-9999-r1/work/desurium-cef-9999_build /var/tmp/portage/media-libs/desurium-cef-9999-r1/work/desurium-cef-9999_build /var/tmp/portage/media-libs/desurium-cef-9999-r1/work/desurium-cef-9999_build/CMakeFiles/depot_tools.dir/DependInfo.cmake --color=
make[2]: Entering directory `/var/tmp/portage/media-libs/desurium-cef-9999-r1/work/desurium-cef-9999_build'
cd /var/tmp/portage/media-libs/desurium-cef-9999-r1/work/desurium-cef-9999_build && /usr/bin/cmake -E cmake_depends "Unix Makefiles" /var/tmp/portage/media-libs/desurium-cef-9999-r1/work/desurium-cef-9999 /var/tmp/portage/media-libs/desurium-cef-9999-r1/work/desurium-cef-9999 /var/tmp/portage/media-libs/desurium-cef-9999-r1/work/desurium-cef-9999_build /var/tmp/portage/media-libs/desurium-cef-9999-r1/work/desurium-cef-9999_build /var/tmp/portage/media-libs/desurium-cef-9999-r1/work/desurium-cef-9999_build/CMakeFiles/chromium.dir/DependInfo.cmake --color=
Dependee "/var/tmp/portage/media-libs/desurium-cef-9999-r1/work/desurium-cef-9999_build/CMakeFiles/depot_tools.dir/DependInfo.cmake" is newer than depender "/var/tmp/portage/media-libs/desurium-cef-9999-r1/work/desurium-cef-9999_build/CMakeFiles/depot_tools.dir/depend.internal".
Dependee "/var/tmp/portage/media-libs/desurium-cef-9999-r1/work/desurium-cef-9999_build/CMakeFiles/chromium.dir/DependInfo.cmake" is newer than depender "/var/tmp/portage/media-libs/desurium-cef-9999-r1/work/desurium-cef-9999_build/CMakeFiles/chromium.dir/depend.internal".
Dependee "/var/tmp/portage/media-libs/desurium-cef-9999-r1/work/desurium-cef-9999_build/CMakeFiles/CMakeDirectoryInformation.cmake" is newer than depender "/var/tmp/portage/media-libs/desurium-cef-9999-r1/work/desurium-cef-9999_build/CMakeFiles/depot_tools.dir/depend.internal".
Scanning dependencies of target depot_tools
Dependee "/var/tmp/portage/media-libs/desurium-cef-9999-r1/work/desurium-cef-9999_build/CMakeFiles/CMakeDirectoryInformation.cmake" is newer than depender "/var/tmp/portage/media-libs/desurium-cef-9999-r1/work/desurium-cef-9999_build/CMakeFiles/chromium.dir/depend.internal".
Scanning dependencies of target chromium
make[2]: Leaving directory `/var/tmp/portage/media-libs/desurium-cef-9999-r1/work/desurium-cef-9999_build'
make[2]: Leaving directory `/var/tmp/portage/media-libs/desurium-cef-9999-r1/work/desurium-cef-9999_build'
make -f CMakeFiles/chromium.dir/build.make CMakeFiles/chromium.dir/build
make -f CMakeFiles/depot_tools.dir/build.make CMakeFiles/depot_tools.dir/build
make[2]: Entering directory `/var/tmp/portage/media-libs/desurium-cef-9999-r1/work/desurium-cef-9999_build'
/usr/bin/cmake -E cmake_progress_report /var/tmp/portage/media-libs/desurium-cef-9999-r1/work/desurium-cef-9999_build/CMakeFiles 17
make[2]: Entering directory `/var/tmp/portage/media-libs/desurium-cef-9999-r1/work/desurium-cef-9999_build'
/usr/bin/cmake -E cmake_progress_report /var/tmp/portage/media-libs/desurium-cef-9999-r1/work/desurium-cef-9999_build/CMakeFiles 25
[ 5%] [ 5%] Creating directories for 'depot_tools'
Creating directories for 'chromium'
/usr/bin/cmake -E make_directory /var/tmp/portage/media-libs/desurium-cef-9999-r1/work/desurium-cef-9999_build/external/depot_tools/src/depot_tools
/usr/bin/cmake -E make_directory /var/tmp/portage/media-libs/desurium-cef-9999-r1/work/desurium-cef-9999_build/chromium-prefix/src/chromium
/usr/bin/cmake -E make_directory /var/tmp/portage/media-libs/desurium-cef-9999-r1/work/desurium-cef-9999_build/external/depot_tools/src/depot_tools-build
/usr/bin/cmake -E make_directory /var/tmp/portage/media-libs/desurium-cef-9999-r1/work/desurium-cef-9999_build/chromium-prefix/src/chromium
/usr/bin/cmake -E make_directory /var/tmp/portage/media-libs/desurium-cef-9999-r1/work/desurium-cef-9999_build/external/depot_tools
/usr/bin/cmake -E make_directory /var/tmp/portage/media-libs/desurium-cef-9999-r1/work/desurium-cef-9999_build/chromium-prefix
/usr/bin/cmake -E make_directory /var/tmp/portage/media-libs/desurium-cef-9999-r1/work/desurium-cef-9999_build/external/depot_tools/tmp
/usr/bin/cmake -E make_directory /var/tmp/portage/media-libs/desurium-cef-9999-r1/work/desurium-cef-9999_build/chromium-prefix/tmp
/usr/bin/cmake -E make_directory /var/tmp/portage/media-libs/desurium-cef-9999-r1/work/desurium-cef-9999_build/chromium-prefix/src/chromium-stamp
/usr/bin/cmake -E make_directory /var/tmp/portage/media-libs/desurium-cef-9999-r1/work/desurium-cef-9999_build/external/depot_tools/src/depot_tools-stamp
/usr/bin/cmake -E make_directory /var/tmp/portage/media-libs/desurium-cef-9999-r1/work/desurium-cef-9999_build/chromium-prefix/src
/usr/bin/cmake -E make_directory /var/tmp/portage/media-libs/desurium-cef-9999-r1/work/desurium-cef-9999_build/external/depot_tools/src
/usr/bin/cmake -E touch /var/tmp/portage/media-libs/desurium-cef-9999-r1/work/desurium-cef-9999_build/external/depot_tools/src/depot_tools-stamp/depot_tools-mkdir
/usr/bin/cmake -E touch /var/tmp/portage/media-libs/desurium-cef-9999-r1/work/desurium-cef-9999_build/chromium-prefix/src/chromium-stamp/chromium-mkdir
/usr/bin/cmake -E cmake_progress_report /var/tmp/portage/media-libs/desurium-cef-9999-r1/work/desurium-cef-9999_build/CMakeFiles 26
[ 7%] /usr/bin/cmake -E cmake_progress_report /var/tmp/portage/media-libs/desurium-cef-9999-r1/work/desurium-cef-9999_build/CMakeFiles 18
Performing download step (verify and extract) for 'depot_tools'
[ 10%] cd /var/tmp/portage/media-libs/desurium-cef-9999-r1/work/desurium-cef-9999_build/external/depot_tools/src && /usr/bin/cmake -P /var/tmp/portage/media-libs/desurium-cef-9999-r1/work/desurium-cef-9999_build/external/depot_tools/src/depot_tools-stamp/verify-depot_tools.cmake
Performing download step (verify and extract) for 'chromium'
cd /var/tmp/portage/media-libs/desurium-cef-9999-r1/work/desurium-cef-9999_build/chromium-prefix/src && /usr/bin/cmake -P /var/tmp/portage/media-libs/desurium-cef-9999-r1/work/desurium-cef-9999_build/chromium-prefix/src/chromium-stamp/verify-chromium.cmake
-- verifying file...
file='/var/tmp/portage/media-libs/desurium-cef-9999-r1/distdir/depot_tools-145556-2.tar.gz'
-- verifying file... warning: did not verify file - no URL_HASH specified?
cd /var/tmp/portage/media-libs/desurium-cef-9999-r1/work/desurium-cef-9999_build/external/depot_tools/src && /usr/bin/cmake -P /var/tmp/portage/media-libs/desurium-cef-9999-r1/work/desurium-cef-9999_build/external/depot_tools/src/depot_tools-stamp/extract-depot_tools.cmake
-- verifying file...
file='/var/tmp/portage/media-libs/desurium-cef-9999-r1/distdir/chromium-15.0.876.0.tar.bz2'
-- verifying file... warning: did not verify file - no URL_HASH specified?
-- extracting...
src='/var/tmp/portage/media-libs/desurium-cef-9999-r1/distdir/depot_tools-145556-2.tar.gz'
dst='/var/tmp/portage/media-libs/desurium-cef-9999-r1/work/desurium-cef-9999_build/external/depot_tools/src/depot_tools'
cd /var/tmp/portage/media-libs/desurium-cef-9999-r1/work/desurium-cef-9999_build/chromium-prefix/src && /usr/bin/cmake -P /var/tmp/portage/media-libs/desurium-cef-9999-r1/work/desurium-cef-9999_build/chromium-prefix/src/chromium-stamp/extract-chromium.cmake
-- extracting... [tar xfz]
-- extracting...
src='/var/tmp/portage/media-libs/desurium-cef-9999-r1/distdir/chromium-15.0.876.0.tar.bz2'
dst='/var/tmp/portage/media-libs/desurium-cef-9999-r1/work/desurium-cef-9999_build/chromium-prefix/src/chromium'
-- extracting... [tar xfz]
-- extracting... [analysis]
-- extracting... [rename]
-- extracting... [clean up]
-- extracting... done
cd /var/tmp/portage/media-libs/desurium-cef-9999-r1/work/desurium-cef-9999_build/external/depot_tools/src && /usr/bin/cmake -E touch /var/tmp/portage/media-libs/desurium-cef-9999-r1/work/desurium-cef-9999_build/external/depot_tools/src/depot_tools-stamp/depot_tools-download
/usr/bin/cmake -E cmake_progress_report /var/tmp/portage/media-libs/desurium-cef-9999-r1/work/desurium-cef-9999_build/CMakeFiles 28
[ 12%] No patch step for 'depot_tools'
/usr/bin/cmake -E touch /var/tmp/portage/media-libs/desurium-cef-9999-r1/work/desurium-cef-9999_build/external/depot_tools/src/depot_tools-stamp/depot_tools-patch
/usr/bin/cmake -E cmake_progress_report /var/tmp/portage/media-libs/desurium-cef-9999-r1/work/desurium-cef-9999_build/CMakeFiles 27
[ 15%] No update step for 'depot_tools'
cd /var/tmp/portage/media-libs/desurium-cef-9999-r1/work/desurium-cef-9999_build/external/depot_tools/src/depot_tools && /usr/bin/cmake -E touch /var/tmp/portage/media-libs/desurium-cef-9999-r1/work/desurium-cef-9999_build/external/depot_tools/src/depot_tools-stamp/depot_tools-update
/usr/bin/cmake -E cmake_progress_report /var/tmp/portage/media-libs/desurium-cef-9999-r1/work/desurium-cef-9999_build/CMakeFiles 29
[ 17%] No configure step for 'depot_tools'
cd /var/tmp/portage/media-libs/desurium-cef-9999-r1/work/desurium-cef-9999_build/external/depot_tools/src/depot_tools-build && /usr/bin/cmake -E touch /var/tmp/portage/media-libs/desurium-cef-9999-r1/work/desurium-cef-9999_build/external/depot_tools/src/depot_tools-stamp/depot_tools-configure
/usr/bin/cmake -E cmake_progress_report /var/tmp/portage/media-libs/desurium-cef-9999-r1/work/desurium-cef-9999_build/CMakeFiles 30
[ 20%] No build step for 'depot_tools'
cd /var/tmp/portage/media-libs/desurium-cef-9999-r1/work/desurium-cef-9999_build/external/depot_tools/src/depot_tools-build && /usr/bin/cmake -E touch /var/tmp/portage/media-libs/desurium-cef-9999-r1/work/desurium-cef-9999_build/external/depot_tools/src/depot_tools-stamp/depot_tools-build
/usr/bin/cmake -E cmake_progress_report /var/tmp/portage/media-libs/desurium-cef-9999-r1/work/desurium-cef-9999_build/CMakeFiles 24
[ 23%] No install step for 'depot_tools'
cd /var/tmp/portage/media-libs/desurium-cef-9999-r1/work/desurium-cef-9999_build/external/depot_tools/src/depot_tools-build && /usr/bin/cmake -E touch /var/tmp/portage/media-libs/desurium-cef-9999-r1/work/desurium-cef-9999_build/external/depot_tools/src/depot_tools-stamp/depot_tools-install
/usr/bin/cmake -E cmake_progress_report /var/tmp/portage/media-libs/desurium-cef-9999-r1/work/desurium-cef-9999_build/CMakeFiles 23
[ 25%] Completed 'depot_tools'
/usr/bin/cmake -E make_directory /var/tmp/portage/media-libs/desurium-cef-9999-r1/work/desurium-cef-9999_build/CMakeFiles
/usr/bin/cmake -E touch /var/tmp/portage/media-libs/desurium-cef-9999-r1/work/desurium-cef-9999_build/CMakeFiles/depot_tools-complete
/usr/bin/cmake -E touch /var/tmp/portage/media-libs/desurium-cef-9999-r1/work/desurium-cef-9999_build/external/depot_tools/src/depot_tools-stamp/depot_tools-done
make[2]: Leaving directory `/var/tmp/portage/media-libs/desurium-cef-9999-r1/work/desurium-cef-9999_build'
/usr/bin/cmake -E cmake_progress_report /var/tmp/portage/media-libs/desurium-cef-9999-r1/work/desurium-cef-9999_build/CMakeFiles 23 24 25 26 27 28 29 30
[ 25%] Built target depot_tools
make -f CMakeFiles/fetch_cef.dir/build.make CMakeFiles/fetch_cef.dir/depend
make[2]: Entering directory `/var/tmp/portage/media-libs/desurium-cef-9999-r1/work/desurium-cef-9999_build'
cd /var/tmp/portage/media-libs/desurium-cef-9999-r1/work/desurium-cef-9999_build && /usr/bin/cmake -E cmake_depends "Unix Makefiles" /var/tmp/portage/media-libs/desurium-cef-9999-r1/work/desurium-cef-9999 /var/tmp/portage/media-libs/desurium-cef-9999-r1/work/desurium-cef-9999 /var/tmp/portage/media-libs/desurium-cef-9999-r1/work/desurium-cef-9999_build /var/tmp/portage/media-libs/desurium-cef-9999-r1/work/desurium-cef-9999_build /var/tmp/portage/media-libs/desurium-cef-9999-r1/work/desurium-cef-9999_build/CMakeFiles/fetch_cef.dir/DependInfo.cmake --color=
Dependee "/var/tmp/portage/media-libs/desurium-cef-9999-r1/work/desurium-cef-9999_build/CMakeFiles/fetch_cef.dir/DependInfo.cmake" is newer than depender "/var/tmp/portage/media-libs/desurium-cef-9999-r1/work/desurium-cef-9999_build/CMakeFiles/fetch_cef.dir/depend.internal".
Dependee "/var/tmp/portage/media-libs/desurium-cef-9999-r1/work/desurium-cef-9999_build/CMakeFiles/CMakeDirectoryInformation.cmake" is newer than depender "/var/tmp/portage/media-libs/desurium-cef-9999-r1/work/desurium-cef-9999_build/CMakeFiles/fetch_cef.dir/depend.internal".
Scanning dependencies of target fetch_cef
make[2]: Leaving directory `/var/tmp/portage/media-libs/desurium-cef-9999-r1/work/desurium-cef-9999_build'
make -f CMakeFiles/fetch_cef.dir/build.make CMakeFiles/fetch_cef.dir/build
make[2]: Entering directory `/var/tmp/portage/media-libs/desurium-cef-9999-r1/work/desurium-cef-9999_build'
/usr/bin/cmake -E cmake_progress_report /var/tmp/portage/media-libs/desurium-cef-9999-r1/work/desurium-cef-9999_build/CMakeFiles 33
[ 28%] Creating directories for 'fetch_cef'
/usr/bin/cmake -E make_directory /var/tmp/portage/media-libs/desurium-cef-9999-r1/work/desurium-cef-9999_build/fetch_cef-prefix/src/fetch_cef
/usr/bin/cmake -E make_directory /var/tmp/portage/media-libs/desurium-cef-9999-r1/work/desurium-cef-9999_build/fetch_cef-prefix/src/fetch_cef-build
/usr/bin/cmake -E make_directory /var/tmp/portage/media-libs/desurium-cef-9999-r1/work/desurium-cef-9999_build/fetch_cef-prefix
/usr/bin/cmake -E make_directory /var/tmp/portage/media-libs/desurium-cef-9999-r1/work/desurium-cef-9999_build/fetch_cef-prefix/tmp
/usr/bin/cmake -E make_directory /var/tmp/portage/media-libs/desurium-cef-9999-r1/work/desurium-cef-9999_build/fetch_cef-prefix/src/fetch_cef-stamp
/usr/bin/cmake -E make_directory /var/tmp/portage/media-libs/desurium-cef-9999-r1/work/desurium-cef-9999_build/fetch_cef-prefix/src
/usr/bin/cmake -E touch /var/tmp/portage/media-libs/desurium-cef-9999-r1/work/desurium-cef-9999_build/fetch_cef-prefix/src/fetch_cef-stamp/fetch_cef-mkdir
/usr/bin/cmake -E cmake_progress_report /var/tmp/portage/media-libs/desurium-cef-9999-r1/work/desurium-cef-9999_build/CMakeFiles 34
[ 30%] Performing download step (verify and extract) for 'fetch_cef'
cd /var/tmp/portage/media-libs/desurium-cef-9999-r1/work/desurium-cef-9999_build/fetch_cef-prefix/src && /usr/bin/cmake -P /var/tmp/portage/media-libs/desurium-cef-9999-r1/work/desurium-cef-9999_build/fetch_cef-prefix/src/fetch_cef-stamp/verify-fetch_cef.cmake
-- verifying file...
file='/var/tmp/portage/media-libs/desurium-cef-9999-r1/distdir/cef-291.tar.gz'
-- verifying file... warning: did not verify file - no URL_HASH specified?
cd /var/tmp/portage/media-libs/desurium-cef-9999-r1/work/desurium-cef-9999_build/fetch_cef-prefix/src && /usr/bin/cmake -P /var/tmp/portage/media-libs/desurium-cef-9999-r1/work/desurium-cef-9999_build/fetch_cef-prefix/src/fetch_cef-stamp/extract-fetch_cef.cmake
-- extracting...
src='/var/tmp/portage/media-libs/desurium-cef-9999-r1/distdir/cef-291.tar.gz'
dst='/var/tmp/portage/media-libs/desurium-cef-9999-r1/work/desurium-cef-9999_build/fetch_cef-prefix/src/fetch_cef'
-- extracting... [tar xfz]
-- extracting... [analysis]
-- extracting... [rename]
-- extracting... [clean up]
-- extracting... done
cd /var/tmp/portage/media-libs/desurium-cef-9999-r1/work/desurium-cef-9999_build/fetch_cef-prefix/src && /usr/bin/cmake -E touch /var/tmp/portage/media-libs/desurium-cef-9999-r1/work/desurium-cef-9999_build/fetch_cef-prefix/src/fetch_cef-stamp/fetch_cef-download
/usr/bin/cmake -E cmake_progress_report /var/tmp/portage/media-libs/desurium-cef-9999-r1/work/desurium-cef-9999_build/CMakeFiles 36
[ 33%] Performing patch step for 'fetch_cef'
cd /var/tmp/portage/media-libs/desurium-cef-9999-r1/work/desurium-cef-9999_build/fetch_cef-prefix/src/fetch_cef && /var/tmp/portage/media-libs/desurium-cef-9999-r1/work/desurium-cef-9999/cmake/scripts/patch.sh /var/tmp/portage/media-libs/desurium-cef-9999-r1/work/desurium-cef-9999/cmake/patches/cef.patch
=== creating patch backup to /var/tmp/portage/media-libs/desurium-cef-9999-r1/work/desurium-cef-9999_build/fetch_cef-prefix/src/fetch_cef/bak_cef.patch ===
patching file cef_desura/ChromiumBrowser.cpp
patching file cef_desura/ChromiumBrowserEvents.cpp
patching file cef_desura/ChromiumBrowserEvents.h
patching file cef_desura/ChromiumBrowser.h
patching file cef_desura/Cookie.cpp
patching file cef_desura/JavaScriptContext.cpp
patching file cef_desura/JavaScriptContext.h
patching file cef_desura/JavaScriptExtender.cpp
patching file cef_desura/JavaScriptExtender.h
patching file cef_desura/JavaScriptFactory.cpp
patching file cef_desura/JavaScriptFactory.h
patching file cef_desura/JavaScriptFactory.h.edited
patching file cef_desura/JavaScriptObject.cpp
patching file cef_desura/JavaScriptObject.h
patching file cef_desura/MenuInfo.cpp
patching file cef_desura/MenuInfo.h
patching file cef_desura/SchemeExtender.cpp
patching file cef_desura/SchemeExtender.h
patching file cef_desura/SchemePost.cpp
patching file cef_desura/SchemePost.h
patching file cef_desura/SchemeRequest.cpp
patching file cef_desura/SchemeRequest.h
patching file cef_desura_includes/ChromiumBrowserI.h
patching file cef_desura_includes/SharedObjectLoader.h
patching file cef.gypi
patching file cef_resources.grd
patching file include/cef_capi.h
patching file include/cef.h
patching file include/internal/cef_string.h
patching file include/internal/cef_types.h
patching file include/internal/cef_types_linux.h
patching file libcef/browser_impl.cc
patching file libcef/browser_impl_gtk.cc
patching file libcef/browser_impl.h
patching file libcef/browser_request_context.cc
patching file libcef/browser_webkit_glue_gtk.cc
patching file libcef/browser_webkit_glue.h
patching file libcef/browser_webkit_init.cc
patching file libcef/browser_webview_delegate_gtk.cc
patching file libcef/browser_webview_delegate.h
patching file libcef/browser_webview_delegate_win.cc
patching file libcef/cef_context.cc
patching file libcef/cef_paths.cc
patching file libcef/cef_paths.h
patching file libcef/cef_process_ui_thread.cc
patching file libcef/cef_process_ui_thread_gtk.cc
patching file libcef/cef_string_map.cc
patching file libcef/v8_impl.cc
patching file libcef/webview_host.cc
patching file libcef/webview_host_gtk.cc
patching file libcef/webview_host.h
patching file libcef/webview_host_win.cc
patching file libcef/webwidget_host_gtk.cc
patching file libcef_dll/cpptoc/domdocument_cpptoc.cc
patching file libcef_dll/ctocpp/browser_ctocpp.h
patching file libcef_dll/ctocpp/frame_ctocpp.h
patching file libcef_dll/ctocpp/v8value_ctocpp.cc
patching file libcef_dll/version.h
patching file patch/patch.cfg
patching file patch/patches/desura.patch
patching file patch/patches/resources.patch
patching file patch/patches/root.patch
patching file patch/patches/webkit.patch
patching file resources/AHEM____.TTF
patching file resources/cef.ico
patching file resources/cef.rc
patching file resources/fonts.conf
patching file resources/missingImage.gif
patching file resources/missingImage.png
patching file resources/README.txt
patching file resources/small.ico
patching file resources/textAreaResizeCorner.png
patching file tests/cefclient/cefclient_gtk.cpp
patching file tests/gtkclient/cefclient_gtk.cpp
patching file tests/wxclient/main.cpp
patching file tools/gclient_hook.py
=== fake patch step returns with 0 ===
=== test succeeded. Apply patch ===
patching file cef_desura/ChromiumBrowser.cpp
patching file cef_desura/ChromiumBrowserEvents.cpp
patching file cef_desura/ChromiumBrowserEvents.h
patching file cef_desura/ChromiumBrowser.h
patching file cef_desura/Cookie.cpp
patching file cef_desura/JavaScriptContext.cpp
patching file cef_desura/JavaScriptContext.h
patching file cef_desura/JavaScriptExtender.cpp
patching file cef_desura/JavaScriptExtender.h
patching file cef_desura/JavaScriptFactory.cpp
patching file cef_desura/JavaScriptFactory.h
patching file cef_desura/JavaScriptFactory.h.edited
patching file cef_desura/JavaScriptObject.cpp
patching file cef_desura/JavaScriptObject.h
patching file cef_desura/MenuInfo.cpp
patching file cef_desura/MenuInfo.h
patching file cef_desura/SchemeExtender.cpp
patching file cef_desura/SchemeExtender.h
patching file cef_desura/SchemePost.cpp
patching file cef_desura/SchemePost.h
patching file cef_desura/SchemeRequest.cpp
patching file cef_desura/SchemeRequest.h
patching file cef_desura_includes/ChromiumBrowserI.h
patching file cef_desura_includes/SharedObjectLoader.h
patching file cef.gypi
patching file cef_resources.grd
patching file include/cef_capi.h
patching file include/cef.h
patching file include/internal/cef_string.h
patching file include/internal/cef_types.h
patching file include/internal/cef_types_linux.h
patching file libcef/browser_impl.cc
patching file libcef/browser_impl_gtk.cc
patching file libcef/browser_impl.h
patching file libcef/browser_request_context.cc
patching file libcef/browser_webkit_glue_gtk.cc
patching file libcef/browser_webkit_glue.h
patching file libcef/browser_webkit_init.cc
patching file libcef/browser_webview_delegate_gtk.cc
patching file libcef/browser_webview_delegate.h
patching file libcef/browser_webview_delegate_win.cc
patching file libcef/cef_context.cc
patching file libcef/cef_paths.cc
patching file libcef/cef_paths.h
patching file libcef/cef_process_ui_thread.cc
patching file libcef/cef_process_ui_thread_gtk.cc
patching file libcef/cef_string_map.cc
patching file libcef/v8_impl.cc
patching file libcef/webview_host.cc
patching file libcef/webview_host_gtk.cc
patching file libcef/webview_host.h
patching file libcef/webview_host_win.cc
patching file libcef/webwidget_host_gtk.cc
patching file libcef_dll/cpptoc/domdocument_cpptoc.cc
patching file libcef_dll/ctocpp/browser_ctocpp.h
patching file libcef_dll/ctocpp/frame_ctocpp.h
patching file libcef_dll/ctocpp/v8value_ctocpp.cc
patching file libcef_dll/version.h
patching file patch/patch.cfg
patching file patch/patches/desura.patch
patching file patch/patches/resources.patch
patching file patch/patches/root.patch
patching file patch/patches/webkit.patch
patching file resources/AHEM____.TTF
patching file resources/cef.ico
patching file resources/cef.rc
patching file resources/fonts.conf
patching file resources/missingImage.gif
patching file resources/missingImage.png
patching file resources/README.txt
patching file resources/small.ico
patching file resources/textAreaResizeCorner.png
patching file tests/cefclient/cefclient_gtk.cpp
patching file tests/gtkclient/cefclient_gtk.cpp
patching file tests/wxclient/main.cpp
patching file tools/gclient_hook.py
=== backing up new patch file ===
cd /var/tmp/portage/media-libs/desurium-cef-9999-r1/work/desurium-cef-9999_build/fetch_cef-prefix/src/fetch_cef && /usr/bin/cmake -E touch /var/tmp/portage/media-libs/desurium-cef-9999-r1/work/desurium-cef-9999_build/fetch_cef-prefix/src/fetch_cef-stamp/fetch_cef-patch
/usr/bin/cmake -E cmake_progress_report /var/tmp/portage/media-libs/desurium-cef-9999-r1/work/desurium-cef-9999_build/CMakeFiles 35
[ 35%] No update step for 'fetch_cef'
cd /var/tmp/portage/media-libs/desurium-cef-9999-r1/work/desurium-cef-9999_build/fetch_cef-prefix/src/fetch_cef && /usr/bin/cmake -E touch /var/tmp/portage/media-libs/desurium-cef-9999-r1/work/desurium-cef-9999_build/fetch_cef-prefix/src/fetch_cef-stamp/fetch_cef-update
/usr/bin/cmake -E cmake_progress_report /var/tmp/portage/media-libs/desurium-cef-9999-r1/work/desurium-cef-9999_build/CMakeFiles 39
[ 38%] Performing cef_gyp-patch step for 'fetch_cef'
cd /var/tmp/portage/media-libs/desurium-cef-9999-r1/work/desurium-cef-9999_build/fetch_cef-prefix/src/fetch_cef && /var/tmp/portage/media-libs/desurium-cef-9999-r1/work/desurium-cef-9999/cmake/scripts/patch.sh /var/tmp/portage/media-libs/desurium-cef-9999-r1/work/desurium-cef-9999_build/gen/patches/cef_gyp.patch
=== creating patch backup to /var/tmp/portage/media-libs/desurium-cef-9999-r1/work/desurium-cef-9999_build/fetch_cef-prefix/src/fetch_cef/bak_cef_gyp.patch ===
patching file cef.gyp
=== fake patch step returns with 0 ===
=== test succeeded. Apply patch ===
patching file cef.gyp
=== backing up new patch file ===
cd /var/tmp/portage/media-libs/desurium-cef-9999-r1/work/desurium-cef-9999_build/fetch_cef-prefix/src/fetch_cef && /usr/bin/cmake -E touch /var/tmp/portage/media-libs/desurium-cef-9999-r1/work/desurium-cef-9999_build/fetch_cef-prefix/src/fetch_cef-stamp/fetch_cef-cef_gyp-patch
/usr/bin/cmake -E cmake_progress_report /var/tmp/portage/media-libs/desurium-cef-9999-r1/work/desurium-cef-9999_build/CMakeFiles 37
[ 41%] No configure step for 'fetch_cef'
cd /var/tmp/portage/media-libs/desurium-cef-9999-r1/work/desurium-cef-9999_build/fetch_cef-prefix/src/fetch_cef-build && /usr/bin/cmake -E touch /var/tmp/portage/media-libs/desurium-cef-9999-r1/work/desurium-cef-9999_build/fetch_cef-prefix/src/fetch_cef-stamp/fetch_cef-configure
/usr/bin/cmake -E cmake_progress_report /var/tmp/portage/media-libs/desurium-cef-9999-r1/work/desurium-cef-9999_build/CMakeFiles 38
[ 43%] No build step for 'fetch_cef'
cd /var/tmp/portage/media-libs/desurium-cef-9999-r1/work/desurium-cef-9999_build/fetch_cef-prefix/src/fetch_cef-build && /usr/bin/cmake -E touch /var/tmp/portage/media-libs/desurium-cef-9999-r1/work/desurium-cef-9999_build/fetch_cef-prefix/src/fetch_cef-stamp/fetch_cef-build
/usr/bin/cmake -E cmake_progress_report /var/tmp/portage/media-libs/desurium-cef-9999-r1/work/desurium-cef-9999_build/CMakeFiles 32
[ 46%] No install step for 'fetch_cef'
cd /var/tmp/portage/media-libs/desurium-cef-9999-r1/work/desurium-cef-9999_build/fetch_cef-prefix/src/fetch_cef-build && /usr/bin/cmake -E touch /var/tmp/portage/media-libs/desurium-cef-9999-r1/work/desurium-cef-9999_build/fetch_cef-prefix/src/fetch_cef-stamp/fetch_cef-install
/usr/bin/cmake -E cmake_progress_report /var/tmp/portage/media-libs/desurium-cef-9999-r1/work/desurium-cef-9999_build/CMakeFiles 31
[ 48%] Completed 'fetch_cef'
/usr/bin/cmake -E make_directory /var/tmp/portage/media-libs/desurium-cef-9999-r1/work/desurium-cef-9999_build/CMakeFiles
/usr/bin/cmake -E touch /var/tmp/portage/media-libs/desurium-cef-9999-r1/work/desurium-cef-9999_build/CMakeFiles/fetch_cef-complete
/usr/bin/cmake -E touch /var/tmp/portage/media-libs/desurium-cef-9999-r1/work/desurium-cef-9999_build/fetch_cef-prefix/src/fetch_cef-stamp/fetch_cef-done
make[2]: Leaving directory `/var/tmp/portage/media-libs/desurium-cef-9999-r1/work/desurium-cef-9999_build'
/usr/bin/cmake -E cmake_progress_report /var/tmp/portage/media-libs/desurium-cef-9999-r1/work/desurium-cef-9999_build/CMakeFiles 31 32 33 34 35 36 37 38 39
[ 48%] Built target fetch_cef
-- extracting... [analysis]
-- extracting... [rename]
-- extracting... [clean up]
-- extracting... done
cd /var/tmp/portage/media-libs/desurium-cef-9999-r1/work/desurium-cef-9999_build/chromium-prefix/src && /usr/bin/cmake -E touch /var/tmp/portage/media-libs/desurium-cef-9999-r1/work/desurium-cef-9999_build/chromium-prefix/src/chromium-stamp/chromium-download
/usr/bin/cmake -E cmake_progress_report /var/tmp/portage/media-libs/desurium-cef-9999-r1/work/desurium-cef-9999_build/CMakeFiles 20
/usr/bin/cmake -E cmake_progress_report /var/tmp/portage/media-libs/desurium-cef-9999-r1/work/desurium-cef-9999_build/CMakeFiles 19
[ 53%] [ 53%] No update step for 'chromium'
cd /var/tmp/portage/media-libs/desurium-cef-9999-r1/work/desurium-cef-9999_build/chromium-prefix/src/chromium && /usr/bin/cmake -E touch /var/tmp/portage/media-libs/desurium-cef-9999-r1/work/desurium-cef-9999_build/chromium-prefix/src/chromium-stamp/chromium-update
No patch step for 'chromium'
/usr/bin/cmake -E touch /var/tmp/portage/media-libs/desurium-cef-9999-r1/work/desurium-cef-9999_build/chromium-prefix/src/chromium-stamp/chromium-patch
/usr/bin/cmake -E cmake_progress_report /var/tmp/portage/media-libs/desurium-cef-9999-r1/work/desurium-cef-9999_build/CMakeFiles 21
[ 56%] No configure step for 'chromium'
cd /var/tmp/portage/media-libs/desurium-cef-9999-r1/work/desurium-cef-9999_build/chromium-prefix/src/chromium && /usr/bin/cmake -E touch /var/tmp/portage/media-libs/desurium-cef-9999-r1/work/desurium-cef-9999_build/chromium-prefix/src/chromium-stamp/chromium-configure
/usr/bin/cmake -E cmake_progress_report /var/tmp/portage/media-libs/desurium-cef-9999-r1/work/desurium-cef-9999_build/CMakeFiles 22
[ 58%] No build step for 'chromium'
cd /var/tmp/portage/media-libs/desurium-cef-9999-r1/work/desurium-cef-9999_build/chromium-prefix/src/chromium && /usr/bin/cmake -E touch /var/tmp/portage/media-libs/desurium-cef-9999-r1/work/desurium-cef-9999_build/chromium-prefix/src/chromium-stamp/chromium-build
/usr/bin/cmake -E cmake_progress_report /var/tmp/portage/media-libs/desurium-cef-9999-r1/work/desurium-cef-9999_build/CMakeFiles 16
[ 61%] Performing install step for 'chromium'
cd /var/tmp/portage/media-libs/desurium-cef-9999-r1/work/desurium-cef-9999_build/chromium-prefix/src/chromium && /var/tmp/portage/media-libs/desurium-cef-9999-r1/work/desurium-cef-9999/cmake/scripts/fix_chromium_path.sh
cd /var/tmp/portage/media-libs/desurium-cef-9999-r1/work/desurium-cef-9999_build/chromium-prefix/src/chromium && /usr/bin/cmake -E touch /var/tmp/portage/media-libs/desurium-cef-9999-r1/work/desurium-cef-9999_build/chromium-prefix/src/chromium-stamp/chromium-install
/usr/bin/cmake -E cmake_progress_report /var/tmp/portage/media-libs/desurium-cef-9999-r1/work/desurium-cef-9999_build/CMakeFiles 15
[ 64%] Completed 'chromium'
/usr/bin/cmake -E make_directory /var/tmp/portage/media-libs/desurium-cef-9999-r1/work/desurium-cef-9999_build/CMakeFiles
/usr/bin/cmake -E touch /var/tmp/portage/media-libs/desurium-cef-9999-r1/work/desurium-cef-9999_build/CMakeFiles/chromium-complete
/usr/bin/cmake -E touch /var/tmp/portage/media-libs/desurium-cef-9999-r1/work/desurium-cef-9999_build/chromium-prefix/src/chromium-stamp/chromium-done
make[2]: Leaving directory `/var/tmp/portage/media-libs/desurium-cef-9999-r1/work/desurium-cef-9999_build'
/usr/bin/cmake -E cmake_progress_report /var/tmp/portage/media-libs/desurium-cef-9999-r1/work/desurium-cef-9999_build/CMakeFiles 15 16 17 18 19 20 21 22
[ 64%] Built target chromium
make -f CMakeFiles/cef.dir/build.make CMakeFiles/cef.dir/depend
make[2]: Entering directory `/var/tmp/portage/media-libs/desurium-cef-9999-r1/work/desurium-cef-9999_build'
cd /var/tmp/portage/media-libs/desurium-cef-9999-r1/work/desurium-cef-9999_build && /usr/bin/cmake -E cmake_depends "Unix Makefiles" /var/tmp/portage/media-libs/desurium-cef-9999-r1/work/desurium-cef-9999 /var/tmp/portage/media-libs/desurium-cef-9999-r1/work/desurium-cef-9999 /var/tmp/portage/media-libs/desurium-cef-9999-r1/work/desurium-cef-9999_build /var/tmp/portage/media-libs/desurium-cef-9999-r1/work/desurium-cef-9999_build /var/tmp/portage/media-libs/desurium-cef-9999-r1/work/desurium-cef-9999_build/CMakeFiles/cef.dir/DependInfo.cmake --color=
Dependee "/var/tmp/portage/media-libs/desurium-cef-9999-r1/work/desurium-cef-9999_build/CMakeFiles/cef.dir/DependInfo.cmake" is newer than depender "/var/tmp/portage/media-libs/desurium-cef-9999-r1/work/desurium-cef-9999_build/CMakeFiles/cef.dir/depend.internal".
Dependee "/var/tmp/portage/media-libs/desurium-cef-9999-r1/work/desurium-cef-9999_build/CMakeFiles/CMakeDirectoryInformation.cmake" is newer than depender "/var/tmp/portage/media-libs/desurium-cef-9999-r1/work/desurium-cef-9999_build/CMakeFiles/cef.dir/depend.internal".
Scanning dependencies of target cef
make[2]: Leaving directory `/var/tmp/portage/media-libs/desurium-cef-9999-r1/work/desurium-cef-9999_build'
make -f CMakeFiles/cef.dir/build.make CMakeFiles/cef.dir/build
make[2]: Entering directory `/var/tmp/portage/media-libs/desurium-cef-9999-r1/work/desurium-cef-9999_build'
/usr/bin/cmake -E cmake_progress_report /var/tmp/portage/media-libs/desurium-cef-9999-r1/work/desurium-cef-9999_build/CMakeFiles 9
/usr/bin/cmake -E cmake_progress_report /var/tmp/portage/media-libs/desurium-cef-9999-r1/work/desurium-cef-9999_build/CMakeFiles 3
[ 69%] [ 69%] Creating directories for 'cef'
/usr/bin/cmake -E make_directory /var/tmp/portage/media-libs/desurium-cef-9999-r1/work/desurium-cef-9999_build/cef-prefix/src/cef
Performing copy_files step for 'cef'
cd /var/tmp/portage/media-libs/desurium-cef-9999-r1/work/desurium-cef-9999_build/chromium-prefix/src/chromium/src && cp -r /var/tmp/portage/media-libs/desurium-cef-9999-r1/work/desurium-cef-9999_build/fetch_cef-prefix/src/fetch_cef ./cef
/usr/bin/cmake -E make_directory /var/tmp/portage/media-libs/desurium-cef-9999-r1/work/desurium-cef-9999_build/cef-prefix/src/cef
/usr/bin/cmake -E make_directory /var/tmp/portage/media-libs/desurium-cef-9999-r1/work/desurium-cef-9999_build/cef-prefix
/usr/bin/cmake -E make_directory /var/tmp/portage/media-libs/desurium-cef-9999-r1/work/desurium-cef-9999_build/cef-prefix/tmp
/usr/bin/cmake -E make_directory /var/tmp/portage/media-libs/desurium-cef-9999-r1/work/desurium-cef-9999_build/cef-prefix/src/cef-stamp
/usr/bin/cmake -E make_directory /var/tmp/portage/media-libs/desurium-cef-9999-r1/work/desurium-cef-9999_build/cef-prefix/src
/usr/bin/cmake -E touch /var/tmp/portage/media-libs/desurium-cef-9999-r1/work/desurium-cef-9999_build/cef-prefix/src/cef-stamp/cef-mkdir
/usr/bin/cmake -E cmake_progress_report /var/tmp/portage/media-libs/desurium-cef-9999-r1/work/desurium-cef-9999_build/CMakeFiles 12
[ 71%] Performing bison-2-6-patch step for 'cef'
cd /var/tmp/portage/media-libs/desurium-cef-9999-r1/work/desurium-cef-9999_build/chromium-prefix/src/chromium/src && /var/tmp/portage/media-libs/desurium-cef-9999-r1/work/desurium-cef-9999/cmake/scripts/patch.sh /var/tmp/portage/media-libs/desurium-cef-9999-r1/work/desurium-cef-9999/cmake/patches/chromium-bison-2.6.patch
=== creating patch backup to /var/tmp/portage/media-libs/desurium-cef-9999-r1/work/desurium-cef-9999_build/chromium-prefix/src/chromium/src/bak_chromium-bison-2.6.patch ===
patching file third_party/WebKit/Source/WebCore/css/CSSGrammar.y
patching file third_party/WebKit/Source/WebCore/css/CSSParser.cpp
patching file third_party/WebKit/Source/WebCore/xml/XPathGrammar.y
patching file third_party/WebKit/Source/WebCore/xml/XPathParser.cpp
=== fake patch step returns with 0 ===
=== test succeeded. Apply patch ===
patching file third_party/WebKit/Source/WebCore/css/CSSGrammar.y
patching file third_party/WebKit/Source/WebCore/css/CSSParser.cpp
patching file third_party/WebKit/Source/WebCore/xml/XPathGrammar.y
patching file third_party/WebKit/Source/WebCore/xml/XPathParser.cpp
=== backing up new patch file ===
cd /var/tmp/portage/media-libs/desurium-cef-9999-r1/work/desurium-cef-9999_build/chromium-prefix/src/chromium/src && /usr/bin/cmake -E touch /var/tmp/portage/media-libs/desurium-cef-9999-r1/work/desurium-cef-9999_build/cef-prefix/src/cef-stamp/cef-bison-2-6-patch
/usr/bin/cmake -E cmake_progress_report /var/tmp/portage/media-libs/desurium-cef-9999-r1/work/desurium-cef-9999_build/CMakeFiles 10
[ 74%] Performing glib-2-32-patch step for 'cef'
cd /var/tmp/portage/media-libs/desurium-cef-9999-r1/work/desurium-cef-9999_build/chromium-prefix/src/chromium/src && /var/tmp/portage/media-libs/desurium-cef-9999-r1/work/desurium-cef-9999/cmake/scripts/patch.sh /var/tmp/portage/media-libs/desurium-cef-9999-r1/work/desurium-cef-9999/cmake/patches/cef_glib_2_32_compile.patch
=== creating patch backup to /var/tmp/portage/media-libs/desurium-cef-9999-r1/work/desurium-cef-9999_build/chromium-prefix/src/chromium/src/bak_cef_glib_2_32_compile.patch ===
patching file ui/base/l10n/l10n_util.cc
=== fake patch step returns with 0 ===
=== test succeeded. Apply patch ===
patching file ui/base/l10n/l10n_util.cc
cd /var/tmp/portage/media-libs/desurium-cef-9999-r1/work/desurium-cef-9999_build/chromium-prefix/src/chromium/src && /usr/bin/cmake -E touch /var/tmp/portage/media-libs/desurium-cef-9999-r1/work/desurium-cef-9999_build/cef-prefix/src/cef-stamp/cef-copy_files
/usr/bin/cmake -E cmake_progress_report /var/tmp/portage/media-libs/desurium-cef-9999-r1/work/desurium-cef-9999_build/CMakeFiles 11
[ 76%] Performing gcc-4-7-patch step for 'cef'
cd /var/tmp/portage/media-libs/desurium-cef-9999-r1/work/desurium-cef-9999_build/chromium-prefix/src/chromium/src && /var/tmp/portage/media-libs/desurium-cef-9999-r1/work/desurium-cef-9999/cmake/scripts/patch.sh /var/tmp/portage/media-libs/desurium-cef-9999-r1/work/desurium-cef-9999/cmake/patches/cef_gcc47_compile_fix.patch
=== creating patch backup to /var/tmp/portage/media-libs/desurium-cef-9999-r1/work/desurium-cef-9999_build/chromium-prefix/src/chromium/src/bak_cef_gcc47_compile_fix.patch ===
=== backing up new patch file ===
patching file base/message_pump_libevent.cc
Hunk #1 merged at 9.
patching file ipc/ipc_channel.h
cd /var/tmp/portage/media-libs/desurium-cef-9999-r1/work/desurium-cef-9999_build/chromium-prefix/src/chromium/src && /usr/bin/cmake -E touch /var/tmp/portage/media-libs/desurium-cef-9999-r1/work/desurium-cef-9999_build/cef-prefix/src/cef-stamp/cef-glib-2-32-patch
/usr/bin/cmake -E cmake_progress_report /var/tmp/portage/media-libs/desurium-cef-9999-r1/work/desurium-cef-9999_build/CMakeFiles 4
[ 79%] No download step for 'cef'
cd /var/tmp/portage/media-libs/desurium-cef-9999-r1/work/desurium-cef-9999_build/cef-prefix/src && /usr/bin/cmake -E touch /var/tmp/portage/media-libs/desurium-cef-9999-r1/work/desurium-cef-9999_build/cef-prefix/src/cef-stamp/cef-download
/usr/bin/cmake -E cmake_progress_report /var/tmp/portage/media-libs/desurium-cef-9999-r1/work/desurium-cef-9999_build/CMakeFiles 13
[ 82%] Performing config_cef step for 'cef'
cd /var/tmp/portage/media-libs/desurium-cef-9999-r1/work/desurium-cef-9999_build/chromium-prefix/src/chromium/src/cef && /var/tmp/portage/media-libs/desurium-cef-9999-r1/work/desurium-cef-9999/cmake/scripts/depot_tools_wrapper.sh /var/tmp/portage/media-libs/desurium-cef-9999-r1/work/desurium-cef-9999_build/external/depot_tools/src/depot_tools ./cef_create_projects.sh
Patching build configuration and source files for CEF...
________ running '/var/tmp/portage/media-libs/desurium-cef-9999-r1/work/desurium-cef-9999_build/external/depot_tools/src/depot_tools/python tools/patcher.py --patch-config patch/patch.cfg' in '/var/tmp/portage/media-libs/desurium-cef-9999-r1/work/desurium-cef-9999_build/chromium-prefix/src/chromium/src/cef'
Reading patch file /var/tmp/portage/media-libs/desurium-cef-9999-r1/work/desurium-cef-9999_build/chromium-prefix/src/chromium/src/cef/patch/patches/desura.patch
WARNING:root:successfully patched ../net/proxy/proxy_service.cc
WARNING:root:successfully patched ../net/ocsp/nss_ocsp.cc
Reading patch file /var/tmp/portage/media-libs/desurium-cef-9999-r1/work/desurium-cef-9999_build/chromium-prefix/src/chromium/src/cef/patch/patches/base.patch
WARNING:root:successfully patched ../base/message_loop.cc
WARNING:root:successfully patched ../base/message_loop.h
Reading patch file /var/tmp/portage/media-libs/desurium-cef-9999-r1/work/desurium-cef-9999_build/chromium-prefix/src/chromium/src/cef/patch/patches/build.patch
WARNING:root:successfully patched ../build/common.gypi
Reading patch file /var/tmp/portage/media-libs/desurium-cef-9999-r1/work/desurium-cef-9999_build/chromium-prefix/src/chromium/src/cef/patch/patches/webkit.patch
WARNING:root:successfully patched ../third_party/WebKit/Source/WebCore/bindings/v8/custom/V8DOMWindowCustom.cpp
WARNING:root:successfully patched ../third_party/WebKit/Source/WebCore/html/HTMLAnchorElement.cpp
WARNING:root:successfully patched ../third_party/WebKit/Source/WebCore/html/HTMLViewSourceDocument.cpp
WARNING:root:successfully patched ../third_party/WebKit/Source/WebCore/page/ContextMenuController.cpp
WARNING:root:successfully patched ../third_party/WebKit/Source/WebCore/svg/SVGAElement.cpp
Reading patch file /var/tmp/portage/media-libs/desurium-cef-9999-r1/work/desurium-cef-9999_build/chromium-prefix/src/chromium/src/cef/patch/patches/root.patch
WARNING:root:successfully patched ../base/message_loop.h
Reading patch file /var/tmp/portage/media-libs/desurium-cef-9999-r1/work/desurium-cef-9999_build/chromium-prefix/src/chromium/src/cef/patch/patches/resources.patch
WARNING:root:successfully patched ../tools/grit/resource_ids
Writing file /var/tmp/portage/media-libs/desurium-cef-9999-r1/work/desurium-cef-9999_build/chromium-prefix/src/chromium/src/cef/patch/patch_state.h.
Generating CEF project files...
________ running '/var/tmp/portage/media-libs/desurium-cef-9999-r1/work/desurium-cef-9999_build/external/depot_tools/src/depot_tools/python tools/gyp_cef cef.gyp -I cef.gypi -Dwerror= -Duse_cups=0 -Duse_gconf=0 -Duse_gnome_keyring=0 -Duse_kerberos=0 -Duse_system_bzip2=1 -Duse_system_flac=1 -Duse_system_icu=0 -Duse_system_libevent=1 -Duse_system_libjpeg=1 -Duse_system_libpng=1 -Duse_system_libwebp=0 -Duse_system_libxml=1 -Duse_system_speex=1 -Duse_system_v8=0 -Duse_system_xdg_utils=1 -Duse_system_yasm=1 -Duse_system_zlib=1' in '/var/tmp/portage/media-libs/desurium-cef-9999-r1/work/desurium-cef-9999_build/chromium-prefix/src/chromium/src/cef'
patching file ipc/ipc_platform_file.cc
patching file seccompsandbox/library.h
=== fake patch step returns with 0 ===
=== test succeeded. Apply patch ===
patching file base/message_pump_libevent.cc
Hunk #1 merged at 9.
patching file ipc/ipc_channel.h
patching file ipc/ipc_platform_file.cc
patching file seccompsandbox/library.h
=== backing up new patch file ===
cd /var/tmp/portage/media-libs/desurium-cef-9999-r1/work/desurium-cef-9999_build/chromium-prefix/src/chromium/src && /usr/bin/cmake -E touch /var/tmp/portage/media-libs/desurium-cef-9999-r1/work/desurium-cef-9999_build/cef-prefix/src/cef-stamp/cef-gcc-4-7-patch
/usr/bin/cmake -E cmake_progress_report /var/tmp/portage/media-libs/desurium-cef-9999-r1/work/desurium-cef-9999_build/CMakeFiles 5
[ 84%] No update step for 'cef'
cd /var/tmp/portage/media-libs/desurium-cef-9999-r1/work/desurium-cef-9999_build/cef-prefix/src/cef && /usr/bin/cmake -E touch /var/tmp/portage/media-libs/desurium-cef-9999-r1/work/desurium-cef-9999_build/cef-prefix/src/cef-stamp/cef-update
Updating projects from gyp files...
/usr/bin/cmake -E cmake_progress_report /var/tmp/portage/media-libs/desurium-cef-9999-r1/work/desurium-cef-9999_build/CMakeFiles 6
[ 87%] No patch step for 'cef'
/usr/bin/cmake -E touch /var/tmp/portage/media-libs/desurium-cef-9999-r1/work/desurium-cef-9999_build/cef-prefix/src/cef-stamp/cef-patch
Traceback (most recent call last):
File "tools/gyp_cef", line 155, in <module>
sys.exit(gyp.main(args))
File "/var/tmp/portage/media-libs/desurium-cef-9999-r1/work/desurium-cef-9999_build/chromium-prefix/src/chromium/src/tools/gyp/pylib/gyp/__init__.py", line 463, in main
options.circular_check)
File "/var/tmp/portage/media-libs/desurium-cef-9999-r1/work/desurium-cef-9999_build/chromium-prefix/src/chromium/src/tools/gyp/pylib/gyp/__init__.py", line 101, in Load
depth, generator_input_info, check, circular_check)
File "/var/tmp/portage/media-libs/desurium-cef-9999-r1/work/desurium-cef-9999_build/chromium-prefix/src/chromium/src/tools/gyp/pylib/gyp/input.py", line 2269, in Load
depth, check)
File "/var/tmp/portage/media-libs/desurium-cef-9999-r1/work/desurium-cef-9999_build/chromium-prefix/src/chromium/src/tools/gyp/pylib/gyp/input.py", line 435, in LoadTargetBuildFile
includes, depth, check)
File "/var/tmp/portage/media-libs/desurium-cef-9999-r1/work/desurium-cef-9999_build/chromium-prefix/src/chromium/src/tools/gyp/pylib/gyp/input.py", line 435, in LoadTargetBuildFile
includes, depth, check)
File "/var/tmp/portage/media-libs/desurium-cef-9999-r1/work/desurium-cef-9999_build/chromium-prefix/src/chromium/src/tools/gyp/pylib/gyp/input.py", line 435, in LoadTargetBuildFile
includes, depth, check)
File "/var/tmp/portage/media-libs/desurium-cef-9999-r1/work/desurium-cef-9999_build/chromium-prefix/src/chromium/src/tools/gyp/pylib/gyp/input.py", line 363, in LoadTargetBuildFile
includes, True, check)
File "/var/tmp/portage/media-libs/desurium-cef-9999-r1/work/desurium-cef-9999_build/chromium-prefix/src/chromium/src/tools/gyp/pylib/gyp/input.py", line 233, in LoadOneBuildFile
aux_data, variables, includes, check)
File "/var/tmp/portage/media-libs/desurium-cef-9999-r1/work/desurium-cef-9999_build/chromium-prefix/src/chromium/src/tools/gyp/pylib/gyp/input.py", line 271, in LoadBuildFileIncludesIntoDict
False, check),
File "/var/tmp/portage/media-libs/desurium-cef-9999-r1/work/desurium-cef-9999_build/chromium-prefix/src/chromium/src/tools/gyp/pylib/gyp/input.py", line 218, in LoadOneBuildFile
None)
File "<string>", line 227, in <module>
NameError: name 'os' is not defined while reading ../v8/build/common.gypi while reading includes of ../v8/tools/gyp/v8.gyp while loading dependencies of ../third_party/WebKit/Source/WebCore/WebCore.gyp/WebCore.gyp while loading dependencies of ../third_party/WebKit/Source/WebKit/chromium/WebKit.gyp while loading dependencies of cef.gyp while trying to load cef.gyp
Traceback (most recent call last):
File "tools/gclient_hook.py", line 79, in <module>
RunAction(cef_dir, gyper);
File "tools/gclient_hook.py", line 42, in RunAction
command, cwd=dir, always=True)
File "/var/tmp/portage/media-libs/desurium-cef-9999-r1/work/desurium-cef-9999_build/external/depot_tools/src/depot_tools/gclient_utils.py", line 213, in CheckCallAndFilterAndHeader
return CheckCallAndFilter(args, **kwargs)
File "/var/tmp/portage/media-libs/desurium-cef-9999-r1/work/desurium-cef-9999_build/external/depot_tools/src/depot_tools/gclient_utils.py", line 390, in CheckCallAndFilter
rv, args, kwargs.get('cwd', None), None, None)
subprocess2.CalledProcessError: Command /var/tmp/portage/media-libs/desurium-cef-9999-r1/work/desurium-cef-9999_build/external/depot_tools/src/depot_tools/python tools/gyp_cef cef.gyp -I cef.gypi -Dwerror= -Duse_cups=0 -Duse_gconf=0 -Duse_gnome_keyring=0 -Duse_kerberos=0 -Duse_system_bzip2=1 -Duse_system_flac=1 -Duse_system_icu=0 -Duse_system_libevent=1 -Duse_system_libjpeg=1 -Duse_system_libpng=1 -Duse_system_libwebp=0 -Duse_system_libxml=1 -Duse_system_speex=1 -Duse_system_v8=0 -Duse_system_xdg_utils=1 -Duse_system_yasm=1 -Duse_system_zlib=1 returned non-zero exit status 1 in /var/tmp/portage/media-libs/desurium-cef-9999-r1/work/desurium-cef-9999_build/chromium-prefix/src/chromium/src/cef
make[2]: *** [cef-prefix/src/cef-stamp/cef-config_cef] Error 1
make[2]: Leaving directory `/var/tmp/portage/media-libs/desurium-cef-9999-r1/work/desurium-cef-9999_build'
make[1]: *** [CMakeFiles/cef.dir/all] Error 2
make[1]: Leaving directory `/var/tmp/portage/media-libs/desurium-cef-9999-r1/work/desurium-cef-9999_build'
make: *** [all] Error 2
* ERROR: media-libs/desurium-cef-9999-r1 failed (compile phase):
* emake failed
*
* If you need support, post the output of `emerge --info '=media-libs/desurium-cef-9999-r1'`,
* the complete build log and the output of `emerge -pqv '=media-libs/desurium-cef-9999-r1'`.
* This ebuild is from an overlay named 'hasufell-overlay': '/usr/local/portage/'
* The complete build log is located at '/home/portage-log/build/media-libs/desurium-cef-9999-r1:20121230-223502.log'.
* For convenience, a symlink to the build log is located at '/var/tmp/portage/media-libs/desurium-cef-9999-r1/temp/build.log'.
* The ebuild environment file is located at '/var/tmp/portage/media-libs/desurium-cef-9999-r1/temp/environment'.
* Working directory: '/var/tmp/portage/media-libs/desurium-cef-9999-r1/work/desurium-cef-9999_build'
* S: '/var/tmp/portage/media-libs/desurium-cef-9999-r1/work/desurium-cef-9999'
Sign up for free to join this conversation on GitHub. Already have an account? Sign in to comment