Skip to content

Instantly share code, notes, and snippets.

Embed
What would you like to do?
[ 82%] No download step for 'cef'
cd /var/tmp/portage/media-libs/desurium-cef-9999/work/desurium-cef-9999_build/cef-prefix/src && /usr/bin/cmake -E touch /var/tmp/portage/media-libs/desurium-cef-9999/work/desurium-cef-9999_build/cef-prefix/src/cef-stamp/cef-download
/usr/bin/cmake -E cmake_progress_report /var/tmp/portage/media-libs/desurium-cef-9999/work/desurium-cef-9999_build/CMakeFiles 13
/usr/bin/cmake -E cmake_progress_report /var/tmp/portage/media-libs/desurium-cef-9999/work/desurium-cef-9999_build/CMakeFiles 5
[ 85%] [ 87%] Performing config_cef step for 'cef'
No update step for 'cef'
cd /var/tmp/portage/media-libs/desurium-cef-9999/work/desurium-cef-9999_build/chromium-prefix/src/chromium/src/cef && /var/tmp/portage/media-libs/desurium-cef-9999/work/desurium-cef-9999/cmake/scripts/depot_tools_wrapper.sh /var/tmp/portage/media-libs/desurium-cef-9999/work/desurium-cef-9999_build/external/depot_tools/src/depot_tools ./cef_create_projects.sh
cd /var/tmp/portage/media-libs/desurium-cef-9999/work/desurium-cef-9999_build/cef-prefix/src/cef && /usr/bin/cmake -E touch /var/tmp/portage/media-libs/desurium-cef-9999/work/desurium-cef-9999_build/cef-prefix/src/cef-stamp/cef-update
/usr/bin/cmake -E cmake_progress_report /var/tmp/portage/media-libs/desurium-cef-9999/work/desurium-cef-9999_build/CMakeFiles 6
[ 89%] No patch step for 'cef'
/usr/bin/cmake -E touch /var/tmp/portage/media-libs/desurium-cef-9999/work/desurium-cef-9999_build/cef-prefix/src/cef-stamp/cef-patch
Patching build configuration and source files for CEF...
________ running '/var/tmp/portage/media-libs/desurium-cef-9999/work/desurium-cef-9999_build/external/depot_tools/src/depot_tools/python tools/patcher.py --patch-config patch/patch.cfg' in '/var/tmp/portage/media-libs/desurium-cef-9999/work/desurium-cef-9999_build/chromium-prefix/src/chromium/src/cef'
Reading patch file /var/tmp/portage/media-libs/desurium-cef-9999/work/desurium-cef-9999_build/chromium-prefix/src/chromium/src/cef/patch/patches/desura.patch
WARNING:root:successfully patched ../net/proxy/proxy_service.cc
WARNING:root:successfully patched ../net/ocsp/nss_ocsp.cc
Reading patch file /var/tmp/portage/media-libs/desurium-cef-9999/work/desurium-cef-9999_build/chromium-prefix/src/chromium/src/cef/patch/patches/base.patch
WARNING:root:successfully patched ../base/message_loop.cc
WARNING:root:successfully patched ../base/message_loop.h
Reading patch file /var/tmp/portage/media-libs/desurium-cef-9999/work/desurium-cef-9999_build/chromium-prefix/src/chromium/src/cef/patch/patches/build.patch
WARNING:root:successfully patched ../build/common.gypi
Reading patch file /var/tmp/portage/media-libs/desurium-cef-9999/work/desurium-cef-9999_build/chromium-prefix/src/chromium/src/cef/patch/patches/webkit.patch
WARNING:root:successfully patched ../third_party/WebKit/Source/WebCore/bindings/v8/custom/V8DOMWindowCustom.cpp
WARNING:root:successfully patched ../third_party/WebKit/Source/WebCore/html/HTMLAnchorElement.cpp
WARNING:root:successfully patched ../third_party/WebKit/Source/WebCore/html/HTMLViewSourceDocument.cpp
WARNING:root:successfully patched ../third_party/WebKit/Source/WebCore/page/ContextMenuController.cpp
WARNING:root:successfully patched ../third_party/WebKit/Source/WebCore/svg/SVGAElement.cpp
Reading patch file /var/tmp/portage/media-libs/desurium-cef-9999/work/desurium-cef-9999_build/chromium-prefix/src/chromium/src/cef/patch/patches/root.patch
WARNING:root:successfully patched ../base/message_loop.h
Reading patch file /var/tmp/portage/media-libs/desurium-cef-9999/work/desurium-cef-9999_build/chromium-prefix/src/chromium/src/cef/patch/patches/resources.patch
WARNING:root:successfully patched ../tools/grit/resource_ids
Writing file /var/tmp/portage/media-libs/desurium-cef-9999/work/desurium-cef-9999_build/chromium-prefix/src/chromium/src/cef/patch/patch_state.h.
Generating CEF project files...
________ running '/var/tmp/portage/media-libs/desurium-cef-9999/work/desurium-cef-9999_build/external/depot_tools/src/depot_tools/python tools/gyp_cef cef.gyp -I cef.gypi -Dwerror= -Duse_cups=0 -Duse_gconf=0 -Duse_gnome_keyring=0 -Duse_kerberos=0 -Duse_system_bzip2=1 -Duse_system_flac=1 -Duse_system_icu=0 -Duse_system_libevent=1 -Duse_system_libjpeg=1 -Duse_system_libpng=1 -Duse_system_libwebp=0 -Duse_system_libxml=1 -Duse_system_speex=1 -Duse_system_v8=0 -Duse_system_xdg_utils=1 -Duse_system_yasm=1 -Duse_system_zlib=1' in '/var/tmp/portage/media-libs/desurium-cef-9999/work/desurium-cef-9999_build/chromium-prefix/src/chromium/src/cef'
Updating projects from gyp files...
Traceback (most recent call last):
File "tools/gyp_cef", line 155, in <module>
sys.exit(gyp.main(args))
File "/var/tmp/portage/media-libs/desurium-cef-9999/work/desurium-cef-9999_build/chromium-prefix/src/chromium/src/tools/gyp/pylib/gyp/__init__.py", line 463, in main
options.circular_check)
File "/var/tmp/portage/media-libs/desurium-cef-9999/work/desurium-cef-9999_build/chromium-prefix/src/chromium/src/tools/gyp/pylib/gyp/__init__.py", line 101, in Load
depth, generator_input_info, check, circular_check)
File "/var/tmp/portage/media-libs/desurium-cef-9999/work/desurium-cef-9999_build/chromium-prefix/src/chromium/src/tools/gyp/pylib/gyp/input.py", line 2269, in Load
depth, check)
File "/var/tmp/portage/media-libs/desurium-cef-9999/work/desurium-cef-9999_build/chromium-prefix/src/chromium/src/tools/gyp/pylib/gyp/input.py", line 435, in LoadTargetBuildFile
includes, depth, check)
File "/var/tmp/portage/media-libs/desurium-cef-9999/work/desurium-cef-9999_build/chromium-prefix/src/chromium/src/tools/gyp/pylib/gyp/input.py", line 435, in LoadTargetBuildFile
includes, depth, check)
File "/var/tmp/portage/media-libs/desurium-cef-9999/work/desurium-cef-9999_build/chromium-prefix/src/chromium/src/tools/gyp/pylib/gyp/input.py", line 435, in LoadTargetBuildFile
includes, depth, check)
File "/var/tmp/portage/media-libs/desurium-cef-9999/work/desurium-cef-9999_build/chromium-prefix/src/chromium/src/tools/gyp/pylib/gyp/input.py", line 363, in LoadTargetBuildFile
includes, True, check)
File "/var/tmp/portage/media-libs/desurium-cef-9999/work/desurium-cef-9999_build/chromium-prefix/src/chromium/src/tools/gyp/pylib/gyp/input.py", line 233, in LoadOneBuildFile
aux_data, variables, includes, check)
File "/var/tmp/portage/media-libs/desurium-cef-9999/work/desurium-cef-9999_build/chromium-prefix/src/chromium/src/tools/gyp/pylib/gyp/input.py", line 271, in LoadBuildFileIncludesIntoDict
False, check),
File "/var/tmp/portage/media-libs/desurium-cef-9999/work/desurium-cef-9999_build/chromium-prefix/src/chromium/src/tools/gyp/pylib/gyp/input.py", line 218, in LoadOneBuildFile
None)
File "<string>", line 227, in <module>
NameError: name 'os' is not defined while reading ../v8/build/common.gypi while reading includes of ../v8/tools/gyp/v8.gyp while loading dependencies of ../third_party/WebKit/Source/WebCore/WebCore.gyp/WebCore.gyp while loading dependencies of ../third_party/WebKit/Source/WebKit/chromium/WebKit.gyp while loading dependencies of cef.gyp while trying to load cef.gyp
Traceback (most recent call last):
File "tools/gclient_hook.py", line 79, in <module>
RunAction(cef_dir, gyper);
File "tools/gclient_hook.py", line 42, in RunAction
command, cwd=dir, always=True)
File "/var/tmp/portage/media-libs/desurium-cef-9999/work/desurium-cef-9999_build/external/depot_tools/src/depot_tools/gclient_utils.py", line 213, in CheckCallAndFilterAndHeader
return CheckCallAndFilter(args, **kwargs)
File "/var/tmp/portage/media-libs/desurium-cef-9999/work/desurium-cef-9999_build/external/depot_tools/src/depot_tools/gclient_utils.py", line 390, in CheckCallAndFilter
rv, args, kwargs.get('cwd', None), None, None)
subprocess2.CalledProcessError: Command /var/tmp/portage/media-libs/desurium-cef-9999/work/desurium-cef-9999_build/external/depot_tools/src/depot_tools/python tools/gyp_cef cef.gyp -I cef.gypi -Dwerror= -Duse_cups=0 -Duse_gconf=0 -Duse_gnome_keyring=0 -Duse_kerberos=0 -Duse_system_bzip2=1 -Duse_system_flac=1 -Duse_system_icu=0 -Duse_system_libevent=1 -Duse_system_libjpeg=1 -Duse_system_libpng=1 -Duse_system_libwebp=0 -Duse_system_libxml=1 -Duse_system_speex=1 -Duse_system_v8=0 -Duse_system_xdg_utils=1 -Duse_system_yasm=1 -Duse_system_zlib=1 returned non-zero exit status 1 in /var/tmp/portage/media-libs/desurium-cef-9999/work/desurium-cef-9999_build/chromium-prefix/src/chromium/src/cef
make[2]: *** [cef-prefix/src/cef-stamp/cef-config_cef] Error 1
make[2]: Leaving directory `/var/tmp/portage/media-libs/desurium-cef-9999/work/desurium-cef-9999_build'
make[1]: *** [CMakeFiles/cef.dir/all] Error 2
make[1]: Leaving directory `/var/tmp/portage/media-libs/desurium-cef-9999/work/desurium-cef-9999_build'
make: *** [all] Error 2
* ERROR: media-libs/desurium-cef-9999 failed (compile phase):
* emake failed
*
* If you need support, post the output of `emerge --info '=media-libs/desurium-cef-9999'`,
* the complete build log and the output of `emerge -pqv '=media-libs/desurium-cef-9999'`.
* This ebuild is from an overlay named 'hasufell-overlay': '/usr/local/portage/'
* The complete build log is located at '/home/portage-log/build/media-libs/desurium-cef-9999:20130102-130445.log'.
* For convenience, a symlink to the build log is located at '/var/tmp/portage/media-libs/desurium-cef-9999/temp/build.log'.
* The ebuild environment file is located at '/var/tmp/portage/media-libs/desurium-cef-9999/temp/environment'.
* Working directory: '/var/tmp/portage/media-libs/desurium-cef-9999/work/desurium-cef-9999_build'
* S: '/var/tmp/portage/media-libs/desurium-cef-9999/work/desurium-cef-9999'
>>> Failed to emerge media-libs/desurium-cef-9999
* Messages for package media-libs/desurium-cef-9999:
* ERROR: media-libs/desurium-cef-9999 failed (compile phase):
* emake failed
*
* If you need support, post the output of `emerge --info '=media-libs/desurium-cef-9999'`,
* the complete build log and the output of `emerge -pqv '=media-libs/desurium-cef-9999'`.
* This ebuild is from an overlay named 'hasufell-overlay': '/usr/local/portage/'
* The complete build log is located at '/home/portage-log/build/media-libs/desurium-cef-9999:20130102-130445.log'.
* For convenience, a symlink to the build log is located at '/var/tmp/portage/media-libs/desurium-cef-9999/temp/build.log'.
* The ebuild environment file is located at '/var/tmp/portage/media-libs/desurium-cef-9999/temp/environment'.
* Working directory: '/var/tmp/portage/media-libs/desurium-cef-9999/work/desurium-cef-9999_build'
* S: '/var/tmp/portage/media-libs/desurium-cef-9999/work/desurium-cef-9999'
Sign up for free to join this conversation on GitHub. Already have an account? Sign in to comment