Skip to content

Instantly share code, notes, and snippets.

Embed
What would you like to do?
c:\Users\herpiko\src\erpiko\build>cmake -G "Visual Studio 14 2015 Win64" ..
-- The C compiler identification is MSVC 19.0.24215.1
-- The CXX compiler identification is MSVC 19.0.24215.1
-- Check for working C compiler: C:/Program Files (x86)/Microsoft Visual Studio 14.0/VC/bin/x86_amd64/cl.exe
-- Check for working C compiler: C:/Program Files (x86)/Microsoft Visual Studio 14.0/VC/bin/x86_amd64/cl.exe -- works
-- Detecting C compiler ABI info
-- Detecting C compiler ABI info - done
-- Check for working CXX compiler: C:/Program Files (x86)/Microsoft Visual Studio 14.0/VC/bin/x86_amd64/cl.exe
-- Check for working CXX compiler: C:/Program Files (x86)/Microsoft Visual Studio 14.0/VC/bin/x86_amd64/cl.exe -- works
-- Detecting CXX compiler ABI info
-- Detecting CXX compiler ABI info - done
-- Detecting CXX compile features
-- Detecting CXX compile features - done
-- Configuring done
-- Generating done
-- Build files have been written to: C:/Users/herpiko/src/erpiko/build
c:\Users\herpiko\src\erpiko\build>msbuild erpiko.sln
Microsoft (R) Build Engine version 14.0.25420.1
Copyright (C) Microsoft Corporation. All rights reserved.
Building the projects in this solution one at a time. To enable parallel build, please add the "/m" switch.
Build started 5/30/2017 11:43:57 AM.
Project "c:\Users\herpiko\src\erpiko\build\erpiko.sln" on node 1 (default targets).
ValidateSolutionConfiguration:
Building solution configuration "Debug|X64".
ValidateProjects:
The project "ALL_BUILD" is not selected for building in solution configuration "Debug|x64".
The project "RUN_TESTS" is not selected for building in solution configuration "Debug|x64".
The target "CopyLocalFilesOutputGroup" listed in a BeforeTargets attribute at "C:\Users\herpiko\src\vcpkg\scripts\build
systems\msbuild\vcpkg.targets (59,82)" does not exist in the project, and will be ignored.
Project "c:\Users\herpiko\src\erpiko\build\erpiko.sln" (1) is building "c:\Users\herpiko\src\erpiko\build\ZERO_CHECK.vc
xproj" (2) on node 1 (default targets).
PrepareForBuild:
Creating directory "x64\Debug\ZERO_CHECK\".
Creating directory "x64\Debug\ZERO_CHECK\ZERO_CHECK.tlog\".
InitializeBuildStatus:
Creating "x64\Debug\ZERO_CHECK\ZERO_CHECK.tlog\unsuccessfulbuild" because "AlwaysCreate" was specified.
CustomBuild:
Checking Build System
CMake does not need to re-run because C:/Users/herpiko/src/erpiko/build/CMakeFiles/generate.stamp is up-to-date.
CMake does not need to re-run because C:/Users/herpiko/src/erpiko/build/src/CMakeFiles/generate.stamp is up-to-date.
CMake does not need to re-run because C:/Users/herpiko/src/erpiko/build/tests/CMakeFiles/generate.stamp is up-to-date
.
FinalizeBuildStatus:
Deleting file "x64\Debug\ZERO_CHECK\ZERO_CHECK.tlog\unsuccessfulbuild".
Touching "x64\Debug\ZERO_CHECK\ZERO_CHECK.tlog\ZERO_CHECK.lastbuildstate".
Done Building Project "c:\Users\herpiko\src\erpiko\build\ZERO_CHECK.vcxproj" (default targets).
The target "CopyLocalFilesOutputGroup" listed in a BeforeTargets attribute at "C:\Users\herpiko\src\vcpkg\scripts\build
systems\msbuild\vcpkg.targets (59,82)" does not exist in the project, and will be ignored.
Project "c:\Users\herpiko\src\erpiko\build\erpiko.sln" (1) is building "c:\Users\herpiko\src\erpiko\build\src\erpiko.vc
xproj.metaproj" (3) on node 1 (default targets).
Project "c:\Users\herpiko\src\erpiko\build\src\erpiko.vcxproj.metaproj" (3) is building "c:\Users\herpiko\src\erpiko\bu
ild\src\erpiko.vcxproj" (4) on node 1 (default targets).
PrepareForBuild:
Creating directory "erpiko.dir\Debug\".
Creating directory "C:\Users\herpiko\src\erpiko\build\src\Debug\".
Creating directory "erpiko.dir\Debug\erpiko.tlog\".
InitializeBuildStatus:
Creating "erpiko.dir\Debug\erpiko.tlog\unsuccessfulbuild" because "AlwaysCreate" was specified.
CustomBuild:
Building Custom Rule C:/Users/herpiko/src/erpiko/src/CMakeLists.txt
CMake does not need to re-run because C:/Users/herpiko/src/erpiko/build/src/CMakeFiles/generate.stamp is up-to-date.
VcpkgTripletSelection:
Using triplet "x64-windows" from "C:\Users\herpiko\src\vcpkg\installed\x64-windows\"
ClCompile:
C:\Program Files (x86)\Microsoft Visual Studio 14.0\VC\bin\amd64\CL.exe /c /IC:\Users\herpiko\src\erpiko\include /IC:
\Users\herpiko\src\erpiko\deps\libressl\include /I"C:\Users\herpiko\src\erpiko\deps\libressl-portable-tip\include" /I
"C:\Users\herpiko\src\vcpkg\installed\x64-windows\include" /Zi /nologo /W3 /WX- /Od /Ob0 /D WIN32 /D _WINDOWS /D "CMA
KE_INTDIR=\"Debug\"" /D _MBCS /Gm- /EHsc /RTC1 /MDd /GS /fp:precise /Zc:wchar_t /Zc:forScope /Zc:inline /GR /Fo"erpik
o.dir\Debug\\" /Fd"erpiko.dir\Debug\erpiko.pdb" /Gd /TP /errorReport:queue C:\Users\herpiko\src\erpiko\src\rsakey.cpp
"C:\Users\herpiko\src\erpiko\src\rsakey-public.cpp" C:\Users\herpiko\src\erpiko\src\bigint.cpp C:\Users\herpiko\src\
erpiko\src\certificate.cpp C:\Users\herpiko\src\erpiko\src\identity.cpp C:\Users\herpiko\src\erpiko\src\oid.cpp C:\Us
ers\herpiko\src\erpiko\src\time.cpp "C:\Users\herpiko\src\erpiko\src\data-source.cpp" C:\Users\herpiko\src\erpiko\src
\pkcs12.cpp C:\Users\herpiko\src\erpiko\src\cmp.cpp "C:\Users\herpiko\src\erpiko\src\signed-data.cpp" C:\Users\herpik
o\src\erpiko\src\sim.cpp "C:\Users\herpiko\src\erpiko\src\enveloped-data.cpp"
rsakey.cpp
Warning, overriding WinCrypt defines
c:\users\herpiko\src\erpiko\src\converters.h(73): warning C4267: 'argument': conversion from 'size_t' to 'int', possibl
e loss of data [c:\Users\herpiko\src\erpiko\build\src\erpiko.vcxproj]
c:\users\herpiko\src\erpiko\src\converters.h(135): warning C4267: 'argument': conversion from 'size_t' to 'int', possib
le loss of data [c:\Users\herpiko\src\erpiko\build\src\erpiko.vcxproj]
c:\users\herpiko\src\erpiko\src\converters.h(149): warning C4267: 'argument': conversion from 'size_t' to 'long', possi
ble loss of data [c:\Users\herpiko\src\erpiko\build\src\erpiko.vcxproj]
c:\users\herpiko\src\erpiko\src\converters.h(156): warning C4267: 'argument': conversion from 'size_t' to 'long', possi
ble loss of data [c:\Users\herpiko\src\erpiko\build\src\erpiko.vcxproj]
c:\users\herpiko\src\erpiko\src\converters.h(163): warning C4267: 'argument': conversion from 'size_t' to 'int', possib
le loss of data [c:\Users\herpiko\src\erpiko\build\src\erpiko.vcxproj]
C:\Users\herpiko\src\erpiko\src\rsakey.cpp(63): warning C4267: 'argument': conversion from 'size_t' to 'int', possible
loss of data [c:\Users\herpiko\src\erpiko\build\src\erpiko.vcxproj]
C:\Users\herpiko\src\erpiko\src\rsakey.cpp(78): warning C4267: 'argument': conversion from 'size_t' to 'int', possible
loss of data [c:\Users\herpiko\src\erpiko\build\src\erpiko.vcxproj]
C:\Users\herpiko\src\erpiko\src\rsakey.cpp(155): warning C4267: 'argument': conversion from 'size_t' to 'int', possible
loss of data [c:\Users\herpiko\src\erpiko\build\src\erpiko.vcxproj]
rsakey-public.cpp
Warning, overriding WinCrypt defines
C:\Users\herpiko\src\erpiko\src\rsakey-public.cpp(27): warning C4267: 'argument': conversion from 'size_t' to 'int', po
ssible loss of data [c:\Users\herpiko\src\erpiko\build\src\erpiko.vcxproj]
C:\Users\herpiko\src\erpiko\src\rsakey-public.cpp(37): warning C4267: 'argument': conversion from 'size_t' to 'int', po
ssible loss of data [c:\Users\herpiko\src\erpiko\build\src\erpiko.vcxproj]
bigint.cpp
certificate.cpp
Warning, overriding WinCrypt defines
c:\users\herpiko\src\erpiko\src\converters.h(73): warning C4267: 'argument': conversion from 'size_t' to 'int', possibl
e loss of data [c:\Users\herpiko\src\erpiko\build\src\erpiko.vcxproj]
c:\users\herpiko\src\erpiko\src\converters.h(135): warning C4267: 'argument': conversion from 'size_t' to 'int', possib
le loss of data [c:\Users\herpiko\src\erpiko\build\src\erpiko.vcxproj]
c:\users\herpiko\src\erpiko\src\converters.h(149): warning C4267: 'argument': conversion from 'size_t' to 'long', possi
ble loss of data [c:\Users\herpiko\src\erpiko\build\src\erpiko.vcxproj]
c:\users\herpiko\src\erpiko\src\converters.h(156): warning C4267: 'argument': conversion from 'size_t' to 'long', possi
ble loss of data [c:\Users\herpiko\src\erpiko\build\src\erpiko.vcxproj]
c:\users\herpiko\src\erpiko\src\converters.h(163): warning C4267: 'argument': conversion from 'size_t' to 'int', possib
le loss of data [c:\Users\herpiko\src\erpiko\build\src\erpiko.vcxproj]
C:\Users\herpiko\src\erpiko\src\certificate.cpp(40): warning C4267: 'argument': conversion from 'size_t' to 'int', poss
ible loss of data [c:\Users\herpiko\src\erpiko\build\src\erpiko.vcxproj]
C:\Users\herpiko\src\erpiko\src\certificate.cpp(51): warning C4267: 'argument': conversion from 'size_t' to 'int', poss
ible loss of data [c:\Users\herpiko\src\erpiko\build\src\erpiko.vcxproj]
C:\Users\herpiko\src\erpiko\src\certificate.cpp(63): warning C4267: 'argument': conversion from 'size_t' to 'int', poss
ible loss of data [c:\Users\herpiko\src\erpiko\build\src\erpiko.vcxproj]
C:\Users\herpiko\src\erpiko\src\certificate.cpp(348): warning C4267: 'argument': conversion from 'size_t' to 'long', po
ssible loss of data [c:\Users\herpiko\src\erpiko\build\src\erpiko.vcxproj]
C:\Users\herpiko\src\erpiko\src\certificate.cpp(387): warning C4267: 'argument': conversion from 'size_t' to 'long', po
ssible loss of data [c:\Users\herpiko\src\erpiko\build\src\erpiko.vcxproj]
C:\Users\herpiko\src\erpiko\src\certificate.cpp(388): warning C4800: 'int': forcing value to bool 'true' or 'false' (pe
rformance warning) [c:\Users\herpiko\src\erpiko\build\src\erpiko.vcxproj]
identity.cpp
Warning, overriding WinCrypt defines
c:\users\herpiko\src\erpiko\src\converters.h(73): warning C4267: 'argument': conversion from 'size_t' to 'int', possibl
e loss of data [c:\Users\herpiko\src\erpiko\build\src\erpiko.vcxproj]
c:\users\herpiko\src\erpiko\src\converters.h(135): warning C4267: 'argument': conversion from 'size_t' to 'int', possib
le loss of data [c:\Users\herpiko\src\erpiko\build\src\erpiko.vcxproj]
c:\users\herpiko\src\erpiko\src\converters.h(149): warning C4267: 'argument': conversion from 'size_t' to 'long', possi
ble loss of data [c:\Users\herpiko\src\erpiko\build\src\erpiko.vcxproj]
c:\users\herpiko\src\erpiko\src\converters.h(156): warning C4267: 'argument': conversion from 'size_t' to 'long', possi
ble loss of data [c:\Users\herpiko\src\erpiko\build\src\erpiko.vcxproj]
c:\users\herpiko\src\erpiko\src\converters.h(163): warning C4267: 'argument': conversion from 'size_t' to 'int', possib
le loss of data [c:\Users\herpiko\src\erpiko\build\src\erpiko.vcxproj]
C:\Users\herpiko\src\erpiko\src\identity.cpp(93): warning C4267: 'argument': conversion from 'size_t' to 'long', possib
le loss of data [c:\Users\herpiko\src\erpiko\build\src\erpiko.vcxproj]
oid.cpp
time.cpp
C:\Users\herpiko\src\erpiko\src\time.cpp(23): warning C4996: 'localtime': This function or variable may be unsafe. Cons
ider using localtime_s instead. To disable deprecation, use _CRT_SECURE_NO_WARNINGS. See online help for details. [c:\U
sers\herpiko\src\erpiko\build\src\erpiko.vcxproj]
C:\Program Files (x86)\Windows Kits\10\Include\10.0.10240.0\ucrt\time.h(505): note: see declaration of 'localtime'
data-source.cpp
pkcs12.cpp
Warning, overriding WinCrypt defines
c:\users\herpiko\src\erpiko\src\converters.h(73): warning C4267: 'argument': conversion from 'size_t' to 'int', possibl
e loss of data [c:\Users\herpiko\src\erpiko\build\src\erpiko.vcxproj]
c:\users\herpiko\src\erpiko\src\converters.h(135): warning C4267: 'argument': conversion from 'size_t' to 'int', possib
le loss of data [c:\Users\herpiko\src\erpiko\build\src\erpiko.vcxproj]
c:\users\herpiko\src\erpiko\src\converters.h(149): warning C4267: 'argument': conversion from 'size_t' to 'long', possi
ble loss of data [c:\Users\herpiko\src\erpiko\build\src\erpiko.vcxproj]
c:\users\herpiko\src\erpiko\src\converters.h(156): warning C4267: 'argument': conversion from 'size_t' to 'long', possi
ble loss of data [c:\Users\herpiko\src\erpiko\build\src\erpiko.vcxproj]
c:\users\herpiko\src\erpiko\src\converters.h(163): warning C4267: 'argument': conversion from 'size_t' to 'int', possib
le loss of data [c:\Users\herpiko\src\erpiko\build\src\erpiko.vcxproj]
C:\Users\herpiko\src\erpiko\src\pkcs12.cpp(45): warning C4267: 'argument': conversion from 'size_t' to 'int', possible
loss of data [c:\Users\herpiko\src\erpiko\build\src\erpiko.vcxproj]
C:\Users\herpiko\src\erpiko\src\pkcs12.cpp(98): warning C4267: 'argument': conversion from 'size_t' to 'int', possible
loss of data [c:\Users\herpiko\src\erpiko\build\src\erpiko.vcxproj]
C:\Users\herpiko\src\erpiko\src\pkcs12.cpp(121): warning C4267: 'argument': conversion from 'size_t' to 'int', possible
loss of data [c:\Users\herpiko\src\erpiko\build\src\erpiko.vcxproj]
C:\Users\herpiko\src\erpiko\src\pkcs12.cpp(200): warning C4267: 'argument': conversion from 'size_t' to 'int', possible
loss of data [c:\Users\herpiko\src\erpiko\build\src\erpiko.vcxproj]
cmp.cpp
Warning, overriding WinCrypt defines
c:\users\herpiko\src\erpiko\src\converters.h(73): warning C4267: 'argument': conversion from 'size_t' to 'int', possibl
e loss of data [c:\Users\herpiko\src\erpiko\build\src\erpiko.vcxproj]
c:\users\herpiko\src\erpiko\src\converters.h(135): warning C4267: 'argument': conversion from 'size_t' to 'int', possib
le loss of data [c:\Users\herpiko\src\erpiko\build\src\erpiko.vcxproj]
c:\users\herpiko\src\erpiko\src\converters.h(149): warning C4267: 'argument': conversion from 'size_t' to 'long', possi
ble loss of data [c:\Users\herpiko\src\erpiko\build\src\erpiko.vcxproj]
c:\users\herpiko\src\erpiko\src\converters.h(156): warning C4267: 'argument': conversion from 'size_t' to 'long', possi
ble loss of data [c:\Users\herpiko\src\erpiko\build\src\erpiko.vcxproj]
c:\users\herpiko\src\erpiko\src\converters.h(163): warning C4267: 'argument': conversion from 'size_t' to 'int', possib
le loss of data [c:\Users\herpiko\src\erpiko\build\src\erpiko.vcxproj]
signed-data.cpp
Warning, overriding WinCrypt defines
c:\users\herpiko\src\erpiko\src\converters.h(73): warning C4267: 'argument': conversion from 'size_t' to 'int', possibl
e loss of data [c:\Users\herpiko\src\erpiko\build\src\erpiko.vcxproj]
c:\users\herpiko\src\erpiko\src\converters.h(135): warning C4267: 'argument': conversion from 'size_t' to 'int', possib
le loss of data [c:\Users\herpiko\src\erpiko\build\src\erpiko.vcxproj]
c:\users\herpiko\src\erpiko\src\converters.h(149): warning C4267: 'argument': conversion from 'size_t' to 'long', possi
ble loss of data [c:\Users\herpiko\src\erpiko\build\src\erpiko.vcxproj]
c:\users\herpiko\src\erpiko\src\converters.h(156): warning C4267: 'argument': conversion from 'size_t' to 'long', possi
ble loss of data [c:\Users\herpiko\src\erpiko\build\src\erpiko.vcxproj]
c:\users\herpiko\src\erpiko\src\converters.h(163): warning C4267: 'argument': conversion from 'size_t' to 'int', possib
le loss of data [c:\Users\herpiko\src\erpiko\build\src\erpiko.vcxproj]
C:\Users\herpiko\src\erpiko\src\signed-data.cpp(57): warning C4267: 'argument': conversion from 'size_t' to 'int', poss
ible loss of data [c:\Users\herpiko\src\erpiko\build\src\erpiko.vcxproj]
C:\Users\herpiko\src\erpiko\src\signed-data.cpp(70): warning C4267: 'argument': conversion from 'size_t' to 'int', poss
ible loss of data [c:\Users\herpiko\src\erpiko\build\src\erpiko.vcxproj]
C:\Users\herpiko\src\erpiko\src\signed-data.cpp(85): warning C4267: 'argument': conversion from 'size_t' to 'int', poss
ible loss of data [c:\Users\herpiko\src\erpiko\build\src\erpiko.vcxproj]
C:\Users\herpiko\src\erpiko\src\signed-data.cpp(166): warning C4267: 'argument': conversion from 'size_t' to 'int', pos
sible loss of data [c:\Users\herpiko\src\erpiko\build\src\erpiko.vcxproj]
sim.cpp
Warning, overriding WinCrypt defines
C:\Users\herpiko\src\erpiko\src\sim.cpp(48): warning C4267: 'argument': conversion from 'size_t' to 'int', possible los
s of data [c:\Users\herpiko\src\erpiko\build\src\erpiko.vcxproj]
C:\Users\herpiko\src\erpiko\src\sim.cpp(49): warning C4267: 'argument': conversion from 'size_t' to 'int', possible los
s of data [c:\Users\herpiko\src\erpiko\build\src\erpiko.vcxproj]
C:\Users\herpiko\src\erpiko\src\sim.cpp(50): warning C4267: 'argument': conversion from 'size_t' to 'int', possible los
s of data [c:\Users\herpiko\src\erpiko\build\src\erpiko.vcxproj]
C:\Users\herpiko\src\erpiko\src\sim.cpp(109): warning C4267: 'argument': conversion from 'size_t' to 'int', possible lo
ss of data [c:\Users\herpiko\src\erpiko\build\src\erpiko.vcxproj]
C:\Users\herpiko\src\erpiko\src\sim.cpp(110): warning C4267: 'argument': conversion from 'size_t' to 'int', possible lo
ss of data [c:\Users\herpiko\src\erpiko\build\src\erpiko.vcxproj]
C:\Users\herpiko\src\erpiko\src\sim.cpp(137): warning C4267: 'argument': conversion from 'size_t' to 'int', possible lo
ss of data [c:\Users\herpiko\src\erpiko\build\src\erpiko.vcxproj]
enveloped-data.cpp
Warning, overriding WinCrypt defines
c:\users\herpiko\src\erpiko\src\converters.h(73): warning C4267: 'argument': conversion from 'size_t' to 'int', possibl
e loss of data [c:\Users\herpiko\src\erpiko\build\src\erpiko.vcxproj]
c:\users\herpiko\src\erpiko\src\converters.h(135): warning C4267: 'argument': conversion from 'size_t' to 'int', possib
le loss of data [c:\Users\herpiko\src\erpiko\build\src\erpiko.vcxproj]
c:\users\herpiko\src\erpiko\src\converters.h(149): warning C4267: 'argument': conversion from 'size_t' to 'long', possi
ble loss of data [c:\Users\herpiko\src\erpiko\build\src\erpiko.vcxproj]
c:\users\herpiko\src\erpiko\src\converters.h(156): warning C4267: 'argument': conversion from 'size_t' to 'long', possi
ble loss of data [c:\Users\herpiko\src\erpiko\build\src\erpiko.vcxproj]
c:\users\herpiko\src\erpiko\src\converters.h(163): warning C4267: 'argument': conversion from 'size_t' to 'int', possib
le loss of data [c:\Users\herpiko\src\erpiko\build\src\erpiko.vcxproj]
C:\Users\herpiko\src\erpiko\src\enveloped-data.cpp(42): warning C4267: 'argument': conversion from 'size_t' to 'int', p
ossible loss of data [c:\Users\herpiko\src\erpiko\build\src\erpiko.vcxproj]
C:\Users\herpiko\src\erpiko\src\enveloped-data.cpp(54): warning C4267: 'argument': conversion from 'size_t' to 'int', p
ossible loss of data [c:\Users\herpiko\src\erpiko\build\src\erpiko.vcxproj]
C:\Users\herpiko\src\erpiko\src\enveloped-data.cpp(68): warning C4267: 'argument': conversion from 'size_t' to 'int', p
ossible loss of data [c:\Users\herpiko\src\erpiko\build\src\erpiko.vcxproj]
C:\Users\herpiko\src\erpiko\src\enveloped-data.cpp(90): warning C4267: 'argument': conversion from 'size_t' to 'int', p
ossible loss of data [c:\Users\herpiko\src\erpiko\build\src\erpiko.vcxproj]
Generating Code...
Lib:
C:\Program Files (x86)\Microsoft Visual Studio 14.0\VC\bin\amd64\Lib.exe /OUT:"C:\Users\herpiko\src\erpiko\build\src\
Debug\erpiko.lib" /NOLOGO /MACHINE:X64 /machine:x64 erpiko.dir\Debug\rsakey.obj
"erpiko.dir\Debug\rsakey-public.obj"
erpiko.dir\Debug\bigint.obj
erpiko.dir\Debug\certificate.obj
erpiko.dir\Debug\identity.obj
erpiko.dir\Debug\oid.obj
erpiko.dir\Debug\time.obj
"erpiko.dir\Debug\data-source.obj"
erpiko.dir\Debug\pkcs12.obj
erpiko.dir\Debug\cmp.obj
"erpiko.dir\Debug\signed-data.obj"
erpiko.dir\Debug\sim.obj
"erpiko.dir\Debug\enveloped-data.obj"
erpiko.vcxproj -> C:\Users\herpiko\src\erpiko\build\src\Debug\erpiko.lib
AppLocalFromInstalled:
powershell.exe -ExecutionPolicy Unrestricted -noprofile -File "C:\Users\herpiko\src\vcpkg\scripts\buildsystems\msbuil
d\applocal.ps1" "C:\Users\herpiko\src\erpiko\build\src\Debug\erpiko.lib" "C:\Users\herpiko\src\vcpkg\installed\x64-wi
ndows\debug\bin" "erpiko.dir\Debug\erpiko.tlog\erpiko.write.1u.tlog"
CopyFilesToOutputDirectory:
Copying file from "erpiko.dir\Debug\erpiko.pdb" to "C:\Users\herpiko\src\erpiko\build\src\Debug\erpiko.pdb".
FinalizeBuildStatus:
Deleting file "erpiko.dir\Debug\erpiko.tlog\unsuccessfulbuild".
Touching "erpiko.dir\Debug\erpiko.tlog\erpiko.lastbuildstate".
Done Building Project "c:\Users\herpiko\src\erpiko\build\src\erpiko.vcxproj" (default targets).
Done Building Project "c:\Users\herpiko\src\erpiko\build\src\erpiko.vcxproj.metaproj" (default targets).
The target "CopyLocalFilesOutputGroup" listed in a BeforeTargets attribute at "C:\Users\herpiko\src\vcpkg\scripts\build
systems\msbuild\vcpkg.targets (59,82)" does not exist in the project, and will be ignored.
Project "c:\Users\herpiko\src\erpiko\build\erpiko.sln" (1) is building "c:\Users\herpiko\src\erpiko\build\tests\testbas
e.vcxproj.metaproj" (5) on node 1 (default targets).
Project "c:\Users\herpiko\src\erpiko\build\tests\testbase.vcxproj.metaproj" (5) is building "c:\Users\herpiko\src\erpik
o\build\tests\testbase.vcxproj" (6) on node 1 (default targets).
PrepareForBuild:
Creating directory "testbase.dir\Debug\".
Creating directory "C:\Users\herpiko\src\erpiko\build\tests\Debug\".
Creating directory "testbase.dir\Debug\testbase.tlog\".
InitializeBuildStatus:
Creating "testbase.dir\Debug\testbase.tlog\unsuccessfulbuild" because "AlwaysCreate" was specified.
CustomBuild:
Building Custom Rule C:/Users/herpiko/src/erpiko/tests/CMakeLists.txt
CMake does not need to re-run because C:/Users/herpiko/src/erpiko/build/tests/CMakeFiles/generate.stamp is up-to-date
.
VcpkgTripletSelection:
Using triplet "x64-windows" from "C:\Users\herpiko\src\vcpkg\installed\x64-windows\"
ClCompile:
C:\Program Files (x86)\Microsoft Visual Studio 14.0\VC\bin\amd64\CL.exe /c /IC:\Users\herpiko\src\erpiko\include /IC:
\Users\herpiko\src\erpiko\deps\libressl\include /I"C:\Users\herpiko\src\erpiko\deps\libressl-portable-tip\include" /I
C:\Users\herpiko\src\erpiko\tests\..\include /IC:\Users\herpiko\src\erpiko\tests\..\deps\catch /IC:\Users\herpiko\src
\erpiko\tests\include /IC:\Users\herpiko\src\erpiko\tests\deps\libressl\include /I"C:\Users\herpiko\src\erpiko\tests\
deps\libressl-portable-tip\include" /I"C:\Users\herpiko\src\vcpkg\installed\x64-windows\include" /Zi /nologo /W3 /WX-
/Od /Ob0 /D WIN32 /D _WINDOWS /D "CMAKE_INTDIR=\"Debug\"" /D _MBCS /Gm- /EHsc /RTC1 /MDd /GS /fp:precise /Zc:wchar_t
/Zc:forScope /Zc:inline /GR /Fo"testbase.dir\Debug\\" /Fd"testbase.dir\Debug\vc140.pdb" /Gd /TP /errorReport:queue C
:\Users\herpiko\src\erpiko\tests\main.cpp C:\Users\herpiko\src\erpiko\tests\bigint.cpp C:\Users\herpiko\src\erpiko\te
sts\identity.cpp C:\Users\herpiko\src\erpiko\tests\oid.cpp C:\Users\herpiko\src\erpiko\tests\time.cpp "C:\Users\herpi
ko\src\erpiko\tests\data-source.cpp"
main.cpp
bigint.cpp
identity.cpp
oid.cpp
time.cpp
data-source.cpp
Generating Code...
Link:
C:\Program Files (x86)\Microsoft Visual Studio 14.0\VC\bin\amd64\link.exe /ERRORREPORT:QUEUE /OUT:"C:\Users\herpiko\s
rc\erpiko\build\tests\Debug\testbase.exe" /INCREMENTAL /NOLOGO /LIBPATH:"C:\Users\herpiko\src\vcpkg\installed\x64-win
dows\debug\lib" /LIBPATH:"C:\Users\herpiko\src\vcpkg\installed\x64-windows\debug\lib\manual-link" kernel32.lib user32
.lib gdi32.lib winspool.lib shell32.lib ole32.lib oleaut32.lib uuid.lib comdlg32.lib advapi32.lib ..\src\Debug\erpiko
.lib "..\..\deps\libressl\crypto\Release\crypto-41.lib" "..\..\deps\libressl\ssl\Release\ssl-43.lib" /MANIFEST /MANIF
ESTUAC:"level='asInvoker' uiAccess='false'" /manifest:embed /DEBUG /PDB:"C:/Users/herpiko/src/erpiko/build/tests/Debu
g/testbase.pdb" /SUBSYSTEM:CONSOLE /TLBID:1 /DYNAMICBASE /NXCOMPAT /IMPLIB:"C:/Users/herpiko/src/erpiko/build/tests/D
ebug/testbase.lib" /MACHINE:X64 /machine:x64 testbase.dir\Debug\main.obj
testbase.dir\Debug\bigint.obj
testbase.dir\Debug\identity.obj
testbase.dir\Debug\oid.obj
testbase.dir\Debug\time.obj
"testbase.dir\Debug\data-source.obj"
testbase.vcxproj -> C:\Users\herpiko\src\erpiko\build\tests\Debug\testbase.exe
AppLocalFromInstalled:
powershell.exe -ExecutionPolicy Unrestricted -noprofile -File "C:\Users\herpiko\src\vcpkg\scripts\buildsystems\msbuil
d\applocal.ps1" "C:\Users\herpiko\src\erpiko\build\tests\Debug\testbase.exe" "C:\Users\herpiko\src\vcpkg\installed\x6
4-windows\debug\bin" "testbase.dir\Debug\testbase.tlog\testbase.write.1u.tlog"
FinalizeBuildStatus:
Deleting file "testbase.dir\Debug\testbase.tlog\unsuccessfulbuild".
Touching "testbase.dir\Debug\testbase.tlog\testbase.lastbuildstate".
Done Building Project "c:\Users\herpiko\src\erpiko\build\tests\testbase.vcxproj" (default targets).
Done Building Project "c:\Users\herpiko\src\erpiko\build\tests\testbase.vcxproj.metaproj" (default targets).
The target "CopyLocalFilesOutputGroup" listed in a BeforeTargets attribute at "C:\Users\herpiko\src\vcpkg\scripts\build
systems\msbuild\vcpkg.targets (59,82)" does not exist in the project, and will be ignored.
Project "c:\Users\herpiko\src\erpiko\build\erpiko.sln" (1) is building "c:\Users\herpiko\src\erpiko\build\tests\testcer
tificate.vcxproj.metaproj" (7) on node 1 (default targets).
Project "c:\Users\herpiko\src\erpiko\build\tests\testcertificate.vcxproj.metaproj" (7) is building "c:\Users\herpiko\sr
c\erpiko\build\tests\testcertificate.vcxproj" (8) on node 1 (default targets).
PrepareForBuild:
Creating directory "testcertificate.dir\Debug\".
Creating directory "testcertificate.dir\Debug\testcertificate.tlog\".
InitializeBuildStatus:
Creating "testcertificate.dir\Debug\testcertificate.tlog\unsuccessfulbuild" because "AlwaysCreate" was specified.
CustomBuild:
Building Custom Rule C:/Users/herpiko/src/erpiko/tests/CMakeLists.txt
CMake does not need to re-run because C:/Users/herpiko/src/erpiko/build/tests/CMakeFiles/generate.stamp is up-to-date
.
VcpkgTripletSelection:
Using triplet "x64-windows" from "C:\Users\herpiko\src\vcpkg\installed\x64-windows\"
ClCompile:
C:\Program Files (x86)\Microsoft Visual Studio 14.0\VC\bin\amd64\CL.exe /c /IC:\Users\herpiko\src\erpiko\include /IC:
\Users\herpiko\src\erpiko\deps\libressl\include /I"C:\Users\herpiko\src\erpiko\deps\libressl-portable-tip\include" /I
C:\Users\herpiko\src\erpiko\tests\..\include /IC:\Users\herpiko\src\erpiko\tests\..\deps\catch /IC:\Users\herpiko\src
\erpiko\tests\include /IC:\Users\herpiko\src\erpiko\tests\deps\libressl\include /I"C:\Users\herpiko\src\erpiko\tests\
deps\libressl-portable-tip\include" /I"C:\Users\herpiko\src\vcpkg\installed\x64-windows\include" /Zi /nologo /W3 /WX-
/Od /Ob0 /D WIN32 /D _WINDOWS /D "CMAKE_INTDIR=\"Debug\"" /D _MBCS /Gm- /EHsc /RTC1 /MDd /GS /fp:precise /Zc:wchar_t
/Zc:forScope /Zc:inline /GR /Fo"testcertificate.dir\Debug\\" /Fd"testcertificate.dir\Debug\vc140.pdb" /Gd /TP /error
Report:queue C:\Users\herpiko\src\erpiko\tests\certificate.cpp
certificate.cpp
Warning, overriding WinCrypt defines
C:\Users\herpiko\src\erpiko\tests\certificate.cpp(70): warning C4267: 'initializing': conversion from 'size_t' to 'int'
, possible loss of data [c:\Users\herpiko\src\erpiko\build\tests\testcertificate.vcxproj]
Link:
C:\Program Files (x86)\Microsoft Visual Studio 14.0\VC\bin\amd64\link.exe /ERRORREPORT:QUEUE /OUT:"C:\Users\herpiko\s
rc\erpiko\build\tests\Debug\testcertificate.exe" /INCREMENTAL /NOLOGO /LIBPATH:"C:\Users\herpiko\src\vcpkg\installed\
x64-windows\debug\lib" /LIBPATH:"C:\Users\herpiko\src\vcpkg\installed\x64-windows\debug\lib\manual-link" kernel32.lib
user32.lib gdi32.lib winspool.lib shell32.lib ole32.lib oleaut32.lib uuid.lib comdlg32.lib advapi32.lib ..\src\Debug
\erpiko.lib "..\..\deps\libressl\crypto\Release\crypto-41.lib" "..\..\deps\libressl\ssl\Release\ssl-43.lib" /MANIFEST
/MANIFESTUAC:"level='asInvoker' uiAccess='false'" /manifest:embed /DEBUG /PDB:"C:/Users/herpiko/src/erpiko/build/tes
ts/Debug/testcertificate.pdb" /SUBSYSTEM:CONSOLE /TLBID:1 /DYNAMICBASE /NXCOMPAT /IMPLIB:"C:/Users/herpiko/src/erpiko
/build/tests/Debug/testcertificate.lib" /MACHINE:X64 /machine:x64 testcertificate.dir\Debug\certificate.obj
testcertificate.vcxproj -> C:\Users\herpiko\src\erpiko\build\tests\Debug\testcertificate.exe
AppLocalFromInstalled:
powershell.exe -ExecutionPolicy Unrestricted -noprofile -File "C:\Users\herpiko\src\vcpkg\scripts\buildsystems\msbuil
d\applocal.ps1" "C:\Users\herpiko\src\erpiko\build\tests\Debug\testcertificate.exe" "C:\Users\herpiko\src\vcpkg\insta
lled\x64-windows\debug\bin" "testcertificate.dir\Debug\testcertificate.tlog\testcertificate.write.1u.tlog"
FinalizeBuildStatus:
Deleting file "testcertificate.dir\Debug\testcertificate.tlog\unsuccessfulbuild".
Touching "testcertificate.dir\Debug\testcertificate.tlog\testcertificate.lastbuildstate".
Done Building Project "c:\Users\herpiko\src\erpiko\build\tests\testcertificate.vcxproj" (default targets).
Done Building Project "c:\Users\herpiko\src\erpiko\build\tests\testcertificate.vcxproj.metaproj" (default targets).
The target "CopyLocalFilesOutputGroup" listed in a BeforeTargets attribute at "C:\Users\herpiko\src\vcpkg\scripts\build
systems\msbuild\vcpkg.targets (59,82)" does not exist in the project, and will be ignored.
Project "c:\Users\herpiko\src\erpiko\build\erpiko.sln" (1) is building "c:\Users\herpiko\src\erpiko\build\tests\testcmp
.vcxproj.metaproj" (9) on node 1 (default targets).
Project "c:\Users\herpiko\src\erpiko\build\tests\testcmp.vcxproj.metaproj" (9) is building "c:\Users\herpiko\src\erpiko
\build\tests\testcmp.vcxproj" (10) on node 1 (default targets).
PrepareForBuild:
Creating directory "testcmp.dir\Debug\".
Creating directory "testcmp.dir\Debug\testcmp.tlog\".
InitializeBuildStatus:
Creating "testcmp.dir\Debug\testcmp.tlog\unsuccessfulbuild" because "AlwaysCreate" was specified.
CustomBuild:
Building Custom Rule C:/Users/herpiko/src/erpiko/tests/CMakeLists.txt
CMake does not need to re-run because C:/Users/herpiko/src/erpiko/build/tests/CMakeFiles/generate.stamp is up-to-date
.
VcpkgTripletSelection:
Using triplet "x64-windows" from "C:\Users\herpiko\src\vcpkg\installed\x64-windows\"
ClCompile:
C:\Program Files (x86)\Microsoft Visual Studio 14.0\VC\bin\amd64\CL.exe /c /IC:\Users\herpiko\src\erpiko\include /IC:
\Users\herpiko\src\erpiko\deps\libressl\include /I"C:\Users\herpiko\src\erpiko\deps\libressl-portable-tip\include" /I
C:\Users\herpiko\src\erpiko\tests\..\include /IC:\Users\herpiko\src\erpiko\tests\..\deps\catch /IC:\Users\herpiko\src
\erpiko\tests\include /IC:\Users\herpiko\src\erpiko\tests\deps\libressl\include /I"C:\Users\herpiko\src\erpiko\tests\
deps\libressl-portable-tip\include" /I"C:\Users\herpiko\src\vcpkg\installed\x64-windows\include" /Zi /nologo /W3 /WX-
/Od /Ob0 /D WIN32 /D _WINDOWS /D "CMAKE_INTDIR=\"Debug\"" /D _MBCS /Gm- /EHsc /RTC1 /MDd /GS /fp:precise /Zc:wchar_t
/Zc:forScope /Zc:inline /GR /Fo"testcmp.dir\Debug\\" /Fd"testcmp.dir\Debug\vc140.pdb" /Gd /TP /errorReport:queue C:\
Users\herpiko\src\erpiko\tests\cmp.cpp
cmp.cpp
Warning, overriding WinCrypt defines
Link:
C:\Program Files (x86)\Microsoft Visual Studio 14.0\VC\bin\amd64\link.exe /ERRORREPORT:QUEUE /OUT:"C:\Users\herpiko\s
rc\erpiko\build\tests\Debug\testcmp.exe" /INCREMENTAL /NOLOGO /LIBPATH:"C:\Users\herpiko\src\vcpkg\installed\x64-wind
ows\debug\lib" /LIBPATH:"C:\Users\herpiko\src\vcpkg\installed\x64-windows\debug\lib\manual-link" kernel32.lib user32.
lib gdi32.lib winspool.lib shell32.lib ole32.lib oleaut32.lib uuid.lib comdlg32.lib advapi32.lib ..\src\Debug\erpiko.
lib "..\..\deps\libressl\crypto\Release\crypto-41.lib" "..\..\deps\libressl\ssl\Release\ssl-43.lib" "..\..\deps\libre
ssl\crypto\Release\crypto-41.lib" /MANIFEST /MANIFESTUAC:"level='asInvoker' uiAccess='false'" /manifest:embed /DEBUG
/PDB:"C:/Users/herpiko/src/erpiko/build/tests/Debug/testcmp.pdb" /SUBSYSTEM:CONSOLE /TLBID:1 /DYNAMICBASE /NXCOMPAT /
IMPLIB:"C:/Users/herpiko/src/erpiko/build/tests/Debug/testcmp.lib" /MACHINE:X64 /machine:x64 testcmp.dir\Debug\cmp.
obj
erpiko.lib(cmp.obj) : error LNK2019: unresolved external symbol CMP_doInitialRequestSeq referenced in function "public:
class Erpiko::Certificate const * __cdecl Erpiko::Cmp::startInitRequest(void)" (?startInitRequest@Cmp@Erpiko@@QEAAPEBV
Certificate@2@XZ) [c:\Users\herpiko\src\erpiko\build\tests\testcmp.vcxproj]
erpiko.lib(cmp.obj) : error LNK2019: unresolved external symbol CMP_CTX_create referenced in function "public: __cdecl
Erpiko::Cmp::Impl::Impl(void)" (??0Impl@Cmp@Erpiko@@QEAA@XZ) [c:\Users\herpiko\src\erpiko\build\tests\testcmp.vcxproj]
erpiko.lib(cmp.obj) : error LNK2019: unresolved external symbol CMP_CTX_delete referenced in function "public: virtual
__cdecl Erpiko::Cmp::Impl::~Impl(void)" (??1Impl@Cmp@Erpiko@@UEAA@XZ) [c:\Users\herpiko\src\erpiko\build\tests\testcmp.
vcxproj]
erpiko.lib(cmp.obj) : error LNK2019: unresolved external symbol CMP_CTX_set1_referenceValue referenced in function "pub
lic: void __cdecl Erpiko::Cmp::referenceName(class std::basic_string<char,struct std::char_traits<char>,class std::allo
cator<char> >)" (?referenceName@Cmp@Erpiko@@QEAAXV?$basic_string@DU?$char_traits@D@std@@V?$allocator@D@2@@std@@@Z) [c:\
Users\herpiko\src\erpiko\build\tests\testcmp.vcxproj]
erpiko.lib(cmp.obj) : error LNK2019: unresolved external symbol CMP_CTX_set1_secretValue referenced in function "public
: void __cdecl Erpiko::Cmp::secret(class std::basic_string<char,struct std::char_traits<char>,class std::allocator<char
> >)" (?secret@Cmp@Erpiko@@QEAAXV?$basic_string@DU?$char_traits@D@std@@V?$allocator@D@2@@std@@@Z) [c:\Users\herpiko\src
\erpiko\build\tests\testcmp.vcxproj]
erpiko.lib(cmp.obj) : error LNK2019: unresolved external symbol CMP_CTX_set1_srvCert referenced in function "public: vo
id __cdecl Erpiko::Cmp::caCertificate(class Erpiko::Certificate const &)" (?caCertificate@Cmp@Erpiko@@QEAAXAEBVCertific
ate@2@@Z) [c:\Users\herpiko\src\erpiko\build\tests\testcmp.vcxproj]
erpiko.lib(cmp.obj) : error LNK2019: unresolved external symbol CMP_CTX_set1_subjectName referenced in function "public
: void __cdecl Erpiko::Cmp::subject(class Erpiko::Identity const &)" (?subject@Cmp@Erpiko@@QEAAXAEBVIdentity@2@@Z) [c:\
Users\herpiko\src\erpiko\build\tests\testcmp.vcxproj]
erpiko.lib(cmp.obj) : error LNK2019: unresolved external symbol CMP_CTX_subjectAltName_push1 referenced in function "pu
blic: void __cdecl Erpiko::Cmp::insertSim(class Erpiko::Sim const &)" (?insertSim@Cmp@Erpiko@@QEAAXAEBVSim@2@@Z) [c:\Us
ers\herpiko\src\erpiko\build\tests\testcmp.vcxproj]
erpiko.lib(cmp.obj) : error LNK2019: unresolved external symbol CMP_CTX_set0_newPkey referenced in function "public: vo
id __cdecl Erpiko::Cmp::privateKey(class Erpiko::RsaKey const &)" (?privateKey@Cmp@Erpiko@@QEAAXAEBVRsaKey@2@@Z) [c:\Us
ers\herpiko\src\erpiko\build\tests\testcmp.vcxproj]
erpiko.lib(cmp.obj) : error LNK2019: unresolved external symbol CMP_CTX_set1_serverName referenced in function "public:
void __cdecl Erpiko::Cmp::serverName(class std::basic_string<char,struct std::char_traits<char>,class std::allocator<c
har> >)" (?serverName@Cmp@Erpiko@@QEAAXV?$basic_string@DU?$char_traits@D@std@@V?$allocator@D@2@@std@@@Z) [c:\Users\herp
iko\src\erpiko\build\tests\testcmp.vcxproj]
erpiko.lib(cmp.obj) : error LNK2019: unresolved external symbol CMP_CTX_set1_serverPort referenced in function "public:
void __cdecl Erpiko::Cmp::serverPort(int)" (?serverPort@Cmp@Erpiko@@QEAAXH@Z) [c:\Users\herpiko\src\erpiko\build\tests
\testcmp.vcxproj]
erpiko.lib(cmp.obj) : error LNK2019: unresolved external symbol CMP_CTX_set_HttpTimeOut referenced in function "public:
class Erpiko::Certificate const * __cdecl Erpiko::Cmp::startInitRequest(void)" (?startInitRequest@Cmp@Erpiko@@QEAAPEBV
Certificate@2@XZ) [c:\Users\herpiko\src\erpiko\build\tests\testcmp.vcxproj]
erpiko.lib(cmp.obj) : error LNK2019: unresolved external symbol CMP_CTX_set1_serverPath referenced in function "public:
void __cdecl Erpiko::Cmp::serverPath(class std::basic_string<char,struct std::char_traits<char>,class std::allocator<c
har> >)" (?serverPath@Cmp@Erpiko@@QEAAXV?$basic_string@DU?$char_traits@D@std@@V?$allocator@D@2@@std@@@Z) [c:\Users\herp
iko\src\erpiko\build\tests\testcmp.vcxproj]
erpiko.lib(cmp.obj) : error LNK2019: unresolved external symbol CMP_CTX_set_option referenced in function "public: void
__cdecl Erpiko::Cmp::useTls(bool)" (?useTls@Cmp@Erpiko@@QEAAX_N@Z) [c:\Users\herpiko\src\erpiko\build\tests\testcmp.vc
xproj]
C:\Users\herpiko\src\erpiko\build\tests\Debug\testcmp.exe : fatal error LNK1120: 14 unresolved externals [c:\Users\herp
iko\src\erpiko\build\tests\testcmp.vcxproj]
Done Building Project "c:\Users\herpiko\src\erpiko\build\tests\testcmp.vcxproj" (default targets) -- FAILED.
Done Building Project "c:\Users\herpiko\src\erpiko\build\tests\testcmp.vcxproj.metaproj" (default targets) -- FAILED.
The target "CopyLocalFilesOutputGroup" listed in a BeforeTargets attribute at "C:\Users\herpiko\src\vcpkg\scripts\build
systems\msbuild\vcpkg.targets (59,82)" does not exist in the project, and will be ignored.
Project "c:\Users\herpiko\src\erpiko\build\erpiko.sln" (1) is building "c:\Users\herpiko\src\erpiko\build\tests\testdat
a.vcxproj.metaproj" (11) on node 1 (default targets).
Project "c:\Users\herpiko\src\erpiko\build\tests\testdata.vcxproj.metaproj" (11) is building "c:\Users\herpiko\src\erpi
ko\build\tests\testdata.vcxproj" (12) on node 1 (default targets).
PrepareForBuild:
Creating directory "testdata.dir\Debug\".
Creating directory "testdata.dir\Debug\testdata.tlog\".
InitializeBuildStatus:
Creating "testdata.dir\Debug\testdata.tlog\unsuccessfulbuild" because "AlwaysCreate" was specified.
CustomBuild:
Building Custom Rule C:/Users/herpiko/src/erpiko/tests/CMakeLists.txt
CMake does not need to re-run because C:/Users/herpiko/src/erpiko/build/tests/CMakeFiles/generate.stamp is up-to-date
.
VcpkgTripletSelection:
Using triplet "x64-windows" from "C:\Users\herpiko\src\vcpkg\installed\x64-windows\"
ClCompile:
C:\Program Files (x86)\Microsoft Visual Studio 14.0\VC\bin\amd64\CL.exe /c /IC:\Users\herpiko\src\erpiko\include /IC:
\Users\herpiko\src\erpiko\deps\libressl\include /I"C:\Users\herpiko\src\erpiko\deps\libressl-portable-tip\include" /I
C:\Users\herpiko\src\erpiko\tests\..\include /IC:\Users\herpiko\src\erpiko\tests\..\deps\catch /IC:\Users\herpiko\src
\erpiko\tests\include /IC:\Users\herpiko\src\erpiko\tests\deps\libressl\include /I"C:\Users\herpiko\src\erpiko\tests\
deps\libressl-portable-tip\include" /I"C:\Users\herpiko\src\vcpkg\installed\x64-windows\include" /Zi /nologo /W3 /WX-
/Od /Ob0 /D WIN32 /D _WINDOWS /D "CMAKE_INTDIR=\"Debug\"" /D _MBCS /Gm- /EHsc /RTC1 /MDd /GS /fp:precise /Zc:wchar_t
/Zc:forScope /Zc:inline /GR /Fo"testdata.dir\Debug\\" /Fd"testdata.dir\Debug\vc140.pdb" /Gd /TP /errorReport:queue C
:\Users\herpiko\src\erpiko\tests\pkcs12.cpp "C:\Users\herpiko\src\erpiko\tests\signed-data.cpp" C:\Users\herpiko\src\
erpiko\tests\sim.cpp "C:\Users\herpiko\src\erpiko\tests\enveloped-data.cpp"
pkcs12.cpp
Warning, overriding WinCrypt defines
signed-data.cpp
Warning, overriding WinCrypt defines
sim.cpp
enveloped-data.cpp
Warning, overriding WinCrypt defines
Generating Code...
Link:
C:\Program Files (x86)\Microsoft Visual Studio 14.0\VC\bin\amd64\link.exe /ERRORREPORT:QUEUE /OUT:"C:\Users\herpiko\s
rc\erpiko\build\tests\Debug\testdata.exe" /INCREMENTAL /NOLOGO /LIBPATH:"C:\Users\herpiko\src\vcpkg\installed\x64-win
dows\debug\lib" /LIBPATH:"C:\Users\herpiko\src\vcpkg\installed\x64-windows\debug\lib\manual-link" kernel32.lib user32
.lib gdi32.lib winspool.lib shell32.lib ole32.lib oleaut32.lib uuid.lib comdlg32.lib advapi32.lib ..\src\Debug\erpiko
.lib "..\..\deps\libressl\crypto\Release\crypto-41.lib" "..\..\deps\libressl\ssl\Release\ssl-43.lib" /MANIFEST /MANIF
ESTUAC:"level='asInvoker' uiAccess='false'" /manifest:embed /DEBUG /PDB:"C:/Users/herpiko/src/erpiko/build/tests/Debu
g/testdata.pdb" /SUBSYSTEM:CONSOLE /TLBID:1 /DYNAMICBASE /NXCOMPAT /IMPLIB:"C:/Users/herpiko/src/erpiko/build/tests/D
ebug/testdata.lib" /MACHINE:X64 /machine:x64 testdata.dir\Debug\pkcs12.obj
"testdata.dir\Debug\signed-data.obj"
testdata.dir\Debug\sim.obj
"testdata.dir\Debug\enveloped-data.obj"
testdata.vcxproj -> C:\Users\herpiko\src\erpiko\build\tests\Debug\testdata.exe
AppLocalFromInstalled:
powershell.exe -ExecutionPolicy Unrestricted -noprofile -File "C:\Users\herpiko\src\vcpkg\scripts\buildsystems\msbuil
d\applocal.ps1" "C:\Users\herpiko\src\erpiko\build\tests\Debug\testdata.exe" "C:\Users\herpiko\src\vcpkg\installed\x6
4-windows\debug\bin" "testdata.dir\Debug\testdata.tlog\testdata.write.1u.tlog"
FinalizeBuildStatus:
Deleting file "testdata.dir\Debug\testdata.tlog\unsuccessfulbuild".
Touching "testdata.dir\Debug\testdata.tlog\testdata.lastbuildstate".
Done Building Project "c:\Users\herpiko\src\erpiko\build\tests\testdata.vcxproj" (default targets).
Done Building Project "c:\Users\herpiko\src\erpiko\build\tests\testdata.vcxproj.metaproj" (default targets).
The target "CopyLocalFilesOutputGroup" listed in a BeforeTargets attribute at "C:\Users\herpiko\src\vcpkg\scripts\build
systems\msbuild\vcpkg.targets (59,82)" does not exist in the project, and will be ignored.
Project "c:\Users\herpiko\src\erpiko\build\erpiko.sln" (1) is building "c:\Users\herpiko\src\erpiko\build\tests\testkey
.vcxproj.metaproj" (13) on node 1 (default targets).
Project "c:\Users\herpiko\src\erpiko\build\tests\testkey.vcxproj.metaproj" (13) is building "c:\Users\herpiko\src\erpik
o\build\tests\testkey.vcxproj" (14) on node 1 (default targets).
PrepareForBuild:
Creating directory "testkey.dir\Debug\".
Creating directory "testkey.dir\Debug\testkey.tlog\".
InitializeBuildStatus:
Creating "testkey.dir\Debug\testkey.tlog\unsuccessfulbuild" because "AlwaysCreate" was specified.
CustomBuild:
Building Custom Rule C:/Users/herpiko/src/erpiko/tests/CMakeLists.txt
CMake does not need to re-run because C:/Users/herpiko/src/erpiko/build/tests/CMakeFiles/generate.stamp is up-to-date
.
VcpkgTripletSelection:
Using triplet "x64-windows" from "C:\Users\herpiko\src\vcpkg\installed\x64-windows\"
ClCompile:
C:\Program Files (x86)\Microsoft Visual Studio 14.0\VC\bin\amd64\CL.exe /c /IC:\Users\herpiko\src\erpiko\include /IC:
\Users\herpiko\src\erpiko\deps\libressl\include /I"C:\Users\herpiko\src\erpiko\deps\libressl-portable-tip\include" /I
C:\Users\herpiko\src\erpiko\tests\..\include /IC:\Users\herpiko\src\erpiko\tests\..\deps\catch /IC:\Users\herpiko\src
\erpiko\tests\include /IC:\Users\herpiko\src\erpiko\tests\deps\libressl\include /I"C:\Users\herpiko\src\erpiko\tests\
deps\libressl-portable-tip\include" /I"C:\Users\herpiko\src\vcpkg\installed\x64-windows\include" /Zi /nologo /W3 /WX-
/Od /Ob0 /D WIN32 /D _WINDOWS /D "CMAKE_INTDIR=\"Debug\"" /D _MBCS /Gm- /EHsc /RTC1 /MDd /GS /fp:precise /Zc:wchar_t
/Zc:forScope /Zc:inline /GR /Fo"testkey.dir\Debug\\" /Fd"testkey.dir\Debug\vc140.pdb" /Gd /TP /errorReport:queue C:\
Users\herpiko\src\erpiko\tests\rsakey.cpp
rsakey.cpp
Link:
C:\Program Files (x86)\Microsoft Visual Studio 14.0\VC\bin\amd64\link.exe /ERRORREPORT:QUEUE /OUT:"C:\Users\herpiko\s
rc\erpiko\build\tests\Debug\testkey.exe" /INCREMENTAL /NOLOGO /LIBPATH:"C:\Users\herpiko\src\vcpkg\installed\x64-wind
ows\debug\lib" /LIBPATH:"C:\Users\herpiko\src\vcpkg\installed\x64-windows\debug\lib\manual-link" kernel32.lib user32.
lib gdi32.lib winspool.lib shell32.lib ole32.lib oleaut32.lib uuid.lib comdlg32.lib advapi32.lib ..\src\Debug\erpiko.
lib "..\..\deps\libressl\crypto\Release\crypto-41.lib" "..\..\deps\libressl\ssl\Release\ssl-43.lib" /MANIFEST /MANIFE
STUAC:"level='asInvoker' uiAccess='false'" /manifest:embed /DEBUG /PDB:"C:/Users/herpiko/src/erpiko/build/tests/Debug
/testkey.pdb" /SUBSYSTEM:CONSOLE /TLBID:1 /DYNAMICBASE /NXCOMPAT /IMPLIB:"C:/Users/herpiko/src/erpiko/build/tests/Deb
ug/testkey.lib" /MACHINE:X64 /machine:x64 testkey.dir\Debug\rsakey.obj
testkey.vcxproj -> C:\Users\herpiko\src\erpiko\build\tests\Debug\testkey.exe
AppLocalFromInstalled:
powershell.exe -ExecutionPolicy Unrestricted -noprofile -File "C:\Users\herpiko\src\vcpkg\scripts\buildsystems\msbuil
d\applocal.ps1" "C:\Users\herpiko\src\erpiko\build\tests\Debug\testkey.exe" "C:\Users\herpiko\src\vcpkg\installed\x64
-windows\debug\bin" "testkey.dir\Debug\testkey.tlog\testkey.write.1u.tlog"
FinalizeBuildStatus:
Deleting file "testkey.dir\Debug\testkey.tlog\unsuccessfulbuild".
Touching "testkey.dir\Debug\testkey.tlog\testkey.lastbuildstate".
Done Building Project "c:\Users\herpiko\src\erpiko\build\tests\testkey.vcxproj" (default targets).
Done Building Project "c:\Users\herpiko\src\erpiko\build\tests\testkey.vcxproj.metaproj" (default targets).
The target "CopyLocalFilesOutputGroup" listed in a BeforeTargets attribute at "C:\Users\herpiko\src\vcpkg\scripts\build
systems\msbuild\vcpkg.targets (59,82)" does not exist in the project, and will be ignored.
Project "c:\Users\herpiko\src\erpiko\build\erpiko.sln" (1) is building "c:\Users\herpiko\src\erpiko\build\tests\testsmi
me.vcxproj.metaproj" (15) on node 1 (default targets).
Project "c:\Users\herpiko\src\erpiko\build\tests\testsmime.vcxproj.metaproj" (15) is building "c:\Users\herpiko\src\erp
iko\build\tests\testsmime.vcxproj" (16) on node 1 (default targets).
PrepareForBuild:
Creating directory "testsmime.dir\Debug\".
Creating directory "testsmime.dir\Debug\testsmime.tlog\".
InitializeBuildStatus:
Creating "testsmime.dir\Debug\testsmime.tlog\unsuccessfulbuild" because "AlwaysCreate" was specified.
CustomBuild:
Building Custom Rule C:/Users/herpiko/src/erpiko/tests/CMakeLists.txt
CMake does not need to re-run because C:/Users/herpiko/src/erpiko/build/tests/CMakeFiles/generate.stamp is up-to-date
.
VcpkgTripletSelection:
Using triplet "x64-windows" from "C:\Users\herpiko\src\vcpkg\installed\x64-windows\"
ClCompile:
C:\Program Files (x86)\Microsoft Visual Studio 14.0\VC\bin\amd64\CL.exe /c /IC:\Users\herpiko\src\erpiko\include /IC:
\Users\herpiko\src\erpiko\deps\libressl\include /I"C:\Users\herpiko\src\erpiko\deps\libressl-portable-tip\include" /I
C:\Users\herpiko\src\erpiko\tests\..\include /IC:\Users\herpiko\src\erpiko\tests\..\deps\catch /IC:\Users\herpiko\src
\erpiko\tests\include /IC:\Users\herpiko\src\erpiko\tests\deps\libressl\include /I"C:\Users\herpiko\src\erpiko\tests\
deps\libressl-portable-tip\include" /I"C:\Users\herpiko\src\vcpkg\installed\x64-windows\include" /Zi /nologo /W3 /WX-
/Od /Ob0 /D WIN32 /D _WINDOWS /D "CMAKE_INTDIR=\"Debug\"" /D _MBCS /Gm- /EHsc /RTC1 /MDd /GS /fp:precise /Zc:wchar_t
/Zc:forScope /Zc:inline /GR /Fo"testsmime.dir\Debug\\" /Fd"testsmime.dir\Debug\vc140.pdb" /Gd /TP /errorReport:queue
C:\Users\herpiko\src\erpiko\tests\smime.cpp
smime.cpp
Warning, overriding WinCrypt defines
Link:
C:\Program Files (x86)\Microsoft Visual Studio 14.0\VC\bin\amd64\link.exe /ERRORREPORT:QUEUE /OUT:"C:\Users\herpiko\s
rc\erpiko\build\tests\Debug\testsmime.exe" /INCREMENTAL /NOLOGO /LIBPATH:"C:\Users\herpiko\src\vcpkg\installed\x64-wi
ndows\debug\lib" /LIBPATH:"C:\Users\herpiko\src\vcpkg\installed\x64-windows\debug\lib\manual-link" kernel32.lib user3
2.lib gdi32.lib winspool.lib shell32.lib ole32.lib oleaut32.lib uuid.lib comdlg32.lib advapi32.lib ..\src\Debug\erpik
o.lib "..\..\deps\libressl\crypto\Release\crypto-41.lib" "..\..\deps\libressl\ssl\Release\ssl-43.lib" /MANIFEST /MANI
FESTUAC:"level='asInvoker' uiAccess='false'" /manifest:embed /DEBUG /PDB:"C:/Users/herpiko/src/erpiko/build/tests/Deb
ug/testsmime.pdb" /SUBSYSTEM:CONSOLE /TLBID:1 /DYNAMICBASE /NXCOMPAT /IMPLIB:"C:/Users/herpiko/src/erpiko/build/tests
/Debug/testsmime.lib" /MACHINE:X64 /machine:x64 testsmime.dir\Debug\smime.obj
testsmime.vcxproj -> C:\Users\herpiko\src\erpiko\build\tests\Debug\testsmime.exe
AppLocalFromInstalled:
powershell.exe -ExecutionPolicy Unrestricted -noprofile -File "C:\Users\herpiko\src\vcpkg\scripts\buildsystems\msbuil
d\applocal.ps1" "C:\Users\herpiko\src\erpiko\build\tests\Debug\testsmime.exe" "C:\Users\herpiko\src\vcpkg\installed\x
64-windows\debug\bin" "testsmime.dir\Debug\testsmime.tlog\testsmime.write.1u.tlog"
FinalizeBuildStatus:
Deleting file "testsmime.dir\Debug\testsmime.tlog\unsuccessfulbuild".
Touching "testsmime.dir\Debug\testsmime.tlog\testsmime.lastbuildstate".
Done Building Project "c:\Users\herpiko\src\erpiko\build\tests\testsmime.vcxproj" (default targets).
Done Building Project "c:\Users\herpiko\src\erpiko\build\tests\testsmime.vcxproj.metaproj" (default targets).
Done Building Project "c:\Users\herpiko\src\erpiko\build\erpiko.sln" (default targets) -- FAILED.
Build FAILED.
"c:\Users\herpiko\src\erpiko\build\erpiko.sln" (default target) (1) ->
"c:\Users\herpiko\src\erpiko\build\src\erpiko.vcxproj.metaproj" (default target) (3) ->
"c:\Users\herpiko\src\erpiko\build\src\erpiko.vcxproj" (default target) (4) ->
(ClCompile target) ->
c:\users\herpiko\src\erpiko\src\converters.h(73): warning C4267: 'argument': conversion from 'size_t' to 'int', possi
ble loss of data [c:\Users\herpiko\src\erpiko\build\src\erpiko.vcxproj]
c:\users\herpiko\src\erpiko\src\converters.h(135): warning C4267: 'argument': conversion from 'size_t' to 'int', poss
ible loss of data [c:\Users\herpiko\src\erpiko\build\src\erpiko.vcxproj]
c:\users\herpiko\src\erpiko\src\converters.h(149): warning C4267: 'argument': conversion from 'size_t' to 'long', pos
sible loss of data [c:\Users\herpiko\src\erpiko\build\src\erpiko.vcxproj]
c:\users\herpiko\src\erpiko\src\converters.h(156): warning C4267: 'argument': conversion from 'size_t' to 'long', pos
sible loss of data [c:\Users\herpiko\src\erpiko\build\src\erpiko.vcxproj]
c:\users\herpiko\src\erpiko\src\converters.h(163): warning C4267: 'argument': conversion from 'size_t' to 'int', poss
ible loss of data [c:\Users\herpiko\src\erpiko\build\src\erpiko.vcxproj]
C:\Users\herpiko\src\erpiko\src\rsakey.cpp(63): warning C4267: 'argument': conversion from 'size_t' to 'int', possibl
e loss of data [c:\Users\herpiko\src\erpiko\build\src\erpiko.vcxproj]
C:\Users\herpiko\src\erpiko\src\rsakey.cpp(78): warning C4267: 'argument': conversion from 'size_t' to 'int', possibl
e loss of data [c:\Users\herpiko\src\erpiko\build\src\erpiko.vcxproj]
C:\Users\herpiko\src\erpiko\src\rsakey.cpp(155): warning C4267: 'argument': conversion from 'size_t' to 'int', possib
le loss of data [c:\Users\herpiko\src\erpiko\build\src\erpiko.vcxproj]
C:\Users\herpiko\src\erpiko\src\rsakey-public.cpp(27): warning C4267: 'argument': conversion from 'size_t' to 'int',
possible loss of data [c:\Users\herpiko\src\erpiko\build\src\erpiko.vcxproj]
C:\Users\herpiko\src\erpiko\src\rsakey-public.cpp(37): warning C4267: 'argument': conversion from 'size_t' to 'int',
possible loss of data [c:\Users\herpiko\src\erpiko\build\src\erpiko.vcxproj]
c:\users\herpiko\src\erpiko\src\converters.h(73): warning C4267: 'argument': conversion from 'size_t' to 'int', possi
ble loss of data [c:\Users\herpiko\src\erpiko\build\src\erpiko.vcxproj]
c:\users\herpiko\src\erpiko\src\converters.h(135): warning C4267: 'argument': conversion from 'size_t' to 'int', poss
ible loss of data [c:\Users\herpiko\src\erpiko\build\src\erpiko.vcxproj]
c:\users\herpiko\src\erpiko\src\converters.h(149): warning C4267: 'argument': conversion from 'size_t' to 'long', pos
sible loss of data [c:\Users\herpiko\src\erpiko\build\src\erpiko.vcxproj]
c:\users\herpiko\src\erpiko\src\converters.h(156): warning C4267: 'argument': conversion from 'size_t' to 'long', pos
sible loss of data [c:\Users\herpiko\src\erpiko\build\src\erpiko.vcxproj]
c:\users\herpiko\src\erpiko\src\converters.h(163): warning C4267: 'argument': conversion from 'size_t' to 'int', poss
ible loss of data [c:\Users\herpiko\src\erpiko\build\src\erpiko.vcxproj]
C:\Users\herpiko\src\erpiko\src\certificate.cpp(40): warning C4267: 'argument': conversion from 'size_t' to 'int', po
ssible loss of data [c:\Users\herpiko\src\erpiko\build\src\erpiko.vcxproj]
C:\Users\herpiko\src\erpiko\src\certificate.cpp(51): warning C4267: 'argument': conversion from 'size_t' to 'int', po
ssible loss of data [c:\Users\herpiko\src\erpiko\build\src\erpiko.vcxproj]
C:\Users\herpiko\src\erpiko\src\certificate.cpp(63): warning C4267: 'argument': conversion from 'size_t' to 'int', po
ssible loss of data [c:\Users\herpiko\src\erpiko\build\src\erpiko.vcxproj]
C:\Users\herpiko\src\erpiko\src\certificate.cpp(348): warning C4267: 'argument': conversion from 'size_t' to 'long',
possible loss of data [c:\Users\herpiko\src\erpiko\build\src\erpiko.vcxproj]
C:\Users\herpiko\src\erpiko\src\certificate.cpp(387): warning C4267: 'argument': conversion from 'size_t' to 'long',
possible loss of data [c:\Users\herpiko\src\erpiko\build\src\erpiko.vcxproj]
C:\Users\herpiko\src\erpiko\src\certificate.cpp(388): warning C4800: 'int': forcing value to bool 'true' or 'false' (
performance warning) [c:\Users\herpiko\src\erpiko\build\src\erpiko.vcxproj]
c:\users\herpiko\src\erpiko\src\converters.h(73): warning C4267: 'argument': conversion from 'size_t' to 'int', possi
ble loss of data [c:\Users\herpiko\src\erpiko\build\src\erpiko.vcxproj]
c:\users\herpiko\src\erpiko\src\converters.h(135): warning C4267: 'argument': conversion from 'size_t' to 'int', poss
ible loss of data [c:\Users\herpiko\src\erpiko\build\src\erpiko.vcxproj]
c:\users\herpiko\src\erpiko\src\converters.h(149): warning C4267: 'argument': conversion from 'size_t' to 'long', pos
sible loss of data [c:\Users\herpiko\src\erpiko\build\src\erpiko.vcxproj]
c:\users\herpiko\src\erpiko\src\converters.h(156): warning C4267: 'argument': conversion from 'size_t' to 'long', pos
sible loss of data [c:\Users\herpiko\src\erpiko\build\src\erpiko.vcxproj]
c:\users\herpiko\src\erpiko\src\converters.h(163): warning C4267: 'argument': conversion from 'size_t' to 'int', poss
ible loss of data [c:\Users\herpiko\src\erpiko\build\src\erpiko.vcxproj]
C:\Users\herpiko\src\erpiko\src\identity.cpp(93): warning C4267: 'argument': conversion from 'size_t' to 'long', poss
ible loss of data [c:\Users\herpiko\src\erpiko\build\src\erpiko.vcxproj]
C:\Users\herpiko\src\erpiko\src\time.cpp(23): warning C4996: 'localtime': This function or variable may be unsafe. Co
nsider using localtime_s instead. To disable deprecation, use _CRT_SECURE_NO_WARNINGS. See online help for details. [c:
\Users\herpiko\src\erpiko\build\src\erpiko.vcxproj]
c:\users\herpiko\src\erpiko\src\converters.h(73): warning C4267: 'argument': conversion from 'size_t' to 'int', possi
ble loss of data [c:\Users\herpiko\src\erpiko\build\src\erpiko.vcxproj]
c:\users\herpiko\src\erpiko\src\converters.h(135): warning C4267: 'argument': conversion from 'size_t' to 'int', poss
ible loss of data [c:\Users\herpiko\src\erpiko\build\src\erpiko.vcxproj]
c:\users\herpiko\src\erpiko\src\converters.h(149): warning C4267: 'argument': conversion from 'size_t' to 'long', pos
sible loss of data [c:\Users\herpiko\src\erpiko\build\src\erpiko.vcxproj]
c:\users\herpiko\src\erpiko\src\converters.h(156): warning C4267: 'argument': conversion from 'size_t' to 'long', pos
sible loss of data [c:\Users\herpiko\src\erpiko\build\src\erpiko.vcxproj]
c:\users\herpiko\src\erpiko\src\converters.h(163): warning C4267: 'argument': conversion from 'size_t' to 'int', poss
ible loss of data [c:\Users\herpiko\src\erpiko\build\src\erpiko.vcxproj]
C:\Users\herpiko\src\erpiko\src\pkcs12.cpp(45): warning C4267: 'argument': conversion from 'size_t' to 'int', possibl
e loss of data [c:\Users\herpiko\src\erpiko\build\src\erpiko.vcxproj]
C:\Users\herpiko\src\erpiko\src\pkcs12.cpp(98): warning C4267: 'argument': conversion from 'size_t' to 'int', possibl
e loss of data [c:\Users\herpiko\src\erpiko\build\src\erpiko.vcxproj]
C:\Users\herpiko\src\erpiko\src\pkcs12.cpp(121): warning C4267: 'argument': conversion from 'size_t' to 'int', possib
le loss of data [c:\Users\herpiko\src\erpiko\build\src\erpiko.vcxproj]
C:\Users\herpiko\src\erpiko\src\pkcs12.cpp(200): warning C4267: 'argument': conversion from 'size_t' to 'int', possib
le loss of data [c:\Users\herpiko\src\erpiko\build\src\erpiko.vcxproj]
c:\users\herpiko\src\erpiko\src\converters.h(73): warning C4267: 'argument': conversion from 'size_t' to 'int', possi
ble loss of data [c:\Users\herpiko\src\erpiko\build\src\erpiko.vcxproj]
c:\users\herpiko\src\erpiko\src\converters.h(135): warning C4267: 'argument': conversion from 'size_t' to 'int', poss
ible loss of data [c:\Users\herpiko\src\erpiko\build\src\erpiko.vcxproj]
c:\users\herpiko\src\erpiko\src\converters.h(149): warning C4267: 'argument': conversion from 'size_t' to 'long', pos
sible loss of data [c:\Users\herpiko\src\erpiko\build\src\erpiko.vcxproj]
c:\users\herpiko\src\erpiko\src\converters.h(156): warning C4267: 'argument': conversion from 'size_t' to 'long', pos
sible loss of data [c:\Users\herpiko\src\erpiko\build\src\erpiko.vcxproj]
c:\users\herpiko\src\erpiko\src\converters.h(163): warning C4267: 'argument': conversion from 'size_t' to 'int', poss
ible loss of data [c:\Users\herpiko\src\erpiko\build\src\erpiko.vcxproj]
c:\users\herpiko\src\erpiko\src\converters.h(73): warning C4267: 'argument': conversion from 'size_t' to 'int', possi
ble loss of data [c:\Users\herpiko\src\erpiko\build\src\erpiko.vcxproj]
c:\users\herpiko\src\erpiko\src\converters.h(135): warning C4267: 'argument': conversion from 'size_t' to 'int', poss
ible loss of data [c:\Users\herpiko\src\erpiko\build\src\erpiko.vcxproj]
c:\users\herpiko\src\erpiko\src\converters.h(149): warning C4267: 'argument': conversion from 'size_t' to 'long', pos
sible loss of data [c:\Users\herpiko\src\erpiko\build\src\erpiko.vcxproj]
c:\users\herpiko\src\erpiko\src\converters.h(156): warning C4267: 'argument': conversion from 'size_t' to 'long', pos
sible loss of data [c:\Users\herpiko\src\erpiko\build\src\erpiko.vcxproj]
c:\users\herpiko\src\erpiko\src\converters.h(163): warning C4267: 'argument': conversion from 'size_t' to 'int', poss
ible loss of data [c:\Users\herpiko\src\erpiko\build\src\erpiko.vcxproj]
C:\Users\herpiko\src\erpiko\src\signed-data.cpp(57): warning C4267: 'argument': conversion from 'size_t' to 'int', po
ssible loss of data [c:\Users\herpiko\src\erpiko\build\src\erpiko.vcxproj]
C:\Users\herpiko\src\erpiko\src\signed-data.cpp(70): warning C4267: 'argument': conversion from 'size_t' to 'int', po
ssible loss of data [c:\Users\herpiko\src\erpiko\build\src\erpiko.vcxproj]
C:\Users\herpiko\src\erpiko\src\signed-data.cpp(85): warning C4267: 'argument': conversion from 'size_t' to 'int', po
ssible loss of data [c:\Users\herpiko\src\erpiko\build\src\erpiko.vcxproj]
C:\Users\herpiko\src\erpiko\src\signed-data.cpp(166): warning C4267: 'argument': conversion from 'size_t' to 'int', p
ossible loss of data [c:\Users\herpiko\src\erpiko\build\src\erpiko.vcxproj]
C:\Users\herpiko\src\erpiko\src\sim.cpp(48): warning C4267: 'argument': conversion from 'size_t' to 'int', possible l
oss of data [c:\Users\herpiko\src\erpiko\build\src\erpiko.vcxproj]
C:\Users\herpiko\src\erpiko\src\sim.cpp(49): warning C4267: 'argument': conversion from 'size_t' to 'int', possible l
oss of data [c:\Users\herpiko\src\erpiko\build\src\erpiko.vcxproj]
C:\Users\herpiko\src\erpiko\src\sim.cpp(50): warning C4267: 'argument': conversion from 'size_t' to 'int', possible l
oss of data [c:\Users\herpiko\src\erpiko\build\src\erpiko.vcxproj]
C:\Users\herpiko\src\erpiko\src\sim.cpp(109): warning C4267: 'argument': conversion from 'size_t' to 'int', possible
loss of data [c:\Users\herpiko\src\erpiko\build\src\erpiko.vcxproj]
C:\Users\herpiko\src\erpiko\src\sim.cpp(110): warning C4267: 'argument': conversion from 'size_t' to 'int', possible
loss of data [c:\Users\herpiko\src\erpiko\build\src\erpiko.vcxproj]
C:\Users\herpiko\src\erpiko\src\sim.cpp(137): warning C4267: 'argument': conversion from 'size_t' to 'int', possible
loss of data [c:\Users\herpiko\src\erpiko\build\src\erpiko.vcxproj]
c:\users\herpiko\src\erpiko\src\converters.h(73): warning C4267: 'argument': conversion from 'size_t' to 'int', possi
ble loss of data [c:\Users\herpiko\src\erpiko\build\src\erpiko.vcxproj]
c:\users\herpiko\src\erpiko\src\converters.h(135): warning C4267: 'argument': conversion from 'size_t' to 'int', poss
ible loss of data [c:\Users\herpiko\src\erpiko\build\src\erpiko.vcxproj]
c:\users\herpiko\src\erpiko\src\converters.h(149): warning C4267: 'argument': conversion from 'size_t' to 'long', pos
sible loss of data [c:\Users\herpiko\src\erpiko\build\src\erpiko.vcxproj]
c:\users\herpiko\src\erpiko\src\converters.h(156): warning C4267: 'argument': conversion from 'size_t' to 'long', pos
sible loss of data [c:\Users\herpiko\src\erpiko\build\src\erpiko.vcxproj]
c:\users\herpiko\src\erpiko\src\converters.h(163): warning C4267: 'argument': conversion from 'size_t' to 'int', poss
ible loss of data [c:\Users\herpiko\src\erpiko\build\src\erpiko.vcxproj]
C:\Users\herpiko\src\erpiko\src\enveloped-data.cpp(42): warning C4267: 'argument': conversion from 'size_t' to 'int',
possible loss of data [c:\Users\herpiko\src\erpiko\build\src\erpiko.vcxproj]
C:\Users\herpiko\src\erpiko\src\enveloped-data.cpp(54): warning C4267: 'argument': conversion from 'size_t' to 'int',
possible loss of data [c:\Users\herpiko\src\erpiko\build\src\erpiko.vcxproj]
C:\Users\herpiko\src\erpiko\src\enveloped-data.cpp(68): warning C4267: 'argument': conversion from 'size_t' to 'int',
possible loss of data [c:\Users\herpiko\src\erpiko\build\src\erpiko.vcxproj]
C:\Users\herpiko\src\erpiko\src\enveloped-data.cpp(90): warning C4267: 'argument': conversion from 'size_t' to 'int',
possible loss of data [c:\Users\herpiko\src\erpiko\build\src\erpiko.vcxproj]
"c:\Users\herpiko\src\erpiko\build\erpiko.sln" (default target) (1) ->
"c:\Users\herpiko\src\erpiko\build\tests\testcertificate.vcxproj.metaproj" (default target) (7) ->
"c:\Users\herpiko\src\erpiko\build\tests\testcertificate.vcxproj" (default target) (8) ->
C:\Users\herpiko\src\erpiko\tests\certificate.cpp(70): warning C4267: 'initializing': conversion from 'size_t' to 'in
t', possible loss of data [c:\Users\herpiko\src\erpiko\build\tests\testcertificate.vcxproj]
"c:\Users\herpiko\src\erpiko\build\erpiko.sln" (default target) (1) ->
"c:\Users\herpiko\src\erpiko\build\tests\testcmp.vcxproj.metaproj" (default target) (9) ->
"c:\Users\herpiko\src\erpiko\build\tests\testcmp.vcxproj" (default target) (10) ->
(Link target) ->
erpiko.lib(cmp.obj) : error LNK2019: unresolved external symbol CMP_doInitialRequestSeq referenced in function "publi
c: class Erpiko::Certificate const * __cdecl Erpiko::Cmp::startInitRequest(void)" (?startInitRequest@Cmp@Erpiko@@QEAAPE
BVCertificate@2@XZ) [c:\Users\herpiko\src\erpiko\build\tests\testcmp.vcxproj]
erpiko.lib(cmp.obj) : error LNK2019: unresolved external symbol CMP_CTX_create referenced in function "public: __cdec
l Erpiko::Cmp::Impl::Impl(void)" (??0Impl@Cmp@Erpiko@@QEAA@XZ) [c:\Users\herpiko\src\erpiko\build\tests\testcmp.vcxproj
]
erpiko.lib(cmp.obj) : error LNK2019: unresolved external symbol CMP_CTX_delete referenced in function "public: virtua
l __cdecl Erpiko::Cmp::Impl::~Impl(void)" (??1Impl@Cmp@Erpiko@@UEAA@XZ) [c:\Users\herpiko\src\erpiko\build\tests\testcm
p.vcxproj]
erpiko.lib(cmp.obj) : error LNK2019: unresolved external symbol CMP_CTX_set1_referenceValue referenced in function "p
ublic: void __cdecl Erpiko::Cmp::referenceName(class std::basic_string<char,struct std::char_traits<char>,class std::al
locator<char> >)" (?referenceName@Cmp@Erpiko@@QEAAXV?$basic_string@DU?$char_traits@D@std@@V?$allocator@D@2@@std@@@Z) [c
:\Users\herpiko\src\erpiko\build\tests\testcmp.vcxproj]
erpiko.lib(cmp.obj) : error LNK2019: unresolved external symbol CMP_CTX_set1_secretValue referenced in function "publ
ic: void __cdecl Erpiko::Cmp::secret(class std::basic_string<char,struct std::char_traits<char>,class std::allocator<ch
ar> >)" (?secret@Cmp@Erpiko@@QEAAXV?$basic_string@DU?$char_traits@D@std@@V?$allocator@D@2@@std@@@Z) [c:\Users\herpiko\s
rc\erpiko\build\tests\testcmp.vcxproj]
erpiko.lib(cmp.obj) : error LNK2019: unresolved external symbol CMP_CTX_set1_srvCert referenced in function "public:
void __cdecl Erpiko::Cmp::caCertificate(class Erpiko::Certificate const &)" (?caCertificate@Cmp@Erpiko@@QEAAXAEBVCertif
icate@2@@Z) [c:\Users\herpiko\src\erpiko\build\tests\testcmp.vcxproj]
erpiko.lib(cmp.obj) : error LNK2019: unresolved external symbol CMP_CTX_set1_subjectName referenced in function "publ
ic: void __cdecl Erpiko::Cmp::subject(class Erpiko::Identity const &)" (?subject@Cmp@Erpiko@@QEAAXAEBVIdentity@2@@Z) [c
:\Users\herpiko\src\erpiko\build\tests\testcmp.vcxproj]
erpiko.lib(cmp.obj) : error LNK2019: unresolved external symbol CMP_CTX_subjectAltName_push1 referenced in function "
public: void __cdecl Erpiko::Cmp::insertSim(class Erpiko::Sim const &)" (?insertSim@Cmp@Erpiko@@QEAAXAEBVSim@2@@Z) [c:\
Users\herpiko\src\erpiko\build\tests\testcmp.vcxproj]
erpiko.lib(cmp.obj) : error LNK2019: unresolved external symbol CMP_CTX_set0_newPkey referenced in function "public:
void __cdecl Erpiko::Cmp::privateKey(class Erpiko::RsaKey const &)" (?privateKey@Cmp@Erpiko@@QEAAXAEBVRsaKey@2@@Z) [c:\
Users\herpiko\src\erpiko\build\tests\testcmp.vcxproj]
erpiko.lib(cmp.obj) : error LNK2019: unresolved external symbol CMP_CTX_set1_serverName referenced in function "publi
c: void __cdecl Erpiko::Cmp::serverName(class std::basic_string<char,struct std::char_traits<char>,class std::allocator
<char> >)" (?serverName@Cmp@Erpiko@@QEAAXV?$basic_string@DU?$char_traits@D@std@@V?$allocator@D@2@@std@@@Z) [c:\Users\he
rpiko\src\erpiko\build\tests\testcmp.vcxproj]
erpiko.lib(cmp.obj) : error LNK2019: unresolved external symbol CMP_CTX_set1_serverPort referenced in function "publi
c: void __cdecl Erpiko::Cmp::serverPort(int)" (?serverPort@Cmp@Erpiko@@QEAAXH@Z) [c:\Users\herpiko\src\erpiko\build\tes
ts\testcmp.vcxproj]
erpiko.lib(cmp.obj) : error LNK2019: unresolved external symbol CMP_CTX_set_HttpTimeOut referenced in function "publi
c: class Erpiko::Certificate const * __cdecl Erpiko::Cmp::startInitRequest(void)" (?startInitRequest@Cmp@Erpiko@@QEAAPE
BVCertificate@2@XZ) [c:\Users\herpiko\src\erpiko\build\tests\testcmp.vcxproj]
erpiko.lib(cmp.obj) : error LNK2019: unresolved external symbol CMP_CTX_set1_serverPath referenced in function "publi
c: void __cdecl Erpiko::Cmp::serverPath(class std::basic_string<char,struct std::char_traits<char>,class std::allocator
<char> >)" (?serverPath@Cmp@Erpiko@@QEAAXV?$basic_string@DU?$char_traits@D@std@@V?$allocator@D@2@@std@@@Z) [c:\Users\he
rpiko\src\erpiko\build\tests\testcmp.vcxproj]
erpiko.lib(cmp.obj) : error LNK2019: unresolved external symbol CMP_CTX_set_option referenced in function "public: vo
id __cdecl Erpiko::Cmp::useTls(bool)" (?useTls@Cmp@Erpiko@@QEAAX_N@Z) [c:\Users\herpiko\src\erpiko\build\tests\testcmp.
vcxproj]
C:\Users\herpiko\src\erpiko\build\tests\Debug\testcmp.exe : fatal error LNK1120: 14 unresolved externals [c:\Users\he
rpiko\src\erpiko\build\tests\testcmp.vcxproj]
67 Warning(s)
15 Error(s)
Time Elapsed 00:00:45.95
c:\Users\herpiko\src\erpiko\build>
Sign up for free to join this conversation on GitHub. Already have an account? Sign in to comment