Skip to content

Instantly share code, notes, and snippets.

Embed
What would you like to do?
Using random seed 735017
0:00:00 load avg: 2.17 Run tests in parallel using 10 child processes
0:00:02 load avg: 2.16 [1/1/1] test.test_importlib failed
test_join_path
Warning -- sys.path was modified by test.test_importlib
Before: (4326187200, ['/Users/jaraco/code/public/cpython', '/usr/local/lib/python310.zip', '/Users/jaraco/code/public/cpython/Lib', '/Users/jaraco/code/public/cpython/build/lib.macosx-11.1-x86_64-3.10'], ['/Users/jaraco/code/public/cpython', '/usr/local/lib/python310.zip', '/Users/jaraco/code/public/cpython/Lib', '/Users/jaraco/code/public/cpython/build/lib.macosx-11.1-x86_64-3.10'])
After: (4326187200, ['/Users/jaraco/code/public/cpython', '/usr/local/lib/python310.zip', '/Users/jaraco/code/public/cpython/Lib', '/Users/jaraco/code/public/cpython/build/lib.macosx-11.1-x86_64-3.10'], ['/Users/jaraco/code/public/cpython', '/usr/local/lib/python310.zip', '/Users/jaraco/code/public/cpython/Lib', '/Users/jaraco/code/public/cpython/build/lib.macosx-11.1-x86_64-3.10', '/Users/jaraco/code/public/cpython/Lib/test/test_importlib', '/Users/jaraco/code/public/cpython/Lib/test/test_importlib'])
test test.test_importlib failed -- multiple errors occurred; run in verbose mode for details
== Tests result: FAILURE ==
1 test failed:
test.test_importlib
0:00:02 load avg: 2.16
0:00:02 load avg: 2.16 Re-running failed tests in verbose mode
0:00:02 load avg: 2.16 Re-running test.test_importlib in verbose mode
test_failure (test.test_importlib.builtin.test_finder.Frozen_FindSpecTests) ... ok
test_ignore_path (test.test_importlib.builtin.test_finder.Frozen_FindSpecTests) ... ok
test_module (test.test_importlib.builtin.test_finder.Frozen_FindSpecTests) ... ok
test_failure (test.test_importlib.builtin.test_finder.Frozen_FinderTests) ... ok
test_ignore_path (test.test_importlib.builtin.test_finder.Frozen_FinderTests) ... ok
test_module (test.test_importlib.builtin.test_finder.Frozen_FinderTests) ... ok
test_failure (test.test_importlib.builtin.test_finder.Source_FindSpecTests) ... ok
test_ignore_path (test.test_importlib.builtin.test_finder.Source_FindSpecTests) ... ok
test_module (test.test_importlib.builtin.test_finder.Source_FindSpecTests) ... ok
test_failure (test.test_importlib.builtin.test_finder.Source_FinderTests) ... ok
test_ignore_path (test.test_importlib.builtin.test_finder.Source_FinderTests) ... ok
test_module (test.test_importlib.builtin.test_finder.Source_FinderTests) ... ok
test_get_code (test.test_importlib.builtin.test_loader.Frozen_InspectLoaderTests) ... ok
test_get_source (test.test_importlib.builtin.test_loader.Frozen_InspectLoaderTests) ... ok
test_is_package (test.test_importlib.builtin.test_loader.Frozen_InspectLoaderTests) ... ok
test_not_builtin (test.test_importlib.builtin.test_loader.Frozen_InspectLoaderTests) ... ok
test_already_imported (test.test_importlib.builtin.test_loader.Frozen_LoaderTests) ... ok
test_module (test.test_importlib.builtin.test_loader.Frozen_LoaderTests) ... ok
test_module_reuse (test.test_importlib.builtin.test_loader.Frozen_LoaderTests) ... ok
test_unloadable (test.test_importlib.builtin.test_loader.Frozen_LoaderTests) ... ok
test_get_code (test.test_importlib.builtin.test_loader.Source_InspectLoaderTests) ... ok
test_get_source (test.test_importlib.builtin.test_loader.Source_InspectLoaderTests) ... ok
test_is_package (test.test_importlib.builtin.test_loader.Source_InspectLoaderTests) ... ok
test_not_builtin (test.test_importlib.builtin.test_loader.Source_InspectLoaderTests) ... ok
test_already_imported (test.test_importlib.builtin.test_loader.Source_LoaderTests) ... ok
test_module (test.test_importlib.builtin.test_loader.Source_LoaderTests) ... ok
test_module_reuse (test.test_importlib.builtin.test_loader.Source_LoaderTests) ... ok
test_unloadable (test.test_importlib.builtin.test_loader.Source_LoaderTests) ... ok
test_case_insensitivity (test.test_importlib.extension.test_case_sensitivity.Frozen_ExtensionModuleCaseSensitivityTest) ... skipped 'ignore_environment flag was set'
test_case_sensitive (test.test_importlib.extension.test_case_sensitivity.Frozen_ExtensionModuleCaseSensitivityTest) ... skipped 'ignore_environment flag was set'
test_case_insensitivity (test.test_importlib.extension.test_case_sensitivity.Source_ExtensionModuleCaseSensitivityTest) ... skipped 'ignore_environment flag was set'
test_case_sensitive (test.test_importlib.extension.test_case_sensitivity.Source_ExtensionModuleCaseSensitivityTest) ... skipped 'ignore_environment flag was set'
test_failure (test.test_importlib.extension.test_finder.Frozen_FinderTests) ... ok
test_module (test.test_importlib.extension.test_finder.Frozen_FinderTests) ... ok
test_failure (test.test_importlib.extension.test_finder.Source_FinderTests) ... ok
test_module (test.test_importlib.extension.test_finder.Source_FinderTests) ... ok
test_equality (test.test_importlib.extension.test_loader.Frozen_LoaderTests) ... ok
test_inequality (test.test_importlib.extension.test_loader.Frozen_LoaderTests) ... ok
test_is_package (test.test_importlib.extension.test_loader.Frozen_LoaderTests) ... ok
test_load_module_API (test.test_importlib.extension.test_loader.Frozen_LoaderTests) ... ok
test_module (test.test_importlib.extension.test_loader.Frozen_LoaderTests) ... ok
test_module_reuse (test.test_importlib.extension.test_loader.Frozen_LoaderTests) ... ok
test_unloadable (test.test_importlib.extension.test_loader.Frozen_LoaderTests) ... ok
test_bad_modules (test.test_importlib.extension.test_loader.Frozen_MultiPhaseExtensionModuleTests)
Test SystemError is raised for misbehaving extensions ... ok
test_functionality (test.test_importlib.extension.test_loader.Frozen_MultiPhaseExtensionModuleTests)
Test basic functionality of stuff defined in an extension module ... ok
test_load_short_name (test.test_importlib.extension.test_loader.Frozen_MultiPhaseExtensionModuleTests)
Test loading module with a one-character name ... ok
test_load_submodule (test.test_importlib.extension.test_loader.Frozen_MultiPhaseExtensionModuleTests)
Test loading a simulated submodule ... ok
test_load_twice (test.test_importlib.extension.test_loader.Frozen_MultiPhaseExtensionModuleTests)
Test that 2 loads result in 2 module objects ... ok
test_module (test.test_importlib.extension.test_loader.Frozen_MultiPhaseExtensionModuleTests)
Test loading an extension module ... ok
test_nonascii (test.test_importlib.extension.test_loader.Frozen_MultiPhaseExtensionModuleTests)
Test that modules with non-ASCII names can be loaded ... ok
test_nonmodule (test.test_importlib.extension.test_loader.Frozen_MultiPhaseExtensionModuleTests)
Test returning a non-module object from create works ... ok
test_nonmodule_with_methods (test.test_importlib.extension.test_loader.Frozen_MultiPhaseExtensionModuleTests)
Test creating a non-module object with methods defined ... ok
test_null_slots (test.test_importlib.extension.test_loader.Frozen_MultiPhaseExtensionModuleTests)
Test that NULL slots aren't a problem ... ok
test_reload (test.test_importlib.extension.test_loader.Frozen_MultiPhaseExtensionModuleTests)
Test that reload didn't re-set the module's attributes ... ok
test_try_registration (test.test_importlib.extension.test_loader.Frozen_MultiPhaseExtensionModuleTests)
Assert that the PyState_{Find,Add,Remove}Module C API doesn't work ... ok
test_unloadable (test.test_importlib.extension.test_loader.Frozen_MultiPhaseExtensionModuleTests)
Test nonexistent module ... ok
test_unloadable_nonascii (test.test_importlib.extension.test_loader.Frozen_MultiPhaseExtensionModuleTests)
Test behavior with nonexistent module with non-ASCII name ... ok
test_equality (test.test_importlib.extension.test_loader.Source_LoaderTests) ... ok
test_inequality (test.test_importlib.extension.test_loader.Source_LoaderTests) ... ok
test_is_package (test.test_importlib.extension.test_loader.Source_LoaderTests) ... ok
test_load_module_API (test.test_importlib.extension.test_loader.Source_LoaderTests) ... ok
test_module (test.test_importlib.extension.test_loader.Source_LoaderTests) ... ok
test_module_reuse (test.test_importlib.extension.test_loader.Source_LoaderTests) ... ok
test_unloadable (test.test_importlib.extension.test_loader.Source_LoaderTests) ... ok
test_bad_modules (test.test_importlib.extension.test_loader.Source_MultiPhaseExtensionModuleTests)
Test SystemError is raised for misbehaving extensions ... ok
test_functionality (test.test_importlib.extension.test_loader.Source_MultiPhaseExtensionModuleTests)
Test basic functionality of stuff defined in an extension module ... ok
test_load_short_name (test.test_importlib.extension.test_loader.Source_MultiPhaseExtensionModuleTests)
Test loading module with a one-character name ... ok
test_load_submodule (test.test_importlib.extension.test_loader.Source_MultiPhaseExtensionModuleTests)
Test loading a simulated submodule ... ok
test_load_twice (test.test_importlib.extension.test_loader.Source_MultiPhaseExtensionModuleTests)
Test that 2 loads result in 2 module objects ... ok
test_module (test.test_importlib.extension.test_loader.Source_MultiPhaseExtensionModuleTests)
Test loading an extension module ... ok
test_nonascii (test.test_importlib.extension.test_loader.Source_MultiPhaseExtensionModuleTests)
Test that modules with non-ASCII names can be loaded ... ok
test_nonmodule (test.test_importlib.extension.test_loader.Source_MultiPhaseExtensionModuleTests)
Test returning a non-module object from create works ... ok
test_nonmodule_with_methods (test.test_importlib.extension.test_loader.Source_MultiPhaseExtensionModuleTests)
Test creating a non-module object with methods defined ... ok
test_null_slots (test.test_importlib.extension.test_loader.Source_MultiPhaseExtensionModuleTests)
Test that NULL slots aren't a problem ... ok
test_reload (test.test_importlib.extension.test_loader.Source_MultiPhaseExtensionModuleTests)
Test that reload didn't re-set the module's attributes ... ok
test_try_registration (test.test_importlib.extension.test_loader.Source_MultiPhaseExtensionModuleTests)
Assert that the PyState_{Find,Add,Remove}Module C API doesn't work ... ok
test_unloadable (test.test_importlib.extension.test_loader.Source_MultiPhaseExtensionModuleTests)
Test nonexistent module ... ok
test_unloadable_nonascii (test.test_importlib.extension.test_loader.Source_MultiPhaseExtensionModuleTests)
Test behavior with nonexistent module with non-ASCII name ... ok
test_success (test.test_importlib.extension.test_path_hook.Frozen_PathHookTests) ... ok
test_success (test.test_importlib.extension.test_path_hook.Source_PathHookTests) ... ok
test_failure (test.test_importlib.frozen.test_finder.Frozen_FindSpecTests) ... ok
test_module (test.test_importlib.frozen.test_finder.Frozen_FindSpecTests) ... ok
test_module_in_package (test.test_importlib.frozen.test_finder.Frozen_FindSpecTests) ... ok
test_package (test.test_importlib.frozen.test_finder.Frozen_FindSpecTests) ... ok
test_failure (test.test_importlib.frozen.test_finder.Frozen_FinderTests) ... ok
test_module (test.test_importlib.frozen.test_finder.Frozen_FinderTests) ... ok
test_module_in_package (test.test_importlib.frozen.test_finder.Frozen_FinderTests) ... ok
test_package (test.test_importlib.frozen.test_finder.Frozen_FinderTests) ... ok
test_failure (test.test_importlib.frozen.test_finder.Source_FindSpecTests) ... ok
test_module (test.test_importlib.frozen.test_finder.Source_FindSpecTests) ... ok
test_module_in_package (test.test_importlib.frozen.test_finder.Source_FindSpecTests) ... ok
test_package (test.test_importlib.frozen.test_finder.Source_FindSpecTests) ... ok
test_failure (test.test_importlib.frozen.test_finder.Source_FinderTests) ... ok
test_module (test.test_importlib.frozen.test_finder.Source_FinderTests) ... ok
test_module_in_package (test.test_importlib.frozen.test_finder.Source_FinderTests) ... ok
test_package (test.test_importlib.frozen.test_finder.Source_FinderTests) ... ok
test_lacking_parent (test.test_importlib.frozen.test_loader.Frozen_ExecModuleTests) ... ok
test_module (test.test_importlib.frozen.test_loader.Frozen_ExecModuleTests) ... ok
test_module_repr (test.test_importlib.frozen.test_loader.Frozen_ExecModuleTests) ... ok
test_module_repr_indirect (test.test_importlib.frozen.test_loader.Frozen_ExecModuleTests) ... ok
test_package (test.test_importlib.frozen.test_loader.Frozen_ExecModuleTests) ... ok
test_unloadable (test.test_importlib.frozen.test_loader.Frozen_ExecModuleTests) ... ok
test_failure (test.test_importlib.frozen.test_loader.Frozen_InspectLoaderTests) ... ok
test_get_code (test.test_importlib.frozen.test_loader.Frozen_InspectLoaderTests) ... ok
test_get_source (test.test_importlib.frozen.test_loader.Frozen_InspectLoaderTests) ... ok
test_is_package (test.test_importlib.frozen.test_loader.Frozen_InspectLoaderTests) ... ok
test_lacking_parent (test.test_importlib.frozen.test_loader.Frozen_LoaderTests) ... ok
test_module (test.test_importlib.frozen.test_loader.Frozen_LoaderTests) ... ok
test_module_repr (test.test_importlib.frozen.test_loader.Frozen_LoaderTests) ... ok
test_module_repr_indirect (test.test_importlib.frozen.test_loader.Frozen_LoaderTests) ... ok
test_module_reuse (test.test_importlib.frozen.test_loader.Frozen_LoaderTests) ... ok
test_package (test.test_importlib.frozen.test_loader.Frozen_LoaderTests) ... ok
test_unloadable (test.test_importlib.frozen.test_loader.Frozen_LoaderTests) ... ok
test_lacking_parent (test.test_importlib.frozen.test_loader.Source_ExecModuleTests) ... ok
test_module (test.test_importlib.frozen.test_loader.Source_ExecModuleTests) ... ok
test_module_repr (test.test_importlib.frozen.test_loader.Source_ExecModuleTests) ... ok
test_module_repr_indirect (test.test_importlib.frozen.test_loader.Source_ExecModuleTests) ... ok
test_package (test.test_importlib.frozen.test_loader.Source_ExecModuleTests) ... ok
test_unloadable (test.test_importlib.frozen.test_loader.Source_ExecModuleTests) ... ok
test_failure (test.test_importlib.frozen.test_loader.Source_InspectLoaderTests) ... ok
test_get_code (test.test_importlib.frozen.test_loader.Source_InspectLoaderTests) ... ok
test_get_source (test.test_importlib.frozen.test_loader.Source_InspectLoaderTests) ... ok
test_is_package (test.test_importlib.frozen.test_loader.Source_InspectLoaderTests) ... ok
test_lacking_parent (test.test_importlib.frozen.test_loader.Source_LoaderTests) ... ok
test_module (test.test_importlib.frozen.test_loader.Source_LoaderTests) ... ok
test_module_repr (test.test_importlib.frozen.test_loader.Source_LoaderTests) ... ok
test_module_repr_indirect (test.test_importlib.frozen.test_loader.Source_LoaderTests) ... ok
test_module_reuse (test.test_importlib.frozen.test_loader.Source_LoaderTests) ... ok
test_package (test.test_importlib.frozen.test_loader.Source_LoaderTests) ... ok
test_unloadable (test.test_importlib.frozen.test_loader.Source_LoaderTests) ... ok
test___loader__ (test.test_importlib.import_.test___loader__.Frozen_SpecLoaderAttributeTests) ... ok
test___loader___is_None (test.test_importlib.import_.test___loader__.Frozen_LoaderAttributeTests) ... ok
test___loader___missing (test.test_importlib.import_.test___loader__.Frozen_LoaderAttributeTests) ... ok
test___loader__ (test.test_importlib.import_.test___loader__.Source_SpecLoaderAttributeTests) ... ok
test___loader___is_None (test.test_importlib.import_.test___loader__.Source_LoaderAttributeTests) ... ok
test___loader___missing (test.test_importlib.import_.test___loader__.Source_LoaderAttributeTests) ... ok
test_None_as___package__ (test.test_importlib.import_.test___package__.Frozen_Using__package__PEP302) ... ok
test_bad__package__ (test.test_importlib.import_.test___package__.Frozen_Using__package__PEP302) ... ok
test_bunk__package__ (test.test_importlib.import_.test___package__.Frozen_Using__package__PEP302) ... ok
test_spec_fallback (test.test_importlib.import_.test___package__.Frozen_Using__package__PEP302) ... ok
test_using___name__ (test.test_importlib.import_.test___package__.Frozen_Using__package__PEP302) ... ok
test_using___package__ (test.test_importlib.import_.test___package__.Frozen_Using__package__PEP302) ... ok
test_warn_when_package_and_spec_disagree (test.test_importlib.import_.test___package__.Frozen_Using__package__PEP302) ... ok
test_warn_when_using___name__ (test.test_importlib.import_.test___package__.Frozen_Using__package__PEP302) ... ok
test_None_as___package__ (test.test_importlib.import_.test___package__.Frozen_Using__package__PEP451) ... ok
test_bad__package__ (test.test_importlib.import_.test___package__.Frozen_Using__package__PEP451) ... ok
test_bunk__package__ (test.test_importlib.import_.test___package__.Frozen_Using__package__PEP451) ... ok
test_spec_fallback (test.test_importlib.import_.test___package__.Frozen_Using__package__PEP451) ... ok
test_using___name__ (test.test_importlib.import_.test___package__.Frozen_Using__package__PEP451) ... ok
test_using___package__ (test.test_importlib.import_.test___package__.Frozen_Using__package__PEP451) ... ok
test_warn_when_package_and_spec_disagree (test.test_importlib.import_.test___package__.Frozen_Using__package__PEP451) ... ok
test_warn_when_using___name__ (test.test_importlib.import_.test___package__.Frozen_Using__package__PEP451) ... ok
test_package (test.test_importlib.import_.test___package__.Setting__package__PEP302) ... ok
test_submodule (test.test_importlib.import_.test___package__.Setting__package__PEP302) ... ok
test_top_level (test.test_importlib.import_.test___package__.Setting__package__PEP302) ... ok
test_package (test.test_importlib.import_.test___package__.Setting__package__PEP451) ... ok
test_submodule (test.test_importlib.import_.test___package__.Setting__package__PEP451) ... ok
test_top_level (test.test_importlib.import_.test___package__.Setting__package__PEP451) ... ok
test_None_as___package__ (test.test_importlib.import_.test___package__.Source_Using__package__PEP302) ... ok
test_bad__package__ (test.test_importlib.import_.test___package__.Source_Using__package__PEP302) ... ok
test_bunk__package__ (test.test_importlib.import_.test___package__.Source_Using__package__PEP302) ... ok
test_spec_fallback (test.test_importlib.import_.test___package__.Source_Using__package__PEP302) ... ok
test_using___name__ (test.test_importlib.import_.test___package__.Source_Using__package__PEP302) ... ok
test_using___package__ (test.test_importlib.import_.test___package__.Source_Using__package__PEP302) ... ok
test_warn_when_package_and_spec_disagree (test.test_importlib.import_.test___package__.Source_Using__package__PEP302) ... ok
test_warn_when_using___name__ (test.test_importlib.import_.test___package__.Source_Using__package__PEP302) ... ok
test_None_as___package__ (test.test_importlib.import_.test___package__.Source_Using__package__PEP451) ... ok
test_bad__package__ (test.test_importlib.import_.test___package__.Source_Using__package__PEP451) ... ok
test_bunk__package__ (test.test_importlib.import_.test___package__.Source_Using__package__PEP451) ... ok
test_spec_fallback (test.test_importlib.import_.test___package__.Source_Using__package__PEP451) ... ok
test_using___name__ (test.test_importlib.import_.test___package__.Source_Using__package__PEP451) ... ok
test_using___package__ (test.test_importlib.import_.test___package__.Source_Using__package__PEP451) ... ok
test_warn_when_package_and_spec_disagree (test.test_importlib.import_.test___package__.Source_Using__package__PEP451) ... ok
test_warn_when_using___name__ (test.test_importlib.import_.test___package__.Source_Using__package__PEP451) ... ok
test_blocked_fromlist (test.test_importlib.import_.test_api.Frozen_OldAPITests) ... ok
test_fromlist_load_error_propagates (test.test_importlib.import_.test_api.Frozen_OldAPITests) ... ok
test_name_requires_rparition (test.test_importlib.import_.test_api.Frozen_OldAPITests) ... ok
test_negative_level (test.test_importlib.import_.test_api.Frozen_OldAPITests) ... ok
test_nonexistent_fromlist_entry (test.test_importlib.import_.test_api.Frozen_OldAPITests) ... ok
test_raises_ModuleNotFoundError (test.test_importlib.import_.test_api.Frozen_OldAPITests) ... ok
test_blocked_fromlist (test.test_importlib.import_.test_api.Frozen_SpecAPITests) ... ok
test_fromlist_load_error_propagates (test.test_importlib.import_.test_api.Frozen_SpecAPITests) ... ok
test_name_requires_rparition (test.test_importlib.import_.test_api.Frozen_SpecAPITests) ... ok
test_negative_level (test.test_importlib.import_.test_api.Frozen_SpecAPITests) ... ok
test_nonexistent_fromlist_entry (test.test_importlib.import_.test_api.Frozen_SpecAPITests) ... ok
test_raises_ModuleNotFoundError (test.test_importlib.import_.test_api.Frozen_SpecAPITests) ... ok
test_blocked_fromlist (test.test_importlib.import_.test_api.Source_OldAPITests) ... ok
test_fromlist_load_error_propagates (test.test_importlib.import_.test_api.Source_OldAPITests) ... ok
test_name_requires_rparition (test.test_importlib.import_.test_api.Source_OldAPITests) ... ok
test_negative_level (test.test_importlib.import_.test_api.Source_OldAPITests) ... ok
test_nonexistent_fromlist_entry (test.test_importlib.import_.test_api.Source_OldAPITests) ... ok
test_raises_ModuleNotFoundError (test.test_importlib.import_.test_api.Source_OldAPITests) ... ok
test_blocked_fromlist (test.test_importlib.import_.test_api.Source_SpecAPITests) ... ok
test_fromlist_load_error_propagates (test.test_importlib.import_.test_api.Source_SpecAPITests) ... ok
test_name_requires_rparition (test.test_importlib.import_.test_api.Source_SpecAPITests) ... ok
test_negative_level (test.test_importlib.import_.test_api.Source_SpecAPITests) ... ok
test_nonexistent_fromlist_entry (test.test_importlib.import_.test_api.Source_SpecAPITests) ... ok
test_raises_ModuleNotFoundError (test.test_importlib.import_.test_api.Source_SpecAPITests) ... ok
test_None_in_cache (test.test_importlib.import_.test_caching.Frozen_UseCache) ... ok
test_using_cache (test.test_importlib.import_.test_caching.Frozen_UseCache) ... ok
test_None_in_cache (test.test_importlib.import_.test_caching.ImportlibUseCache) ... ok
test_using_cache (test.test_importlib.import_.test_caching.ImportlibUseCache) ... ok
test_using_cache_after_loader (test.test_importlib.import_.test_caching.ImportlibUseCache) ... ok
test_using_cache_for_assigning_to_attribute (test.test_importlib.import_.test_caching.ImportlibUseCache) ... ok
test_using_cache_for_fromlist (test.test_importlib.import_.test_caching.ImportlibUseCache) ... ok
test_None_in_cache (test.test_importlib.import_.test_caching.Source_UseCache) ... ok
test_using_cache (test.test_importlib.import_.test_caching.Source_UseCache) ... ok
test_empty_string (test.test_importlib.import_.test_fromlist.Frozen_HandlingFromlist) ... ok
test_fromlist_as_tuple (test.test_importlib.import_.test_fromlist.Frozen_HandlingFromlist) ... ok
test_invalid_type (test.test_importlib.import_.test_fromlist.Frozen_HandlingFromlist) ... ok
test_invalid_type_in_all (test.test_importlib.import_.test_fromlist.Frozen_HandlingFromlist) ... ok
test_module_from_package (test.test_importlib.import_.test_fromlist.Frozen_HandlingFromlist) ... ok
test_module_from_package_triggers_ModuleNotFoundError (test.test_importlib.import_.test_fromlist.Frozen_HandlingFromlist) ... ok
test_nonexistent_from_package (test.test_importlib.import_.test_fromlist.Frozen_HandlingFromlist) ... ok
test_nonexistent_in_all (test.test_importlib.import_.test_fromlist.Frozen_HandlingFromlist) ... ok
test_nonexistent_object (test.test_importlib.import_.test_fromlist.Frozen_HandlingFromlist) ... ok
test_object (test.test_importlib.import_.test_fromlist.Frozen_HandlingFromlist) ... ok
test_star_in_all (test.test_importlib.import_.test_fromlist.Frozen_HandlingFromlist) ... ok
test_star_with_others (test.test_importlib.import_.test_fromlist.Frozen_HandlingFromlist) ... ok
test_using_star (test.test_importlib.import_.test_fromlist.Frozen_HandlingFromlist) ... ok
test_return_from_from_import (test.test_importlib.import_.test_fromlist.Frozen_ReturnValue) ... ok
test_return_from_import (test.test_importlib.import_.test_fromlist.Frozen_ReturnValue) ... ok
test_empty_string (test.test_importlib.import_.test_fromlist.Source_HandlingFromlist) ... ok
test_fromlist_as_tuple (test.test_importlib.import_.test_fromlist.Source_HandlingFromlist) ... ok
test_invalid_type (test.test_importlib.import_.test_fromlist.Source_HandlingFromlist) ... ok
test_invalid_type_in_all (test.test_importlib.import_.test_fromlist.Source_HandlingFromlist) ... ok
test_module_from_package (test.test_importlib.import_.test_fromlist.Source_HandlingFromlist) ... ok
test_module_from_package_triggers_ModuleNotFoundError (test.test_importlib.import_.test_fromlist.Source_HandlingFromlist) ... ok
test_nonexistent_from_package (test.test_importlib.import_.test_fromlist.Source_HandlingFromlist) ... ok
test_nonexistent_in_all (test.test_importlib.import_.test_fromlist.Source_HandlingFromlist) ... ok
test_nonexistent_object (test.test_importlib.import_.test_fromlist.Source_HandlingFromlist) ... ok
test_object (test.test_importlib.import_.test_fromlist.Source_HandlingFromlist) ... ok
test_star_in_all (test.test_importlib.import_.test_fromlist.Source_HandlingFromlist) ... ok
test_star_with_others (test.test_importlib.import_.test_fromlist.Source_HandlingFromlist) ... ok
test_using_star (test.test_importlib.import_.test_fromlist.Source_HandlingFromlist) ... ok
test_return_from_from_import (test.test_importlib.import_.test_fromlist.Source_ReturnValue) ... ok
test_return_from_import (test.test_importlib.import_.test_fromlist.Source_ReturnValue) ... ok
test_no_path (test.test_importlib.import_.test_meta_path.Frozen_CallSignaturePEP302) ... ok
test_with_path (test.test_importlib.import_.test_meta_path.Frozen_CallSignaturePEP302) ... ok
test_no_path (test.test_importlib.import_.test_meta_path.Frozen_CallSignaturePEP451) ... ok
test_with_path (test.test_importlib.import_.test_meta_path.Frozen_CallSignaturePEP451) ... ok
test_continuing (test.test_importlib.import_.test_meta_path.Frozen_CallingOrder) ... ok
test_empty (test.test_importlib.import_.test_meta_path.Frozen_CallingOrder) ... ok
test_first_called (test.test_importlib.import_.test_meta_path.Frozen_CallingOrder) ... ok
test_no_path (test.test_importlib.import_.test_meta_path.Source_CallSignaturePEP302) ... ok
test_with_path (test.test_importlib.import_.test_meta_path.Source_CallSignaturePEP302) ... ok
test_no_path (test.test_importlib.import_.test_meta_path.Source_CallSignaturePEP451) ... ok
test_with_path (test.test_importlib.import_.test_meta_path.Source_CallSignaturePEP451) ... ok
test_continuing (test.test_importlib.import_.test_meta_path.Source_CallingOrder) ... ok
test_empty (test.test_importlib.import_.test_meta_path.Source_CallingOrder) ... ok
test_first_called (test.test_importlib.import_.test_meta_path.Source_CallingOrder) ... ok
test_bad_parent (test.test_importlib.import_.test_packages.Frozen_ParentModuleTests) ... ok
test_import_parent (test.test_importlib.import_.test_packages.Frozen_ParentModuleTests) ... ok
test_module_not_package (test.test_importlib.import_.test_packages.Frozen_ParentModuleTests) ... ok
test_module_not_package_but_side_effects (test.test_importlib.import_.test_packages.Frozen_ParentModuleTests) ... ok
test_raising_parent_after_double_relative_importing_child (test.test_importlib.import_.test_packages.Frozen_ParentModuleTests) ... ok
test_raising_parent_after_importing_child (test.test_importlib.import_.test_packages.Frozen_ParentModuleTests) ... ok
test_raising_parent_after_relative_importing_child (test.test_importlib.import_.test_packages.Frozen_ParentModuleTests) ... ok
test_bad_parent (test.test_importlib.import_.test_packages.Source_ParentModuleTests) ... ok
test_import_parent (test.test_importlib.import_.test_packages.Source_ParentModuleTests) ... ok
test_module_not_package (test.test_importlib.import_.test_packages.Source_ParentModuleTests) ... ok
test_module_not_package_but_side_effects (test.test_importlib.import_.test_packages.Source_ParentModuleTests) ... ok
test_raising_parent_after_double_relative_importing_child (test.test_importlib.import_.test_packages.Source_ParentModuleTests) ... ok
test_raising_parent_after_importing_child (test.test_importlib.import_.test_packages.Source_ParentModuleTests) ... ok
test_raising_parent_after_relative_importing_child (test.test_importlib.import_.test_packages.Source_ParentModuleTests) ... ok
test_None_on_sys_path (test.test_importlib.import_.test_path.Frozen_FindModuleTests) ... ok
test_deleted_cwd (test.test_importlib.import_.test_path.Frozen_FindModuleTests) ... ok
test_empty_list (test.test_importlib.import_.test_path.Frozen_FindModuleTests) ... ok
test_empty_path_hooks (test.test_importlib.import_.test_path.Frozen_FindModuleTests) ... ok
test_failure (test.test_importlib.import_.test_path.Frozen_FindModuleTests) ... ok
test_finder_with_find_loader (test.test_importlib.import_.test_path.Frozen_FindModuleTests) ... ok
test_finder_with_find_module (test.test_importlib.import_.test_path.Frozen_FindModuleTests) ... ok
test_finder_with_find_spec (test.test_importlib.import_.test_path.Frozen_FindModuleTests) ... ok
test_invalidate_caches_clear_out_None (test.test_importlib.import_.test_path.Frozen_FindModuleTests) ... ok
test_invalidate_caches_finders (test.test_importlib.import_.test_path.Frozen_FindModuleTests) ... ok
test_path (test.test_importlib.import_.test_path.Frozen_FindModuleTests) ... ok
test_path_hooks (test.test_importlib.import_.test_path.Frozen_FindModuleTests) ... ok
test_path_importer_cache_empty_string (test.test_importlib.import_.test_path.Frozen_FindModuleTests) ... ok
test_sys_path (test.test_importlib.import_.test_path.Frozen_FindModuleTests) ... ok
test_None_on_sys_path (test.test_importlib.import_.test_path.Frozen_FindSpecTests) ... ok
test_deleted_cwd (test.test_importlib.import_.test_path.Frozen_FindSpecTests) ... ok
test_empty_list (test.test_importlib.import_.test_path.Frozen_FindSpecTests) ... ok
test_empty_path_hooks (test.test_importlib.import_.test_path.Frozen_FindSpecTests) ... ok
test_failure (test.test_importlib.import_.test_path.Frozen_FindSpecTests) ... ok
test_finder_with_find_loader (test.test_importlib.import_.test_path.Frozen_FindSpecTests) ... ok
test_finder_with_find_module (test.test_importlib.import_.test_path.Frozen_FindSpecTests) ... ok
test_finder_with_find_spec (test.test_importlib.import_.test_path.Frozen_FindSpecTests) ... ok
test_invalidate_caches_clear_out_None (test.test_importlib.import_.test_path.Frozen_FindSpecTests) ... ok
test_invalidate_caches_finders (test.test_importlib.import_.test_path.Frozen_FindSpecTests) ... ok
test_path (test.test_importlib.import_.test_path.Frozen_FindSpecTests) ... ok
test_path_hooks (test.test_importlib.import_.test_path.Frozen_FindSpecTests) ... ok
test_path_importer_cache_empty_string (test.test_importlib.import_.test_path.Frozen_FindSpecTests) ... ok
test_sys_path (test.test_importlib.import_.test_path.Frozen_FindSpecTests) ... ok
test_finder_with_failing_find_module (test.test_importlib.import_.test_path.Frozen_PathEntryFinderTests) ... ok
test_finder_with_failing_find_spec (test.test_importlib.import_.test_path.Frozen_PathEntryFinderTests) ... ok
test_None_on_sys_path (test.test_importlib.import_.test_path.Source_FindModuleTests) ... ok
test_deleted_cwd (test.test_importlib.import_.test_path.Source_FindModuleTests) ... ok
test_empty_list (test.test_importlib.import_.test_path.Source_FindModuleTests) ... ok
test_empty_path_hooks (test.test_importlib.import_.test_path.Source_FindModuleTests) ... ok
test_failure (test.test_importlib.import_.test_path.Source_FindModuleTests) ... ok
test_finder_with_find_loader (test.test_importlib.import_.test_path.Source_FindModuleTests) ... ok
test_finder_with_find_module (test.test_importlib.import_.test_path.Source_FindModuleTests) ... ok
test_finder_with_find_spec (test.test_importlib.import_.test_path.Source_FindModuleTests) ... ok
test_invalidate_caches_clear_out_None (test.test_importlib.import_.test_path.Source_FindModuleTests) ... ok
test_invalidate_caches_finders (test.test_importlib.import_.test_path.Source_FindModuleTests) ... ok
test_path (test.test_importlib.import_.test_path.Source_FindModuleTests) ... ok
test_path_hooks (test.test_importlib.import_.test_path.Source_FindModuleTests) ... ok
test_path_importer_cache_empty_string (test.test_importlib.import_.test_path.Source_FindModuleTests) ... ok
test_sys_path (test.test_importlib.import_.test_path.Source_FindModuleTests) ... ok
test_None_on_sys_path (test.test_importlib.import_.test_path.Source_FindSpecTests) ... ok
test_deleted_cwd (test.test_importlib.import_.test_path.Source_FindSpecTests) ... ok
test_empty_list (test.test_importlib.import_.test_path.Source_FindSpecTests) ... ok
test_empty_path_hooks (test.test_importlib.import_.test_path.Source_FindSpecTests) ... ok
test_failure (test.test_importlib.import_.test_path.Source_FindSpecTests) ... ok
test_finder_with_find_loader (test.test_importlib.import_.test_path.Source_FindSpecTests) ... ok
test_finder_with_find_module (test.test_importlib.import_.test_path.Source_FindSpecTests) ... ok
test_finder_with_find_spec (test.test_importlib.import_.test_path.Source_FindSpecTests) ... ok
test_invalidate_caches_clear_out_None (test.test_importlib.import_.test_path.Source_FindSpecTests) ... ok
test_invalidate_caches_finders (test.test_importlib.import_.test_path.Source_FindSpecTests) ... ok
test_path (test.test_importlib.import_.test_path.Source_FindSpecTests) ... ok
test_path_hooks (test.test_importlib.import_.test_path.Source_FindSpecTests) ... ok
test_path_importer_cache_empty_string (test.test_importlib.import_.test_path.Source_FindSpecTests) ... ok
test_sys_path (test.test_importlib.import_.test_path.Source_FindSpecTests) ... ok
test_finder_with_failing_find_module (test.test_importlib.import_.test_path.Source_PathEntryFinderTests) ... ok
test_finder_with_failing_find_spec (test.test_importlib.import_.test_path.Source_PathEntryFinderTests) ... ok
test_attr_from_module (test.test_importlib.import_.test_relative_imports.Frozen_RelativeImports) ... ok
test_deep_import (test.test_importlib.import_.test_relative_imports.Frozen_RelativeImports) ... ok
test_empty_name_w_level_0 (test.test_importlib.import_.test_relative_imports.Frozen_RelativeImports) ... ok
test_import_from_different_package (test.test_importlib.import_.test_relative_imports.Frozen_RelativeImports) ... ok
test_import_relative_import_no_fromlist (test.test_importlib.import_.test_relative_imports.Frozen_RelativeImports) ... ok
test_module_from_module (test.test_importlib.import_.test_relative_imports.Frozen_RelativeImports) ... ok
test_module_to_package (test.test_importlib.import_.test_relative_imports.Frozen_RelativeImports) ... ok
test_package_to_module (test.test_importlib.import_.test_relative_imports.Frozen_RelativeImports) ... ok
test_package_to_package (test.test_importlib.import_.test_relative_imports.Frozen_RelativeImports) ... ok
test_relative_import_no_globals (test.test_importlib.import_.test_relative_imports.Frozen_RelativeImports) ... ok
test_relative_import_no_package (test.test_importlib.import_.test_relative_imports.Frozen_RelativeImports) ... ok
test_relative_import_no_package_exists_absolute (test.test_importlib.import_.test_relative_imports.Frozen_RelativeImports) ... ok
test_too_high_from_module (test.test_importlib.import_.test_relative_imports.Frozen_RelativeImports) ... ok
test_too_high_from_package (test.test_importlib.import_.test_relative_imports.Frozen_RelativeImports) ... ok
test_attr_from_module (test.test_importlib.import_.test_relative_imports.Source_RelativeImports) ... ok
test_deep_import (test.test_importlib.import_.test_relative_imports.Source_RelativeImports) ... ok
test_empty_name_w_level_0 (test.test_importlib.import_.test_relative_imports.Source_RelativeImports) ... ok
test_import_from_different_package (test.test_importlib.import_.test_relative_imports.Source_RelativeImports) ... ok
test_import_relative_import_no_fromlist (test.test_importlib.import_.test_relative_imports.Source_RelativeImports) ... ok
test_module_from_module (test.test_importlib.import_.test_relative_imports.Source_RelativeImports) ... ok
test_module_to_package (test.test_importlib.import_.test_relative_imports.Source_RelativeImports) ... ok
test_package_to_module (test.test_importlib.import_.test_relative_imports.Source_RelativeImports) ... ok
test_package_to_package (test.test_importlib.import_.test_relative_imports.Source_RelativeImports) ... ok
test_relative_import_no_globals (test.test_importlib.import_.test_relative_imports.Source_RelativeImports) ... ok
test_relative_import_no_package (test.test_importlib.import_.test_relative_imports.Source_RelativeImports) ... ok
test_relative_import_no_package_exists_absolute (test.test_importlib.import_.test_relative_imports.Source_RelativeImports) ... ok
test_too_high_from_module (test.test_importlib.import_.test_relative_imports.Source_RelativeImports) ... ok
test_too_high_from_package (test.test_importlib.import_.test_relative_imports.Source_RelativeImports) ... ok
test_insensitive (test.test_importlib.source.test_case_sensitivity.Frozen_CaseSensitivityTestPEP302) ... skipped 'ignore_environment flag was set'
test_sensitive (test.test_importlib.source.test_case_sensitivity.Frozen_CaseSensitivityTestPEP302) ... skipped 'ignore_environment flag was set'
test_insensitive (test.test_importlib.source.test_case_sensitivity.Frozen_CaseSensitivityTestPEP451) ... skipped 'ignore_environment flag was set'
test_sensitive (test.test_importlib.source.test_case_sensitivity.Frozen_CaseSensitivityTestPEP451) ... skipped 'ignore_environment flag was set'
test_insensitive (test.test_importlib.source.test_case_sensitivity.Source_CaseSensitivityTestPEP302) ... skipped 'ignore_environment flag was set'
test_sensitive (test.test_importlib.source.test_case_sensitivity.Source_CaseSensitivityTestPEP302) ... skipped 'ignore_environment flag was set'
test_insensitive (test.test_importlib.source.test_case_sensitivity.Source_CaseSensitivityTestPEP451) ... skipped 'ignore_environment flag was set'
test_sensitive (test.test_importlib.source.test_case_sensitivity.Source_CaseSensitivityTestPEP451) ... skipped 'ignore_environment flag was set'
test_bad_syntax (test.test_importlib.source.test_file_loader.Frozen_SimpleTest) ... ok
test_checked_hash_based_pyc (test.test_importlib.source.test_file_loader.Frozen_SimpleTest) ... ok
test_equality (test.test_importlib.source.test_file_loader.Frozen_SimpleTest) ... ok
test_file_from_empty_string_dir (test.test_importlib.source.test_file_loader.Frozen_SimpleTest) ... ok
test_get_filename_API (test.test_importlib.source.test_file_loader.Frozen_SimpleTest) ... ok
test_inequality (test.test_importlib.source.test_file_loader.Frozen_SimpleTest) ... ok
test_lacking_parent (test.test_importlib.source.test_file_loader.Frozen_SimpleTest) ... ok
test_load_module_API (test.test_importlib.source.test_file_loader.Frozen_SimpleTest) ... ok
test_module (test.test_importlib.source.test_file_loader.Frozen_SimpleTest) ... ok
test_module_reuse (test.test_importlib.source.test_file_loader.Frozen_SimpleTest) ... ok
test_overridden_checked_hash_based_pyc (test.test_importlib.source.test_file_loader.Frozen_SimpleTest) ... ok
test_overridden_unchecked_hash_based_pyc (test.test_importlib.source.test_file_loader.Frozen_SimpleTest) ... ok
test_package (test.test_importlib.source.test_file_loader.Frozen_SimpleTest) ... ok
test_state_after_failure (test.test_importlib.source.test_file_loader.Frozen_SimpleTest) ... ok
test_timestamp_overflow (test.test_importlib.source.test_file_loader.Frozen_SimpleTest) ... ok
test_unchecked_hash_based_pyc (test.test_importlib.source.test_file_loader.Frozen_SimpleTest) ... ok
test_unloadable (test.test_importlib.source.test_file_loader.Frozen_SimpleTest) ... ok
test_bad_magic (test.test_importlib.source.test_file_loader.Frozen_SourceLoaderBadBytecodeTestPEP302) ... ok
test_bad_marshal (test.test_importlib.source.test_file_loader.Frozen_SourceLoaderBadBytecodeTestPEP302) ... ok
test_empty_file (test.test_importlib.source.test_file_loader.Frozen_SourceLoaderBadBytecodeTestPEP302) ... ok
test_magic_only (test.test_importlib.source.test_file_loader.Frozen_SourceLoaderBadBytecodeTestPEP302) ... ok
test_no_marshal (test.test_importlib.source.test_file_loader.Frozen_SourceLoaderBadBytecodeTestPEP302) ... ok
test_non_code_marshal (test.test_importlib.source.test_file_loader.Frozen_SourceLoaderBadBytecodeTestPEP302) ... ok
test_old_timestamp (test.test_importlib.source.test_file_loader.Frozen_SourceLoaderBadBytecodeTestPEP302) ... ok
test_partial_flags (test.test_importlib.source.test_file_loader.Frozen_SourceLoaderBadBytecodeTestPEP302) ... ok
test_partial_hash (test.test_importlib.source.test_file_loader.Frozen_SourceLoaderBadBytecodeTestPEP302) ... ok
test_partial_magic (test.test_importlib.source.test_file_loader.Frozen_SourceLoaderBadBytecodeTestPEP302) ... ok
test_partial_size (test.test_importlib.source.test_file_loader.Frozen_SourceLoaderBadBytecodeTestPEP302) ... ok
test_partial_timestamp (test.test_importlib.source.test_file_loader.Frozen_SourceLoaderBadBytecodeTestPEP302) ... ok
test_read_only_bytecode (test.test_importlib.source.test_file_loader.Frozen_SourceLoaderBadBytecodeTestPEP302) ... ok
test_bad_magic (test.test_importlib.source.test_file_loader.Frozen_SourceLoaderBadBytecodeTestPEP451) ... ok
test_bad_marshal (test.test_importlib.source.test_file_loader.Frozen_SourceLoaderBadBytecodeTestPEP451) ... ok
test_empty_file (test.test_importlib.source.test_file_loader.Frozen_SourceLoaderBadBytecodeTestPEP451) ... ok
test_magic_only (test.test_importlib.source.test_file_loader.Frozen_SourceLoaderBadBytecodeTestPEP451) ... ok
test_no_marshal (test.test_importlib.source.test_file_loader.Frozen_SourceLoaderBadBytecodeTestPEP451) ... ok
test_non_code_marshal (test.test_importlib.source.test_file_loader.Frozen_SourceLoaderBadBytecodeTestPEP451) ... ok
test_old_timestamp (test.test_importlib.source.test_file_loader.Frozen_SourceLoaderBadBytecodeTestPEP451) ... ok
test_partial_flags (test.test_importlib.source.test_file_loader.Frozen_SourceLoaderBadBytecodeTestPEP451) ... ok
test_partial_hash (test.test_importlib.source.test_file_loader.Frozen_SourceLoaderBadBytecodeTestPEP451) ... ok
test_partial_magic (test.test_importlib.source.test_file_loader.Frozen_SourceLoaderBadBytecodeTestPEP451) ... ok
test_partial_size (test.test_importlib.source.test_file_loader.Frozen_SourceLoaderBadBytecodeTestPEP451) ... ok
test_partial_timestamp (test.test_importlib.source.test_file_loader.Frozen_SourceLoaderBadBytecodeTestPEP451) ... ok
test_read_only_bytecode (test.test_importlib.source.test_file_loader.Frozen_SourceLoaderBadBytecodeTestPEP451) ... ok
test_bad_magic (test.test_importlib.source.test_file_loader.Frozen_SourcelessLoaderBadBytecodeTestPEP302) ... ok
test_empty_file (test.test_importlib.source.test_file_loader.Frozen_SourcelessLoaderBadBytecodeTestPEP302) ... ok
test_magic_only (test.test_importlib.source.test_file_loader.Frozen_SourcelessLoaderBadBytecodeTestPEP302) ... ok
test_no_marshal (test.test_importlib.source.test_file_loader.Frozen_SourcelessLoaderBadBytecodeTestPEP302) ... ok
test_non_code_marshal (test.test_importlib.source.test_file_loader.Frozen_SourcelessLoaderBadBytecodeTestPEP302) ... ok
test_partial_flags (test.test_importlib.source.test_file_loader.Frozen_SourcelessLoaderBadBytecodeTestPEP302) ... ok
test_partial_hash (test.test_importlib.source.test_file_loader.Frozen_SourcelessLoaderBadBytecodeTestPEP302) ... ok
test_partial_magic (test.test_importlib.source.test_file_loader.Frozen_SourcelessLoaderBadBytecodeTestPEP302) ... ok
test_partial_size (test.test_importlib.source.test_file_loader.Frozen_SourcelessLoaderBadBytecodeTestPEP302) ... ok
test_partial_timestamp (test.test_importlib.source.test_file_loader.Frozen_SourcelessLoaderBadBytecodeTestPEP302) ... ok
test_bad_magic (test.test_importlib.source.test_file_loader.Frozen_SourcelessLoaderBadBytecodeTestPEP451) ... ok
test_empty_file (test.test_importlib.source.test_file_loader.Frozen_SourcelessLoaderBadBytecodeTestPEP451) ... ok
test_magic_only (test.test_importlib.source.test_file_loader.Frozen_SourcelessLoaderBadBytecodeTestPEP451) ... ok
test_no_marshal (test.test_importlib.source.test_file_loader.Frozen_SourcelessLoaderBadBytecodeTestPEP451) ... ok
test_non_code_marshal (test.test_importlib.source.test_file_loader.Frozen_SourcelessLoaderBadBytecodeTestPEP451) ... ok
test_partial_flags (test.test_importlib.source.test_file_loader.Frozen_SourcelessLoaderBadBytecodeTestPEP451) ... ok
test_partial_hash (test.test_importlib.source.test_file_loader.Frozen_SourcelessLoaderBadBytecodeTestPEP451) ... ok
test_partial_magic (test.test_importlib.source.test_file_loader.Frozen_SourcelessLoaderBadBytecodeTestPEP451) ... ok
test_partial_size (test.test_importlib.source.test_file_loader.Frozen_SourcelessLoaderBadBytecodeTestPEP451) ... ok
test_partial_timestamp (test.test_importlib.source.test_file_loader.Frozen_SourcelessLoaderBadBytecodeTestPEP451) ... ok
test_bad_syntax (test.test_importlib.source.test_file_loader.SourceDateEpoch_SimpleTest) ... ok
test_checked_hash_based_pyc (test.test_importlib.source.test_file_loader.SourceDateEpoch_SimpleTest) ... ok
test_equality (test.test_importlib.source.test_file_loader.SourceDateEpoch_SimpleTest) ... ok
test_file_from_empty_string_dir (test.test_importlib.source.test_file_loader.SourceDateEpoch_SimpleTest) ... ok
test_get_filename_API (test.test_importlib.source.test_file_loader.SourceDateEpoch_SimpleTest) ... ok
test_inequality (test.test_importlib.source.test_file_loader.SourceDateEpoch_SimpleTest) ... ok
test_lacking_parent (test.test_importlib.source.test_file_loader.SourceDateEpoch_SimpleTest) ... ok
test_load_module_API (test.test_importlib.source.test_file_loader.SourceDateEpoch_SimpleTest) ... ok
test_module (test.test_importlib.source.test_file_loader.SourceDateEpoch_SimpleTest) ... ok
test_module_reuse (test.test_importlib.source.test_file_loader.SourceDateEpoch_SimpleTest) ... ok
test_overridden_checked_hash_based_pyc (test.test_importlib.source.test_file_loader.SourceDateEpoch_SimpleTest) ... ok
test_overridden_unchecked_hash_based_pyc (test.test_importlib.source.test_file_loader.SourceDateEpoch_SimpleTest) ... ok
test_package (test.test_importlib.source.test_file_loader.SourceDateEpoch_SimpleTest) ... ok
test_state_after_failure (test.test_importlib.source.test_file_loader.SourceDateEpoch_SimpleTest) ... ok
test_timestamp_overflow (test.test_importlib.source.test_file_loader.SourceDateEpoch_SimpleTest) ... ok
test_unchecked_hash_based_pyc (test.test_importlib.source.test_file_loader.SourceDateEpoch_SimpleTest) ... ok
test_unloadable (test.test_importlib.source.test_file_loader.SourceDateEpoch_SimpleTest) ... ok
test_bad_syntax (test.test_importlib.source.test_file_loader.Source_SimpleTest) ... ok
test_checked_hash_based_pyc (test.test_importlib.source.test_file_loader.Source_SimpleTest) ... ok
test_equality (test.test_importlib.source.test_file_loader.Source_SimpleTest) ... ok
test_file_from_empty_string_dir (test.test_importlib.source.test_file_loader.Source_SimpleTest) ... ok
test_get_filename_API (test.test_importlib.source.test_file_loader.Source_SimpleTest) ... ok
test_inequality (test.test_importlib.source.test_file_loader.Source_SimpleTest) ... ok
test_lacking_parent (test.test_importlib.source.test_file_loader.Source_SimpleTest) ... ok
test_load_module_API (test.test_importlib.source.test_file_loader.Source_SimpleTest) ... ok
test_module (test.test_importlib.source.test_file_loader.Source_SimpleTest) ... ok
test_module_reuse (test.test_importlib.source.test_file_loader.Source_SimpleTest) ... ok
test_overridden_checked_hash_based_pyc (test.test_importlib.source.test_file_loader.Source_SimpleTest) ... ok
test_overridden_unchecked_hash_based_pyc (test.test_importlib.source.test_file_loader.Source_SimpleTest) ... ok
test_package (test.test_importlib.source.test_file_loader.Source_SimpleTest) ... ok
test_state_after_failure (test.test_importlib.source.test_file_loader.Source_SimpleTest) ... ok
test_timestamp_overflow (test.test_importlib.source.test_file_loader.Source_SimpleTest) ... ok
test_unchecked_hash_based_pyc (test.test_importlib.source.test_file_loader.Source_SimpleTest) ... ok
test_unloadable (test.test_importlib.source.test_file_loader.Source_SimpleTest) ... ok
test_bad_magic (test.test_importlib.source.test_file_loader.Source_SourceLoaderBadBytecodeTestPEP302) ... ok
test_bad_marshal (test.test_importlib.source.test_file_loader.Source_SourceLoaderBadBytecodeTestPEP302) ... ok
test_empty_file (test.test_importlib.source.test_file_loader.Source_SourceLoaderBadBytecodeTestPEP302) ... ok
test_magic_only (test.test_importlib.source.test_file_loader.Source_SourceLoaderBadBytecodeTestPEP302) ... ok
test_no_marshal (test.test_importlib.source.test_file_loader.Source_SourceLoaderBadBytecodeTestPEP302) ... ok
test_non_code_marshal (test.test_importlib.source.test_file_loader.Source_SourceLoaderBadBytecodeTestPEP302) ... ok
test_old_timestamp (test.test_importlib.source.test_file_loader.Source_SourceLoaderBadBytecodeTestPEP302) ... ok
test_partial_flags (test.test_importlib.source.test_file_loader.Source_SourceLoaderBadBytecodeTestPEP302) ... ok
test_partial_hash (test.test_importlib.source.test_file_loader.Source_SourceLoaderBadBytecodeTestPEP302) ... ok
test_partial_magic (test.test_importlib.source.test_file_loader.Source_SourceLoaderBadBytecodeTestPEP302) ... ok
test_partial_size (test.test_importlib.source.test_file_loader.Source_SourceLoaderBadBytecodeTestPEP302) ... ok
test_partial_timestamp (test.test_importlib.source.test_file_loader.Source_SourceLoaderBadBytecodeTestPEP302) ... ok
test_read_only_bytecode (test.test_importlib.source.test_file_loader.Source_SourceLoaderBadBytecodeTestPEP302) ... ok
test_bad_magic (test.test_importlib.source.test_file_loader.Source_SourceLoaderBadBytecodeTestPEP451) ... ok
test_bad_marshal (test.test_importlib.source.test_file_loader.Source_SourceLoaderBadBytecodeTestPEP451) ... ok
test_empty_file (test.test_importlib.source.test_file_loader.Source_SourceLoaderBadBytecodeTestPEP451) ... ok
test_magic_only (test.test_importlib.source.test_file_loader.Source_SourceLoaderBadBytecodeTestPEP451) ... ok
test_no_marshal (test.test_importlib.source.test_file_loader.Source_SourceLoaderBadBytecodeTestPEP451) ... ok
test_non_code_marshal (test.test_importlib.source.test_file_loader.Source_SourceLoaderBadBytecodeTestPEP451) ... ok
test_old_timestamp (test.test_importlib.source.test_file_loader.Source_SourceLoaderBadBytecodeTestPEP451) ... ok
test_partial_flags (test.test_importlib.source.test_file_loader.Source_SourceLoaderBadBytecodeTestPEP451) ... ok
test_partial_hash (test.test_importlib.source.test_file_loader.Source_SourceLoaderBadBytecodeTestPEP451) ... ok
test_partial_magic (test.test_importlib.source.test_file_loader.Source_SourceLoaderBadBytecodeTestPEP451) ... ok
test_partial_size (test.test_importlib.source.test_file_loader.Source_SourceLoaderBadBytecodeTestPEP451) ... ok
test_partial_timestamp (test.test_importlib.source.test_file_loader.Source_SourceLoaderBadBytecodeTestPEP451) ... ok
test_read_only_bytecode (test.test_importlib.source.test_file_loader.Source_SourceLoaderBadBytecodeTestPEP451) ... ok
test_bad_magic (test.test_importlib.source.test_file_loader.Source_SourcelessLoaderBadBytecodeTestPEP302) ... ok
test_empty_file (test.test_importlib.source.test_file_loader.Source_SourcelessLoaderBadBytecodeTestPEP302) ... ok
test_magic_only (test.test_importlib.source.test_file_loader.Source_SourcelessLoaderBadBytecodeTestPEP302) ... ok
test_no_marshal (test.test_importlib.source.test_file_loader.Source_SourcelessLoaderBadBytecodeTestPEP302) ... ok
test_non_code_marshal (test.test_importlib.source.test_file_loader.Source_SourcelessLoaderBadBytecodeTestPEP302) ... ok
test_partial_flags (test.test_importlib.source.test_file_loader.Source_SourcelessLoaderBadBytecodeTestPEP302) ... ok
test_partial_hash (test.test_importlib.source.test_file_loader.Source_SourcelessLoaderBadBytecodeTestPEP302) ... ok
test_partial_magic (test.test_importlib.source.test_file_loader.Source_SourcelessLoaderBadBytecodeTestPEP302) ... ok
test_partial_size (test.test_importlib.source.test_file_loader.Source_SourcelessLoaderBadBytecodeTestPEP302) ... ok
test_partial_timestamp (test.test_importlib.source.test_file_loader.Source_SourcelessLoaderBadBytecodeTestPEP302) ... ok
test_bad_magic (test.test_importlib.source.test_file_loader.Source_SourcelessLoaderBadBytecodeTestPEP451) ... ok
test_empty_file (test.test_importlib.source.test_file_loader.Source_SourcelessLoaderBadBytecodeTestPEP451) ... ok
test_magic_only (test.test_importlib.source.test_file_loader.Source_SourcelessLoaderBadBytecodeTestPEP451) ... ok
test_no_marshal (test.test_importlib.source.test_file_loader.Source_SourcelessLoaderBadBytecodeTestPEP451) ... ok
test_non_code_marshal (test.test_importlib.source.test_file_loader.Source_SourcelessLoaderBadBytecodeTestPEP451) ... ok
test_partial_flags (test.test_importlib.source.test_file_loader.Source_SourcelessLoaderBadBytecodeTestPEP451) ... ok
test_partial_hash (test.test_importlib.source.test_file_loader.Source_SourcelessLoaderBadBytecodeTestPEP451) ... ok
test_partial_magic (test.test_importlib.source.test_file_loader.Source_SourcelessLoaderBadBytecodeTestPEP451) ... ok
test_partial_size (test.test_importlib.source.test_file_loader.Source_SourcelessLoaderBadBytecodeTestPEP451) ... ok
test_partial_timestamp (test.test_importlib.source.test_file_loader.Source_SourcelessLoaderBadBytecodeTestPEP451) ... ok
test_dir_removal_handling (test.test_importlib.source.test_finder.Frozen_FinderTestsPEP302) ... ok
test_empty_string_for_dir (test.test_importlib.source.test_finder.Frozen_FinderTestsPEP302) ... ok
test_failure (test.test_importlib.source.test_finder.Frozen_FinderTestsPEP302) ... ok
test_ignore_file (test.test_importlib.source.test_finder.Frozen_FinderTestsPEP302) ... ok
test_invalidate_caches (test.test_importlib.source.test_finder.Frozen_FinderTestsPEP302) ... ok
test_module (test.test_importlib.source.test_finder.Frozen_FinderTestsPEP302) ... ok
test_module_in_package (test.test_importlib.source.test_finder.Frozen_FinderTestsPEP302) ... ok
test_no_read_directory (test.test_importlib.source.test_finder.Frozen_FinderTestsPEP302) ... ok
test_package (test.test_importlib.source.test_finder.Frozen_FinderTestsPEP302) ... ok
test_package_in_package (test.test_importlib.source.test_finder.Frozen_FinderTestsPEP302) ... ok
test_package_over_module (test.test_importlib.source.test_finder.Frozen_FinderTestsPEP302) ... ok
test_dir_removal_handling (test.test_importlib.source.test_finder.Frozen_FinderTestsPEP420) ... ok
test_empty_string_for_dir (test.test_importlib.source.test_finder.Frozen_FinderTestsPEP420) ... ok
test_failure (test.test_importlib.source.test_finder.Frozen_FinderTestsPEP420) ... ok
test_ignore_file (test.test_importlib.source.test_finder.Frozen_FinderTestsPEP420) ... ok
test_invalidate_caches (test.test_importlib.source.test_finder.Frozen_FinderTestsPEP420) ... ok
test_module (test.test_importlib.source.test_finder.Frozen_FinderTestsPEP420) ... ok
test_module_in_package (test.test_importlib.source.test_finder.Frozen_FinderTestsPEP420) ... ok
test_no_read_directory (test.test_importlib.source.test_finder.Frozen_FinderTestsPEP420) ... ok
test_package (test.test_importlib.source.test_finder.Frozen_FinderTestsPEP420) ... ok
test_package_in_package (test.test_importlib.source.test_finder.Frozen_FinderTestsPEP420) ... ok
test_package_over_module (test.test_importlib.source.test_finder.Frozen_FinderTestsPEP420) ... ok
test_dir_removal_handling (test.test_importlib.source.test_finder.Frozen_FinderTestsPEP451) ... ok
test_empty_string_for_dir (test.test_importlib.source.test_finder.Frozen_FinderTestsPEP451) ... ok
test_failure (test.test_importlib.source.test_finder.Frozen_FinderTestsPEP451) ... ok
test_ignore_file (test.test_importlib.source.test_finder.Frozen_FinderTestsPEP451) ... ok
test_invalidate_caches (test.test_importlib.source.test_finder.Frozen_FinderTestsPEP451) ... ok
test_module (test.test_importlib.source.test_finder.Frozen_FinderTestsPEP451) ... ok
test_module_in_package (test.test_importlib.source.test_finder.Frozen_FinderTestsPEP451) ... ok
test_no_read_directory (test.test_importlib.source.test_finder.Frozen_FinderTestsPEP451) ... ok
test_package (test.test_importlib.source.test_finder.Frozen_FinderTestsPEP451) ... ok
test_package_in_package (test.test_importlib.source.test_finder.Frozen_FinderTestsPEP451) ... ok
test_package_over_module (test.test_importlib.source.test_finder.Frozen_FinderTestsPEP451) ... ok
test_dir_removal_handling (test.test_importlib.source.test_finder.Source_FinderTestsPEP302) ... ok
test_empty_string_for_dir (test.test_importlib.source.test_finder.Source_FinderTestsPEP302) ... ok
test_failure (test.test_importlib.source.test_finder.Source_FinderTestsPEP302) ... ok
test_ignore_file (test.test_importlib.source.test_finder.Source_FinderTestsPEP302) ... ok
test_invalidate_caches (test.test_importlib.source.test_finder.Source_FinderTestsPEP302) ... ok
test_module (test.test_importlib.source.test_finder.Source_FinderTestsPEP302) ... ok
test_module_in_package (test.test_importlib.source.test_finder.Source_FinderTestsPEP302) ... ok
test_no_read_directory (test.test_importlib.source.test_finder.Source_FinderTestsPEP302) ... ok
test_package (test.test_importlib.source.test_finder.Source_FinderTestsPEP302) ... ok
test_package_in_package (test.test_importlib.source.test_finder.Source_FinderTestsPEP302) ... ok
test_package_over_module (test.test_importlib.source.test_finder.Source_FinderTestsPEP302) ... ok
test_dir_removal_handling (test.test_importlib.source.test_finder.Source_FinderTestsPEP420) ... ok
test_empty_string_for_dir (test.test_importlib.source.test_finder.Source_FinderTestsPEP420) ... ok
test_failure (test.test_importlib.source.test_finder.Source_FinderTestsPEP420) ... ok
test_ignore_file (test.test_importlib.source.test_finder.Source_FinderTestsPEP420) ... ok
test_invalidate_caches (test.test_importlib.source.test_finder.Source_FinderTestsPEP420) ... ok
test_module (test.test_importlib.source.test_finder.Source_FinderTestsPEP420) ... ok
test_module_in_package (test.test_importlib.source.test_finder.Source_FinderTestsPEP420) ... ok
test_no_read_directory (test.test_importlib.source.test_finder.Source_FinderTestsPEP420) ... ok
test_package (test.test_importlib.source.test_finder.Source_FinderTestsPEP420) ... ok
test_package_in_package (test.test_importlib.source.test_finder.Source_FinderTestsPEP420) ... ok
test_package_over_module (test.test_importlib.source.test_finder.Source_FinderTestsPEP420) ... ok
test_dir_removal_handling (test.test_importlib.source.test_finder.Source_FinderTestsPEP451) ... ok
test_empty_string_for_dir (test.test_importlib.source.test_finder.Source_FinderTestsPEP451) ... ok
test_failure (test.test_importlib.source.test_finder.Source_FinderTestsPEP451) ... ok
test_ignore_file (test.test_importlib.source.test_finder.Source_FinderTestsPEP451) ... ok
test_invalidate_caches (test.test_importlib.source.test_finder.Source_FinderTestsPEP451) ... ok
test_module (test.test_importlib.source.test_finder.Source_FinderTestsPEP451) ... ok
test_module_in_package (test.test_importlib.source.test_finder.Source_FinderTestsPEP451) ... ok
test_no_read_directory (test.test_importlib.source.test_finder.Source_FinderTestsPEP451) ... ok
test_package (test.test_importlib.source.test_finder.Source_FinderTestsPEP451) ... ok
test_package_in_package (test.test_importlib.source.test_finder.Source_FinderTestsPEP451) ... ok
test_package_over_module (test.test_importlib.source.test_finder.Source_FinderTestsPEP451) ... ok
test_empty_string (test.test_importlib.source.test_path_hook.Frozen_PathHookTest) ... ok
test_empty_string_legacy (test.test_importlib.source.test_path_hook.Frozen_PathHookTest) ... ok
test_success (test.test_importlib.source.test_path_hook.Frozen_PathHookTest) ... ok
test_success_legacy (test.test_importlib.source.test_path_hook.Frozen_PathHookTest) ... ok
test_empty_string (test.test_importlib.source.test_path_hook.Source_PathHookTest) ... ok
test_empty_string_legacy (test.test_importlib.source.test_path_hook.Source_PathHookTest) ... ok
test_success (test.test_importlib.source.test_path_hook.Source_PathHookTest) ... ok
test_success_legacy (test.test_importlib.source.test_path_hook.Source_PathHookTest) ... ok
test_bom (test.test_importlib.source.test_source_encoding.Frozen_EncodingTestPEP302) ... ok
test_bom_and_utf_8 (test.test_importlib.source.test_source_encoding.Frozen_EncodingTestPEP302) ... ok
test_bom_conflict (test.test_importlib.source.test_source_encoding.Frozen_EncodingTestPEP302) ... ok
test_default_encoding (test.test_importlib.source.test_source_encoding.Frozen_EncodingTestPEP302) ... ok
test_encoding_on_first_line (test.test_importlib.source.test_source_encoding.Frozen_EncodingTestPEP302) ... ok
test_encoding_on_second_line (test.test_importlib.source.test_source_encoding.Frozen_EncodingTestPEP302) ... ok
test_non_obvious_encoding (test.test_importlib.source.test_source_encoding.Frozen_EncodingTestPEP302) ... ok
test_bom (test.test_importlib.source.test_source_encoding.Frozen_EncodingTestPEP451) ... ok
test_bom_and_utf_8 (test.test_importlib.source.test_source_encoding.Frozen_EncodingTestPEP451) ... ok
test_bom_conflict (test.test_importlib.source.test_source_encoding.Frozen_EncodingTestPEP451) ... ok
test_default_encoding (test.test_importlib.source.test_source_encoding.Frozen_EncodingTestPEP451) ... ok
test_encoding_on_first_line (test.test_importlib.source.test_source_encoding.Frozen_EncodingTestPEP451) ... ok
test_encoding_on_second_line (test.test_importlib.source.test_source_encoding.Frozen_EncodingTestPEP451) ... ok
test_non_obvious_encoding (test.test_importlib.source.test_source_encoding.Frozen_EncodingTestPEP451) ... ok
test_cr (test.test_importlib.source.test_source_encoding.Frozen_LineEndingTestPEP302) ... ok
test_crlf (test.test_importlib.source.test_source_encoding.Frozen_LineEndingTestPEP302) ... ok
test_lf (test.test_importlib.source.test_source_encoding.Frozen_LineEndingTestPEP302) ... ok
test_cr (test.test_importlib.source.test_source_encoding.Frozen_LineEndingTestPEP451) ... ok
test_crlf (test.test_importlib.source.test_source_encoding.Frozen_LineEndingTestPEP451) ... ok
test_lf (test.test_importlib.source.test_source_encoding.Frozen_LineEndingTestPEP451) ... ok
test_bom (test.test_importlib.source.test_source_encoding.Source_EncodingTestPEP302) ... ok
test_bom_and_utf_8 (test.test_importlib.source.test_source_encoding.Source_EncodingTestPEP302) ... ok
test_bom_conflict (test.test_importlib.source.test_source_encoding.Source_EncodingTestPEP302) ... ok
test_default_encoding (test.test_importlib.source.test_source_encoding.Source_EncodingTestPEP302) ... ok
test_encoding_on_first_line (test.test_importlib.source.test_source_encoding.Source_EncodingTestPEP302) ... ok
test_encoding_on_second_line (test.test_importlib.source.test_source_encoding.Source_EncodingTestPEP302) ... ok
test_non_obvious_encoding (test.test_importlib.source.test_source_encoding.Source_EncodingTestPEP302) ... ok
test_bom (test.test_importlib.source.test_source_encoding.Source_EncodingTestPEP451) ... ok
test_bom_and_utf_8 (test.test_importlib.source.test_source_encoding.Source_EncodingTestPEP451) ... ok
test_bom_conflict (test.test_importlib.source.test_source_encoding.Source_EncodingTestPEP451) ... ok
test_default_encoding (test.test_importlib.source.test_source_encoding.Source_EncodingTestPEP451) ... ok
test_encoding_on_first_line (test.test_importlib.source.test_source_encoding.Source_EncodingTestPEP451) ... ok
test_encoding_on_second_line (test.test_importlib.source.test_source_encoding.Source_EncodingTestPEP451) ... ok
test_non_obvious_encoding (test.test_importlib.source.test_source_encoding.Source_EncodingTestPEP451) ... ok
test_cr (test.test_importlib.source.test_source_encoding.Source_LineEndingTestPEP302) ... ok
test_crlf (test.test_importlib.source.test_source_encoding.Source_LineEndingTestPEP302) ... ok
test_lf (test.test_importlib.source.test_source_encoding.Source_LineEndingTestPEP302) ... ok
test_cr (test.test_importlib.source.test_source_encoding.Source_LineEndingTestPEP451) ... ok
test_crlf (test.test_importlib.source.test_source_encoding.Source_LineEndingTestPEP451) ... ok
test_lf (test.test_importlib.source.test_source_encoding.Source_LineEndingTestPEP451) ... ok
test_get_source (test.test_importlib.test_abc.Frozen_InspectLoaderDefaultsTests) ... ok
test_is_package (test.test_importlib.test_abc.Frozen_InspectLoaderDefaultsTests) ... ok
test_get_code (test.test_importlib.test_abc.Frozen_ExecutionLoaderGetCodeTests) ... ok
test_get_code_no_path (test.test_importlib.test_abc.Frozen_ExecutionLoaderGetCodeTests) ... ok
test_get_code_source_is_None (test.test_importlib.test_abc.Frozen_ExecutionLoaderGetCodeTests) ... ok
test_get_code_source_not_found (test.test_importlib.test_abc.Frozen_ExecutionLoaderGetCodeTests) ... ok
test_subclasses (test.test_importlib.test_abc.Frozen_ExecutionLoader) ... ok
test_superclasses (test.test_importlib.test_abc.Frozen_ExecutionLoader) ... ok
test_subclasses (test.test_importlib.test_abc.Frozen_FileLoader) ... ok
test_superclasses (test.test_importlib.test_abc.Frozen_FileLoader) ... ok
test_get_source (test.test_importlib.test_abc.Frozen_InspectLoaderDefaultsTests) ... ok
test_is_package (test.test_importlib.test_abc.Frozen_InspectLoaderDefaultsTests) ... ok
test_get_code (test.test_importlib.test_abc.Frozen_InspectLoaderGetCodeTests) ... ok
test_get_code_source_is_None (test.test_importlib.test_abc.Frozen_InspectLoaderGetCodeTests) ... ok
test_get_code_source_not_found (test.test_importlib.test_abc.Frozen_InspectLoaderGetCodeTests) ... ok
test_get_code_ImportError (test.test_importlib.test_abc.Frozen_InspectLoaderLoadModuleTests) ... ok
test_get_code_None (test.test_importlib.test_abc.Frozen_InspectLoaderLoadModuleTests) ... ok
test_module_returned (test.test_importlib.test_abc.Frozen_InspectLoaderLoadModuleTests) ... ok
test_source_to_code_bytes (test.test_importlib.test_abc.Frozen_InspectLoaderSourceToCodeTests) ... ok
test_source_to_code_no_path (test.test_importlib.test_abc.Frozen_InspectLoaderSourceToCodeTests) ... ok
test_source_to_code_path (test.test_importlib.test_abc.Frozen_InspectLoaderSourceToCodeTests) ... ok
test_source_to_code_source (test.test_importlib.test_abc.Frozen_InspectLoaderSourceToCodeTests) ... ok
test_subclasses (test.test_importlib.test_abc.Frozen_InspectLoader) ... ok
test_superclasses (test.test_importlib.test_abc.Frozen_InspectLoader) ... ok
test_create_module (test.test_importlib.test_abc.Frozen_LoaderDefaultsTests) ... ok
test_load_module (test.test_importlib.test_abc.Frozen_LoaderDefaultsTests) ... ok
test_module_repr (test.test_importlib.test_abc.Frozen_LoaderDefaultsTests) ... ok
test_fresh (test.test_importlib.test_abc.Frozen_LoaderLoadModuleTests) ... ok
test_reload (test.test_importlib.test_abc.Frozen_LoaderLoadModuleTests) ... ok
test_find_module (test.test_importlib.test_abc.Frozen_MetaPathFinderDefaultsTests) ... ok
test_invalidate_caches (test.test_importlib.test_abc.Frozen_MetaPathFinderDefaultsTests) ... ok
test_find_module (test.test_importlib.test_abc.Frozen_MetaPathFinderFindModuleTests) ... ok
test_find_spec_with_explicit_target (test.test_importlib.test_abc.Frozen_MetaPathFinderFindModuleTests) ... ok
test_no_spec (test.test_importlib.test_abc.Frozen_MetaPathFinderFindModuleTests) ... ok
test_spec (test.test_importlib.test_abc.Frozen_MetaPathFinderFindModuleTests) ... ok
test_subclasses (test.test_importlib.test_abc.Frozen_MetaPathFinder) ... ok
test_superclasses (test.test_importlib.test_abc.Frozen_MetaPathFinder) ... ok
test_find_loader (test.test_importlib.test_abc.Frozen_PathEntryFinderDefaultsTests) ... ok
test_invalidate_caches (test.test_importlib.test_abc.Frozen_PathEntryFinderDefaultsTests) ... ok
test_no_spec (test.test_importlib.test_abc.Frozen_PathEntryFinderFindLoaderTests) ... ok
test_spec_with_loader (test.test_importlib.test_abc.Frozen_PathEntryFinderFindLoaderTests) ... ok
test_spec_with_portions (test.test_importlib.test_abc.Frozen_PathEntryFinderFindLoaderTests) ... ok
test_subclasses (test.test_importlib.test_abc.Frozen_PathEntryFinder) ... ok
test_superclasses (test.test_importlib.test_abc.Frozen_PathEntryFinder) ... ok
test_get_data (test.test_importlib.test_abc.Frozen_ResourceLoaderDefaultsTests) ... ok
test_contents (test.test_importlib.test_abc.Frozen_ResourceReaderDefaultsTests) ... ERROR
test_is_resource (test.test_importlib.test_abc.Frozen_ResourceReaderDefaultsTests) ... ok
test_open_resource (test.test_importlib.test_abc.Frozen_ResourceReaderDefaultsTests) ... ok
test_resource_path (test.test_importlib.test_abc.Frozen_ResourceReaderDefaultsTests) ... ok
test_subclasses (test.test_importlib.test_abc.Frozen_ResourceLoader) ... ok
test_superclasses (test.test_importlib.test_abc.Frozen_ResourceLoader) ... ok
test_code_bad_magic (test.test_importlib.test_abc.Frozen_SourceLoaderBytecodeTests) ... ok
test_code_bad_timestamp (test.test_importlib.test_abc.Frozen_SourceLoaderBytecodeTests) ... ok
test_code_with_everything (test.test_importlib.test_abc.Frozen_SourceLoaderBytecodeTests) ... ok
test_dont_write_bytecode (test.test_importlib.test_abc.Frozen_SourceLoaderBytecodeTests) ... ok
test_no_bytecode (test.test_importlib.test_abc.Frozen_SourceLoaderBytecodeTests) ... ok
test_no_set_data (test.test_importlib.test_abc.Frozen_SourceLoaderBytecodeTests) ... ok
test_set_data_raises_exceptions (test.test_importlib.test_abc.Frozen_SourceLoaderBytecodeTests) ... ok
test_subclasses (test.test_importlib.test_abc.Frozen_SourceLoader) ... ok
test_superclasses (test.test_importlib.test_abc.Frozen_SourceLoader) ... ok
test_decoded_source (test.test_importlib.test_abc.Frozen_SourceLoaderGetSourceTests) ... ok
test_default_encoding (test.test_importlib.test_abc.Frozen_SourceLoaderGetSourceTests) ... ok
test_universal_newlines (test.test_importlib.test_abc.Frozen_SourceLoaderGetSourceTests) ... ok
test_get_code (test.test_importlib.test_abc.Frozen_SourceOnlyLoaderTests) ... ok
test_get_source (test.test_importlib.test_abc.Frozen_SourceOnlyLoaderTests) ... ok
test_get_source_encoding (test.test_importlib.test_abc.Frozen_SourceOnlyLoaderTests) ... ok
test_is_package (test.test_importlib.test_abc.Frozen_SourceOnlyLoaderTests) ... ok
test_load_module (test.test_importlib.test_abc.Frozen_SourceOnlyLoaderTests) ... ok
test_package_settings (test.test_importlib.test_abc.Frozen_SourceOnlyLoaderTests) ... ok
test_source_to_code (test.test_importlib.test_abc.Frozen_SourceOnlyLoaderTests) ... ok
test_create_module (test.test_importlib.test_abc.Source_LoaderDefaultsTests) ... ok
test_load_module (test.test_importlib.test_abc.Source_LoaderDefaultsTests) ... ok
test_module_repr (test.test_importlib.test_abc.Source_LoaderDefaultsTests) ... ok
test_code_bad_magic (test.test_importlib.test_abc.Source_SourceLoaderBytecodeTests) ... ok
test_code_bad_timestamp (test.test_importlib.test_abc.Source_SourceLoaderBytecodeTests) ... ok
test_code_with_everything (test.test_importlib.test_abc.Source_SourceLoaderBytecodeTests) ... ok
test_dont_write_bytecode (test.test_importlib.test_abc.Source_SourceLoaderBytecodeTests) ... ok
test_no_bytecode (test.test_importlib.test_abc.Source_SourceLoaderBytecodeTests) ... ok
test_no_set_data (test.test_importlib.test_abc.Source_SourceLoaderBytecodeTests) ... ok
test_set_data_raises_exceptions (test.test_importlib.test_abc.Source_SourceLoaderBytecodeTests) ... ok
test_get_source (test.test_importlib.test_abc.Source_InspectLoaderDefaultsTests) ... ok
test_is_package (test.test_importlib.test_abc.Source_InspectLoaderDefaultsTests) ... ok
test_get_code (test.test_importlib.test_abc.Source_ExecutionLoaderGetCodeTests) ... ok
test_get_code_no_path (test.test_importlib.test_abc.Source_ExecutionLoaderGetCodeTests) ... ok
test_get_code_source_is_None (test.test_importlib.test_abc.Source_ExecutionLoaderGetCodeTests) ... ok
test_get_code_source_not_found (test.test_importlib.test_abc.Source_ExecutionLoaderGetCodeTests) ... ok
test_subclasses (test.test_importlib.test_abc.Source_ExecutionLoader) ... ok
test_superclasses (test.test_importlib.test_abc.Source_ExecutionLoader) ... ok
test_subclasses (test.test_importlib.test_abc.Source_FileLoader) ... ok
test_superclasses (test.test_importlib.test_abc.Source_FileLoader) ... ok
test_get_source (test.test_importlib.test_abc.Source_InspectLoaderDefaultsTests) ... ok
test_is_package (test.test_importlib.test_abc.Source_InspectLoaderDefaultsTests) ... ok
test_get_code (test.test_importlib.test_abc.Source_InspectLoaderGetCodeTests) ... ok
test_get_code_source_is_None (test.test_importlib.test_abc.Source_InspectLoaderGetCodeTests) ... ok
test_get_code_source_not_found (test.test_importlib.test_abc.Source_InspectLoaderGetCodeTests) ... ok
test_get_code_ImportError (test.test_importlib.test_abc.Source_InspectLoaderLoadModuleTests) ... ok
test_get_code_None (test.test_importlib.test_abc.Source_InspectLoaderLoadModuleTests) ... ok
test_module_returned (test.test_importlib.test_abc.Source_InspectLoaderLoadModuleTests) ... ok
test_source_to_code_bytes (test.test_importlib.test_abc.Source_InspectLoaderSourceToCodeTests) ... ok
test_source_to_code_no_path (test.test_importlib.test_abc.Source_InspectLoaderSourceToCodeTests) ... ok
test_source_to_code_path (test.test_importlib.test_abc.Source_InspectLoaderSourceToCodeTests) ... ok
test_source_to_code_source (test.test_importlib.test_abc.Source_InspectLoaderSourceToCodeTests) ... ok
test_subclasses (test.test_importlib.test_abc.Source_InspectLoader) ... ok
test_superclasses (test.test_importlib.test_abc.Source_InspectLoader) ... ok
test_fresh (test.test_importlib.test_abc.Source_LoaderLoadModuleTests) ... ok
test_reload (test.test_importlib.test_abc.Source_LoaderLoadModuleTests) ... ok
test_find_module (test.test_importlib.test_abc.Source_MetaPathFinderDefaultsTests) ... ok
test_invalidate_caches (test.test_importlib.test_abc.Source_MetaPathFinderDefaultsTests) ... ok
test_find_module (test.test_importlib.test_abc.Source_MetaPathFinderFindModuleTests) ... ok
test_find_spec_with_explicit_target (test.test_importlib.test_abc.Source_MetaPathFinderFindModuleTests) ... ok
test_no_spec (test.test_importlib.test_abc.Source_MetaPathFinderFindModuleTests) ... ok
test_spec (test.test_importlib.test_abc.Source_MetaPathFinderFindModuleTests) ... ok
test_subclasses (test.test_importlib.test_abc.Source_MetaPathFinder) ... ok
test_superclasses (test.test_importlib.test_abc.Source_MetaPathFinder) ... ok
test_find_loader (test.test_importlib.test_abc.Source_PathEntryFinderDefaultsTests) ... ok
test_invalidate_caches (test.test_importlib.test_abc.Source_PathEntryFinderDefaultsTests) ... ok
test_no_spec (test.test_importlib.test_abc.Source_PathEntryFinderFindLoaderTests) ... ok
test_spec_with_loader (test.test_importlib.test_abc.Source_PathEntryFinderFindLoaderTests) ... ok
test_spec_with_portions (test.test_importlib.test_abc.Source_PathEntryFinderFindLoaderTests) ... ok
test_subclasses (test.test_importlib.test_abc.Source_PathEntryFinder) ... ok
test_superclasses (test.test_importlib.test_abc.Source_PathEntryFinder) ... ok
test_get_data (test.test_importlib.test_abc.Source_ResourceLoaderDefaultsTests) ... ok
test_contents (test.test_importlib.test_abc.Source_ResourceReaderDefaultsTests) ... ERROR
test_is_resource (test.test_importlib.test_abc.Source_ResourceReaderDefaultsTests) ... ok
test_open_resource (test.test_importlib.test_abc.Source_ResourceReaderDefaultsTests) ... ok
test_resource_path (test.test_importlib.test_abc.Source_ResourceReaderDefaultsTests) ... ok
test_subclasses (test.test_importlib.test_abc.Source_ResourceLoader) ... ok
test_superclasses (test.test_importlib.test_abc.Source_ResourceLoader) ... ok
test_subclasses (test.test_importlib.test_abc.Source_SourceLoader) ... ok
test_superclasses (test.test_importlib.test_abc.Source_SourceLoader) ... ok
test_decoded_source (test.test_importlib.test_abc.Source_SourceLoaderGetSourceTests) ... ok
test_default_encoding (test.test_importlib.test_abc.Source_SourceLoaderGetSourceTests) ... ok
test_universal_newlines (test.test_importlib.test_abc.Source_SourceLoaderGetSourceTests) ... ok
test_get_code (test.test_importlib.test_abc.Source_SourceOnlyLoaderTests) ... ok
test_get_source (test.test_importlib.test_abc.Source_SourceOnlyLoaderTests) ... ok
test_get_source_encoding (test.test_importlib.test_abc.Source_SourceOnlyLoaderTests) ... ok
test_is_package (test.test_importlib.test_abc.Source_SourceOnlyLoaderTests) ... ok
test_load_module (test.test_importlib.test_abc.Source_SourceOnlyLoaderTests) ... ok
test_package_settings (test.test_importlib.test_abc.Source_SourceOnlyLoaderTests) ... ok
test_source_to_code (test.test_importlib.test_abc.Source_SourceOnlyLoaderTests) ... ok
test_no_frozen_importlib (test.test_importlib.test_api.FrozenImportlibTests) ... ok
test_nothing (test.test_importlib.test_api.Frozen_FindLoaderPEP302Tests) ... ok
test_success (test.test_importlib.test_api.Frozen_FindLoaderPEP302Tests) ... ok
test_success_path (test.test_importlib.test_api.Frozen_FindLoaderPEP302Tests) ... ok
test_sys_modules (test.test_importlib.test_api.Frozen_FindLoaderPEP302Tests) ... ok
test_sys_modules_loader_is_None (test.test_importlib.test_api.Frozen_FindLoaderPEP302Tests) ... ok
test_sys_modules_loader_is_not_set (test.test_importlib.test_api.Frozen_FindLoaderPEP302Tests) ... ok
test_nothing (test.test_importlib.test_api.Frozen_FindLoaderPEP451Tests) ... ok
test_success (test.test_importlib.test_api.Frozen_FindLoaderPEP451Tests) ... ok
test_success_path (test.test_importlib.test_api.Frozen_FindLoaderPEP451Tests) ... ok
test_sys_modules (test.test_importlib.test_api.Frozen_FindLoaderPEP451Tests) ... ok
test_sys_modules_loader_is_None (test.test_importlib.test_api.Frozen_FindLoaderPEP451Tests) ... ok
test_sys_modules_loader_is_not_set (test.test_importlib.test_api.Frozen_FindLoaderPEP451Tests) ... ok
test_absolute_import_with_package (test.test_importlib.test_api.Frozen_ImportModuleTests) ... ok
test_absolute_package_import (test.test_importlib.test_api.Frozen_ImportModuleTests) ... ok
test_deep_relative_package_import (test.test_importlib.test_api.Frozen_ImportModuleTests) ... ok
test_loaded_once (test.test_importlib.test_api.Frozen_ImportModuleTests) ... ok
test_module_import (test.test_importlib.test_api.Frozen_ImportModuleTests) ... ok
test_relative_import_wo_package (test.test_importlib.test_api.Frozen_ImportModuleTests) ... ok
test_shallow_relative_package_import (test.test_importlib.test_api.Frozen_ImportModuleTests) ... ok
test_method_called (test.test_importlib.test_api.Frozen_InvalidateCacheTests) ... ok
test_method_lacking (test.test_importlib.test_api.Frozen_InvalidateCacheTests) ... ok
test_module_missing_spec (test.test_importlib.test_api.Frozen_ReloadTests) ... ok
test_module_replaced (test.test_importlib.test_api.Frozen_ReloadTests) ... ok
test_reload_loader_replaced (test.test_importlib.test_api.Frozen_ReloadTests) ... ok
test_reload_location_changed (test.test_importlib.test_api.Frozen_ReloadTests) ... ok
test_reload_missing_loader (test.test_importlib.test_api.Frozen_ReloadTests) ... ok
test_reload_modules (test.test_importlib.test_api.Frozen_ReloadTests) ... ok
test_reload_namespace_changed (test.test_importlib.test_api.Frozen_ReloadTests) ... ok
test_reload_submodule (test.test_importlib.test_api.Frozen_ReloadTests) ... ok
test_everyone_has___loader__ (test.test_importlib.test_api.Frozen_StartupTests) ... ok
test_everyone_has___spec__ (test.test_importlib.test_api.Frozen_StartupTests) ... ok
test_nothing (test.test_importlib.test_api.Source_FindLoaderPEP302Tests) ... ok
test_success (test.test_importlib.test_api.Source_FindLoaderPEP302Tests) ... ok
test_success_path (test.test_importlib.test_api.Source_FindLoaderPEP302Tests) ... ok
test_sys_modules (test.test_importlib.test_api.Source_FindLoaderPEP302Tests) ... ok
test_sys_modules_loader_is_None (test.test_importlib.test_api.Source_FindLoaderPEP302Tests) ... ok
test_sys_modules_loader_is_not_set (test.test_importlib.test_api.Source_FindLoaderPEP302Tests) ... ok
test_nothing (test.test_importlib.test_api.Source_FindLoaderPEP451Tests) ... ok
test_success (test.test_importlib.test_api.Source_FindLoaderPEP451Tests) ... ok
test_success_path (test.test_importlib.test_api.Source_FindLoaderPEP451Tests) ... ok
test_sys_modules (test.test_importlib.test_api.Source_FindLoaderPEP451Tests) ... ok
test_sys_modules_loader_is_None (test.test_importlib.test_api.Source_FindLoaderPEP451Tests) ... ok
test_sys_modules_loader_is_not_set (test.test_importlib.test_api.Source_FindLoaderPEP451Tests) ... ok
test_absolute_import_with_package (test.test_importlib.test_api.Source_ImportModuleTests) ... ok
test_absolute_package_import (test.test_importlib.test_api.Source_ImportModuleTests) ... ok
test_deep_relative_package_import (test.test_importlib.test_api.Source_ImportModuleTests) ... ok
test_loaded_once (test.test_importlib.test_api.Source_ImportModuleTests) ... ok
test_module_import (test.test_importlib.test_api.Source_ImportModuleTests) ... ok
test_relative_import_wo_package (test.test_importlib.test_api.Source_ImportModuleTests) ... ok
test_shallow_relative_package_import (test.test_importlib.test_api.Source_ImportModuleTests) ... ok
test_method_called (test.test_importlib.test_api.Source_InvalidateCacheTests) ... ok
test_method_lacking (test.test_importlib.test_api.Source_InvalidateCacheTests) ... ok
test_module_missing_spec (test.test_importlib.test_api.Source_ReloadTests) ... ok
test_module_replaced (test.test_importlib.test_api.Source_ReloadTests) ... ok
test_reload_loader_replaced (test.test_importlib.test_api.Source_ReloadTests) ... ok
test_reload_location_changed (test.test_importlib.test_api.Source_ReloadTests) ... ok
test_reload_missing_loader (test.test_importlib.test_api.Source_ReloadTests) ... ok
test_reload_modules (test.test_importlib.test_api.Source_ReloadTests) ... ok
test_reload_namespace_changed (test.test_importlib.test_api.Source_ReloadTests) ... ok
test_reload_submodule (test.test_importlib.test_api.Source_ReloadTests) ... ok
test_everyone_has___loader__ (test.test_importlib.test_api.Source_StartupTests) ... ok
test_everyone_has___spec__ (test.test_importlib.test_api.Source_StartupTests) ... ok
test_read_bytes (test.test_importlib.test_files.OpenDiskTests) ... ok
test_read_text (test.test_importlib.test_files.OpenDiskTests) ... ok
test_traversable (test.test_importlib.test_files.OpenDiskTests) ... ok
test_read_bytes (test.test_importlib.test_files.OpenZipTests) ... ok
test_read_text (test.test_importlib.test_files.OpenZipTests) ... ok
test_traversable (test.test_importlib.test_files.OpenZipTests) ... ok
test_init (test.test_importlib.test_lazy.LazyLoaderFactoryTests) ... ok
test_validation (test.test_importlib.test_lazy.LazyLoaderFactoryTests) ... ok
test_attr_unchanged (test.test_importlib.test_lazy.LazyLoaderTests) ... ok
test_delete_eventual_attr (test.test_importlib.test_lazy.LazyLoaderTests) ... ok
test_delete_preexisting_attr (test.test_importlib.test_lazy.LazyLoaderTests) ... ok
test_e2e (test.test_importlib.test_lazy.LazyLoaderTests) ... ok
test_init (test.test_importlib.test_lazy.LazyLoaderTests) ... ok
test_module_already_in_sys (test.test_importlib.test_lazy.LazyLoaderTests) ... ok
test_module_substitution_error (test.test_importlib.test_lazy.LazyLoaderTests) ... ok
test_mutated_attr (test.test_importlib.test_lazy.LazyLoaderTests) ... ok
test_mutated_preexisting_attr (test.test_importlib.test_lazy.LazyLoaderTests) ... ok
test_new_attr (test.test_importlib.test_lazy.LazyLoaderTests) ... ok
test_deadlock (test.test_importlib.test_locks.Frozen_DeadlockAvoidanceTests) ... ok
test_no_deadlock (test.test_importlib.test_locks.Frozen_DeadlockAvoidanceTests) ... ok
test_all_locks (test.test_importlib.test_locks.Frozen_LifetimeTests) ... ok
test_lock_lifetime (test.test_importlib.test_locks.Frozen_LifetimeTests) ... ok
test_acquire_contended (test.test_importlib.test_locks.Frozen_ModuleLockAsRLockTests) ... ok
test_acquire_destroy (test.test_importlib.test_locks.Frozen_ModuleLockAsRLockTests) ... ok
test_acquire_release (test.test_importlib.test_locks.Frozen_ModuleLockAsRLockTests) ... ok
test_constructor (test.test_importlib.test_locks.Frozen_ModuleLockAsRLockTests) ... ok
test_different_thread (test.test_importlib.test_locks.Frozen_ModuleLockAsRLockTests) ... ok
test_reacquire (test.test_importlib.test_locks.Frozen_ModuleLockAsRLockTests) ... ok
test_release_unacquired (test.test_importlib.test_locks.Frozen_ModuleLockAsRLockTests) ... ok
test_thread_leak (test.test_importlib.test_locks.Frozen_ModuleLockAsRLockTests) ... ok
test_weakref_deleted (test.test_importlib.test_locks.Frozen_ModuleLockAsRLockTests) ... ok
test_weakref_exists (test.test_importlib.test_locks.Frozen_ModuleLockAsRLockTests) ... ok
test_deadlock (test.test_importlib.test_locks.Source_DeadlockAvoidanceTests) ... ok
test_no_deadlock (test.test_importlib.test_locks.Source_DeadlockAvoidanceTests) ... ok
test_all_locks (test.test_importlib.test_locks.Source_LifetimeTests) ... ok
test_lock_lifetime (test.test_importlib.test_locks.Source_LifetimeTests) ... ok
test_acquire_contended (test.test_importlib.test_locks.Source_ModuleLockAsRLockTests) ... ok
test_acquire_destroy (test.test_importlib.test_locks.Source_ModuleLockAsRLockTests) ... ok
test_acquire_release (test.test_importlib.test_locks.Source_ModuleLockAsRLockTests) ... ok
test_constructor (test.test_importlib.test_locks.Source_ModuleLockAsRLockTests) ... ok
test_different_thread (test.test_importlib.test_locks.Source_ModuleLockAsRLockTests) ... ok
test_reacquire (test.test_importlib.test_locks.Source_ModuleLockAsRLockTests) ... ok
test_release_unacquired (test.test_importlib.test_locks.Source_ModuleLockAsRLockTests) ... ok
test_thread_leak (test.test_importlib.test_locks.Source_ModuleLockAsRLockTests) ... ok
test_weakref_deleted (test.test_importlib.test_locks.Source_ModuleLockAsRLockTests) ... ok
test_weakref_exists (test.test_importlib.test_locks.Source_ModuleLockAsRLockTests) ... ok
test_for_name_does_not_exist (test.test_importlib.test_main.BasicTests) ... ok
test_new_style_classes (test.test_importlib.test_main.BasicTests) ... ok
test_package_not_found_mentions_metadata (test.test_importlib.test_main.BasicTests)
When a package is not found, that could indicate that the ... ok
test_retrieves_version_of_self (test.test_importlib.test_main.BasicTests) ... ok
test_egg (test.test_importlib.test_main.DirectoryTest) ... ok
test_egg_info (test.test_importlib.test_main.DirectoryTest) ... ok
test_invalid_usage (test.test_importlib.test_main.DiscoveryTests) ... ok
test_package_discovery (test.test_importlib.test_main.DiscoveryTests) ... ok
test_unicode_dir_on_sys_path (test.test_importlib.test_main.FileSystem)
Ensure a Unicode subdirectory of a directory on sys.path ... ok
test_entrypoint_with_colon_in_name (test.test_importlib.test_main.ImportTests) ... ok
test_import_nonexistent_module (test.test_importlib.test_main.ImportTests) ... ok
test_resolve (test.test_importlib.test_main.ImportTests) ... ok
test_resolve_without_attr (test.test_importlib.test_main.ImportTests) ... ok
test_discovery (test.test_importlib.test_main.InaccessibleSysPath)
Discovering distributions should succeed even if ... skipped 'pyfakefs not available'
test_discovery (test.test_importlib.test_main.MissingSysPath)
Discovering distributions should succeed even if ... ok
test_dashes_in_dist_name_found_as_underscores (test.test_importlib.test_main.NameNormalizationTests)
For a package with a dash in the name, the dist-info metadata ... ok
test_dist_name_found_as_any_case (test.test_importlib.test_main.NameNormalizationTests)
Ensure the metadata loads when queried with any case. ... ok
test_metadata_loads (test.test_importlib.test_main.NonASCIITests) ... ok
test_metadata_loads_egg_info (test.test_importlib.test_main.NonASCIITests) ... ok
test_attr (test.test_importlib.test_main.TestEntryPoints) ... ok
test_entry_point_pickleable (test.test_importlib.test_main.TestEntryPoints) ... ok
test_hashable (test.test_importlib.test_main.TestEntryPoints)
EntryPoints should be hashable ... ok
test_immutable (test.test_importlib.test_main.TestEntryPoints)
EntryPoints should be immutable ... ok
test_json_dump (test.test_importlib.test_main.TestEntryPoints)
json should not expect to be able to dump an EntryPoint ... ok
test_module (test.test_importlib.test_main.TestEntryPoints) ... ok
test_repr (test.test_importlib.test_main.TestEntryPoints) ... ok
test_sortable (test.test_importlib.test_main.TestEntryPoints)
EntryPoint objects are sortable, but result is undefined. ... ok
test_entry_points (test.test_importlib.test_metadata_api.APITests) ... ok
test_entry_points_distribution (test.test_importlib.test_metadata_api.APITests) ... ok
test_file_hash_repr (test.test_importlib.test_metadata_api.APITests) ... ok
test_files_dist_info (test.test_importlib.test_metadata_api.APITests) ... ok
test_files_egg_info (test.test_importlib.test_metadata_api.APITests) ... ok
test_for_name_does_not_exist (test.test_importlib.test_metadata_api.APITests) ... ok
test_for_top_level (test.test_importlib.test_metadata_api.APITests) ... ok
test_metadata_for_this_package (test.test_importlib.test_metadata_api.APITests) ... ok
test_more_complex_deps_requires_text (test.test_importlib.test_metadata_api.APITests) ... ok
test_name_normalization (test.test_importlib.test_metadata_api.APITests) ... ok
test_prefix_not_matched (test.test_importlib.test_metadata_api.APITests) ... ok
test_read_text (test.test_importlib.test_metadata_api.APITests) ... ok
test_requires_dist_info (test.test_importlib.test_metadata_api.APITests) ... ok
test_requires_egg_info (test.test_importlib.test_metadata_api.APITests) ... ok
test_requires_egg_info_file (test.test_importlib.test_metadata_api.APITests) ... ok
test_retrieves_version_of_distinfo_pkg (test.test_importlib.test_metadata_api.APITests) ... ok
test_retrieves_version_of_self (test.test_importlib.test_metadata_api.APITests) ... ok
test_version_egg_info_file (test.test_importlib.test_metadata_api.APITests) ... ok
test_name_normalization (test.test_importlib.test_metadata_api.LegacyDots) ... ok
test_name_normalization_versionless_egg_info (test.test_importlib.test_metadata_api.LegacyDots) ... ok
test_distribution_at_pathlib (test.test_importlib.test_metadata_api.OffSysPathTests)
Demonstrate how to load metadata direct from a directory. ... ok
test_distribution_at_str (test.test_importlib.test_metadata_api.OffSysPathTests) ... ok
test_find_distributions_specified_path (test.test_importlib.test_metadata_api.OffSysPathTests) ... ok
test_imports (test.test_importlib.test_namespace_pkgs.CombinedNamespacePackages) ... ok
test_project3_fails (test.test_importlib.test_namespace_pkgs.DynamicPathCalculation) ... ok
test_project3_succeeds (test.test_importlib.test_namespace_pkgs.DynamicPathCalculation) ... ok
test_dynamic_path (test.test_importlib.test_namespace_pkgs.DynamicPathNamespacePackage) ... ok
test_non_namespace_package_takes_precedence (test.test_importlib.test_namespace_pkgs.LegacySupport) ... ok
test_namespace_loader_consistency (test.test_importlib.test_namespace_pkgs.LoaderTests) ... ok
test_namespace_origin_consistency (test.test_importlib.test_namespace_pkgs.LoaderTests) ... ok
test_path_indexable (test.test_importlib.test_namespace_pkgs.LoaderTests) ... ok
test_module_before_namespace_package (test.test_importlib.test_namespace_pkgs.ModuleAndNamespacePackageInSameDir) ... ok
test_cant_import_other (test.test_importlib.test_namespace_pkgs.ReloadTests) ... ok
test_dynamic_path (test.test_importlib.test_namespace_pkgs.ReloadTests) ... ok
test_simple_package (test.test_importlib.test_namespace_pkgs.ReloadTests) ... ok
test_imports (test.test_importlib.test_namespace_pkgs.SeparatedNamespacePackages) ... ok
test_imports (test.test_importlib.test_namespace_pkgs.SeparatedNestedZipNamespacePackages) ... ok
test_first_path_wins (test.test_importlib.test_namespace_pkgs.SeparatedOverlappingNamespacePackages) ... ok
test_first_path_wins_again (test.test_importlib.test_namespace_pkgs.SeparatedOverlappingNamespacePackages) ... ok
test_first_path_wins_importing_second_first (test.test_importlib.test_namespace_pkgs.SeparatedOverlappingNamespacePackages) ... ok
test_imports (test.test_importlib.test_namespace_pkgs.SeparatedZipNamespacePackages) ... ok
test_cant_import_other (test.test_importlib.test_namespace_pkgs.SingleNamespacePackage) ... ok
test_module_repr (test.test_importlib.test_namespace_pkgs.SingleNamespacePackage) ... ok
test_simple_package (test.test_importlib.test_namespace_pkgs.SingleNamespacePackage) ... ok
test_cant_import_other (test.test_importlib.test_namespace_pkgs.SingleNestedZipNamespacePackage) ... ok
test_simple_package (test.test_importlib.test_namespace_pkgs.SingleNestedZipNamespacePackage) ... ok
test_cant_import_other (test.test_importlib.test_namespace_pkgs.SingleZipNamespacePackage) ... ok
test_simple_package (test.test_importlib.test_namespace_pkgs.SingleZipNamespacePackage) ... ok
test_missing_directory (test.test_importlib.test_namespace_pkgs.ZipWithMissingDirectory) ... expected failure
test_present_directory (test.test_importlib.test_namespace_pkgs.ZipWithMissingDirectory) ... ok
test_absolute_path (test.test_importlib.test_open.CommonBinaryTests) ... ok
test_importing_module_as_side_effect (test.test_importlib.test_open.CommonBinaryTests) ... ok
test_non_package_by_name (test.test_importlib.test_open.CommonBinaryTests) ... ok
test_non_package_by_package (test.test_importlib.test_open.CommonBinaryTests) ... ok
test_package_name (test.test_importlib.test_open.CommonBinaryTests) ... ok
test_package_object (test.test_importlib.test_open.CommonBinaryTests) ... ok
test_pathlib_path (test.test_importlib.test_open.CommonBinaryTests) ... ok
test_relative_path (test.test_importlib.test_open.CommonBinaryTests) ... ok
test_resource_opener (test.test_importlib.test_open.CommonBinaryTests) ... ok
test_resource_path (test.test_importlib.test_open.CommonBinaryTests) ... ok
test_string_path (test.test_importlib.test_open.CommonBinaryTests) ... ok
test_useless_loader (test.test_importlib.test_open.CommonBinaryTests) ... ok
test_absolute_path (test.test_importlib.test_open.CommonTextTests) ... ok
test_importing_module_as_side_effect (test.test_importlib.test_open.CommonTextTests) ... ok
test_non_package_by_name (test.test_importlib.test_open.CommonTextTests) ... ok
test_non_package_by_package (test.test_importlib.test_open.CommonTextTests) ... ok
test_package_name (test.test_importlib.test_open.CommonTextTests) ... ok
test_package_object (test.test_importlib.test_open.CommonTextTests) ... ok
test_pathlib_path (test.test_importlib.test_open.CommonTextTests) ... ok
test_relative_path (test.test_importlib.test_open.CommonTextTests) ... ok
test_resource_opener (test.test_importlib.test_open.CommonTextTests) ... ok
test_resource_path (test.test_importlib.test_open.CommonTextTests) ... ok
test_string_path (test.test_importlib.test_open.CommonTextTests) ... ok
test_useless_loader (test.test_importlib.test_open.CommonTextTests) ... ok
test_open_binary (test.test_importlib.test_open.OpenDiskNamespaceTests) ... ok
test_open_binary_FileNotFoundError (test.test_importlib.test_open.OpenDiskNamespaceTests) ... ok
test_open_text_FileNotFoundError (test.test_importlib.test_open.OpenDiskNamespaceTests) ... ok
test_open_text_default_encoding (test.test_importlib.test_open.OpenDiskNamespaceTests) ... ok
test_open_text_given_encoding (test.test_importlib.test_open.OpenDiskNamespaceTests) ... ok
test_open_text_with_errors (test.test_importlib.test_open.OpenDiskNamespaceTests) ... ok
test_open_binary (test.test_importlib.test_open.OpenDiskTests) ... ok
test_open_binary_FileNotFoundError (test.test_importlib.test_open.OpenDiskTests) ... ok
test_open_text_FileNotFoundError (test.test_importlib.test_open.OpenDiskTests) ... ok
test_open_text_default_encoding (test.test_importlib.test_open.OpenDiskTests) ... ok
test_open_text_given_encoding (test.test_importlib.test_open.OpenDiskTests) ... ok
test_open_text_with_errors (test.test_importlib.test_open.OpenDiskTests) ... ok
test_open_binary (test.test_importlib.test_open.OpenZipTests) ... ok
test_open_binary_FileNotFoundError (test.test_importlib.test_open.OpenZipTests) ... ok
test_open_text_FileNotFoundError (test.test_importlib.test_open.OpenZipTests) ... ok
test_open_text_default_encoding (test.test_importlib.test_open.OpenZipTests) ... ok
test_open_text_given_encoding (test.test_importlib.test_open.OpenZipTests) ... ok
test_open_text_with_errors (test.test_importlib.test_open.OpenZipTests) ... ok
test_absolute_path (test.test_importlib.test_path.CommonTests) ... ok
test_importing_module_as_side_effect (test.test_importlib.test_path.CommonTests) ... ok
test_non_package_by_name (test.test_importlib.test_path.CommonTests) ... ok
test_non_package_by_package (test.test_importlib.test_path.CommonTests) ... ok
test_package_name (test.test_importlib.test_path.CommonTests) ... ok
test_package_object (test.test_importlib.test_path.CommonTests) ... ok
test_pathlib_path (test.test_importlib.test_path.CommonTests) ... ok
test_relative_path (test.test_importlib.test_path.CommonTests) ... ok
test_resource_opener (test.test_importlib.test_path.CommonTests) ... ok
test_resource_path (test.test_importlib.test_path.CommonTests) ... ok
test_string_path (test.test_importlib.test_path.CommonTests) ... ok
test_useless_loader (test.test_importlib.test_path.CommonTests) ... ok
test_natural_path (test.test_importlib.test_path.PathDiskTests)
Guarantee the internal implementation detail that ... ok
test_reading (test.test_importlib.test_path.PathDiskTests) ... ok
test_reading (test.test_importlib.test_path.PathZipTests) ... ok
test_remove_in_context_manager (test.test_importlib.test_path.PathZipTests) ... ok
test_package_import__semantics (test.test_importlib.test_pkg_import.TestImport) ... ok
test_absolute_path (test.test_importlib.test_read.CommonBinaryTests) ... ok
test_importing_module_as_side_effect (test.test_importlib.test_read.CommonBinaryTests) ... ok
test_non_package_by_name (test.test_importlib.test_read.CommonBinaryTests) ... ok
test_non_package_by_package (test.test_importlib.test_read.CommonBinaryTests) ... ok
test_package_name (test.test_importlib.test_read.CommonBinaryTests) ... ok
test_package_object (test.test_importlib.test_read.CommonBinaryTests) ... ok
test_pathlib_path (test.test_importlib.test_read.CommonBinaryTests) ... ok
test_relative_path (test.test_importlib.test_read.CommonBinaryTests) ... ok
test_resource_opener (test.test_importlib.test_read.CommonBinaryTests) ... ok
test_resource_path (test.test_importlib.test_read.CommonBinaryTests) ... ok
test_string_path (test.test_importlib.test_read.CommonBinaryTests) ... ok
test_useless_loader (test.test_importlib.test_read.CommonBinaryTests) ... ok
test_absolute_path (test.test_importlib.test_read.CommonTextTests) ... ok
test_importing_module_as_side_effect (test.test_importlib.test_read.CommonTextTests) ... ok
test_non_package_by_name (test.test_importlib.test_read.CommonTextTests) ... ok
test_non_package_by_package (test.test_importlib.test_read.CommonTextTests) ... ok
test_package_name (test.test_importlib.test_read.CommonTextTests) ... ok
test_package_object (test.test_importlib.test_read.CommonTextTests) ... ok
test_pathlib_path (test.test_importlib.test_read.CommonTextTests) ... ok
test_relative_path (test.test_importlib.test_read.CommonTextTests) ... ok
test_resource_opener (test.test_importlib.test_read.CommonTextTests) ... ok
test_resource_path (test.test_importlib.test_read.CommonTextTests) ... ok
test_string_path (test.test_importlib.test_read.CommonTextTests) ... ok
test_useless_loader (test.test_importlib.test_read.CommonTextTests) ... ok
test_read_binary (test.test_importlib.test_read.ReadDiskTests) ... ok
test_read_text_default_encoding (test.test_importlib.test_read.ReadDiskTests) ... ok
test_read_text_given_encoding (test.test_importlib.test_read.ReadDiskTests) ... ok
test_read_text_with_errors (test.test_importlib.test_read.ReadDiskTests) ... ok
test_read_binary (test.test_importlib.test_read.ReadZipTests) ... ok
test_read_submodule_resource (test.test_importlib.test_read.ReadZipTests) ... ok
test_read_submodule_resource_by_name (test.test_importlib.test_read.ReadZipTests) ... ok
test_read_text_default_encoding (test.test_importlib.test_read.ReadZipTests) ... ok
test_read_text_given_encoding (test.test_importlib.test_read.ReadZipTests) ... ok
test_read_text_with_errors (test.test_importlib.test_read.ReadZipTests) ... ok
test_init_file (test.test_importlib.test_reader.MultiplexedPathTest) ... ok
test_init_no_paths (test.test_importlib.test_reader.MultiplexedPathTest) ... ok
test_is_dir (test.test_importlib.test_reader.MultiplexedPathTest) ... ok
test_is_file (test.test_importlib.test_reader.MultiplexedPathTest) ... ok
test_iterdir (test.test_importlib.test_reader.MultiplexedPathTest) ... ok
test_iterdir_duplicate (test.test_importlib.test_reader.MultiplexedPathTest) ... ok
test_join_path (test.test_importlib.test_reader.MultiplexedPathTest) ... test_join_path
ok
test_open_file (test.test_importlib.test_reader.MultiplexedPathTest) ... ok
test_repr (test.test_importlib.test_reader.MultiplexedPathTest) ... ok
test_files (test.test_importlib.test_reader.NamespaceReaderTest) ... ok
test_init_error (test.test_importlib.test_reader.NamespaceReaderTest) ... ok
test_resource_path (test.test_importlib.test_reader.NamespaceReaderTest) ... ok
test_contents_does_not_keep_open (test.test_importlib.test_resource.DeletingZipsTest) ... ok
test_entered_path_does_not_keep_open (test.test_importlib.test_resource.DeletingZipsTest) ... ok
test_is_resource_does_not_keep_open (test.test_importlib.test_resource.DeletingZipsTest) ... ok
test_is_resource_failure_does_not_keep_open (test.test_importlib.test_resource.DeletingZipsTest) ... ok
test_path_does_not_keep_open (test.test_importlib.test_resource.DeletingZipsTest) ... skipped 'Desired but not supported.'
test_read_binary_does_not_keep_open (test.test_importlib.test_resource.DeletingZipsTest) ... ok
test_read_text_does_not_keep_open (test.test_importlib.test_resource.DeletingZipsTest) ... ok
test_package_has_no_reader_fallback (test.test_importlib.test_resource.ResourceCornerCaseTests) ... ERROR
test_contents (test.test_importlib.test_resource.ResourceDiskTests) ... ok
test_is_resource_good_path (test.test_importlib.test_resource.ResourceDiskTests) ... ok
test_is_resource_missing (test.test_importlib.test_resource.ResourceDiskTests) ... ok
test_is_resource_subresource_directory (test.test_importlib.test_resource.ResourceDiskTests) ... ok
test_is_submodule_resource (test.test_importlib.test_resource.ResourceFromNamespaceTest01) ... ERROR
test_read_submodule_resource_by_name (test.test_importlib.test_resource.ResourceFromNamespaceTest01) ... ERROR
test_submodule_contents (test.test_importlib.test_resource.ResourceFromNamespaceTest01) ... ERROR
test_submodule_contents_by_name (test.test_importlib.test_resource.ResourceFromNamespaceTest01) ... ERROR
test_is_submodule_resource (test.test_importlib.test_resource.ResourceFromZipsTest01) ... ok
test_read_submodule_resource_by_name (test.test_importlib.test_resource.ResourceFromZipsTest01) ... ok
test_submodule_contents (test.test_importlib.test_resource.ResourceFromZipsTest01) ... ok
test_submodule_contents_by_name (test.test_importlib.test_resource.ResourceFromZipsTest01) ... ok
test_unrelated_contents (test.test_importlib.test_resource.ResourceFromZipsTest02)
Test thata zip with two unrelated subpackages return ... ok
test_resource_contents (test.test_importlib.test_resource.ResourceLoaderTests) ... ok
test_resource_directory_is_not_resource (test.test_importlib.test_resource.ResourceLoaderTests) ... ok
test_resource_is_resource (test.test_importlib.test_resource.ResourceLoaderTests) ... ok
test_resource_missing_is_not_resource (test.test_importlib.test_resource.ResourceLoaderTests) ... ok
test_contents (test.test_importlib.test_resource.ResourceZipTests) ... ok
test_is_resource_good_path (test.test_importlib.test_resource.ResourceZipTests) ... ok
test_is_resource_missing (test.test_importlib.test_resource.ResourceZipTests) ... ok
test_is_resource_subresource_directory (test.test_importlib.test_resource.ResourceZipTests) ... ok
test_spec_from_file_location_default (test.test_importlib.test_spec.Frozen_FactoryTests) ... ok
test_spec_from_file_location_default_bad_suffix (test.test_importlib.test_spec.Frozen_FactoryTests) ... ok
test_spec_from_file_location_default_without_location (test.test_importlib.test_spec.Frozen_FactoryTests) ... ok
test_spec_from_file_location_loader_no_location (test.test_importlib.test_spec.Frozen_FactoryTests) ... ok
test_spec_from_file_location_loader_no_location_bad_get_filename (test.test_importlib.test_spec.Frozen_FactoryTests) ... ok
test_spec_from_file_location_loader_no_location_no_get_filename (test.test_importlib.test_spec.Frozen_FactoryTests) ... ok
test_spec_from_file_location_path_like_arg (test.test_importlib.test_spec.Frozen_FactoryTests) ... ok
test_spec_from_file_location_smsl_default (test.test_importlib.test_spec.Frozen_FactoryTests) ... ok
test_spec_from_file_location_smsl_default_bad_is_package (test.test_importlib.test_spec.Frozen_FactoryTests) ... ok
test_spec_from_file_location_smsl_default_no_is_package (test.test_importlib.test_spec.Frozen_FactoryTests) ... ok
test_spec_from_file_location_smsl_default_not_package (test.test_importlib.test_spec.Frozen_FactoryTests) ... ok
test_spec_from_file_location_smsl_empty (test.test_importlib.test_spec.Frozen_FactoryTests) ... ok
test_spec_from_file_location_smsl_none (test.test_importlib.test_spec.Frozen_FactoryTests) ... ok
test_spec_from_file_location_smsl_not_empty (test.test_importlib.test_spec.Frozen_FactoryTests) ... ok
test_spec_from_loader_default (test.test_importlib.test_spec.Frozen_FactoryTests) ... ok
test_spec_from_loader_default_with_bad_is_package (test.test_importlib.test_spec.Frozen_FactoryTests) ... ok
test_spec_from_loader_default_with_file_loader (test.test_importlib.test_spec.Frozen_FactoryTests) ... ok
test_spec_from_loader_is_package_false (test.test_importlib.test_spec.Frozen_FactoryTests) ... ok
test_spec_from_loader_is_package_false_with_fileloader (test.test_importlib.test_spec.Frozen_FactoryTests) ... ok
test_spec_from_loader_is_package_true (test.test_importlib.test_spec.Frozen_FactoryTests) ... ok
test_spec_from_loader_is_package_true_with_fileloader (test.test_importlib.test_spec.Frozen_FactoryTests) ... ok
test_spec_from_loader_is_package_with_loader_false (test.test_importlib.test_spec.Frozen_FactoryTests) ... ok
test_spec_from_loader_is_package_with_loader_true (test.test_importlib.test_spec.Frozen_FactoryTests) ... ok
test_spec_from_loader_origin (test.test_importlib.test_spec.Frozen_FactoryTests) ... ok
test_spec_from_loader_origin_and_is_package (test.test_importlib.test_spec.Frozen_FactoryTests) ... ok
test_module___loader___module_repr (test.test_importlib.test_spec.Frozen_ModuleReprTests) ... ok
test_module___loader___module_repr_bad (test.test_importlib.test_spec.Frozen_ModuleReprTests) ... ok
test_module___spec__ (test.test_importlib.test_spec.Frozen_ModuleReprTests) ... ok
test_module___spec___location (test.test_importlib.test_spec.Frozen_ModuleReprTests) ... ok
test_module___spec___no_origin (test.test_importlib.test_spec.Frozen_ModuleReprTests) ... ok
test_module___spec___no_origin_no_loader (test.test_importlib.test_spec.Frozen_ModuleReprTests) ... ok
test_module_no_file (test.test_importlib.test_spec.Frozen_ModuleReprTests) ... ok
test_module_no_file_no_loader (test.test_importlib.test_spec.Frozen_ModuleReprTests) ... ok
test_module_no_name (test.test_importlib.test_spec.Frozen_ModuleReprTests) ... ok
test_module_with_file (test.test_importlib.test_spec.Frozen_ModuleReprTests) ... ok
test_exec (test.test_importlib.test_spec.Frozen_ModuleSpecMethodsTests) ... ok
test_load (test.test_importlib.test_spec.Frozen_ModuleSpecMethodsTests) ... ok
test_load_failed (test.test_importlib.test_spec.Frozen_ModuleSpecMethodsTests) ... ok
test_load_failed_removed (test.test_importlib.test_spec.Frozen_ModuleSpecMethodsTests) ... ok
test_load_legacy (test.test_importlib.test_spec.Frozen_ModuleSpecMethodsTests) ... ok
test_load_legacy_attributes (test.test_importlib.test_spec.Frozen_ModuleSpecMethodsTests) ... ok
test_load_legacy_attributes_immutable (test.test_importlib.test_spec.Frozen_ModuleSpecMethodsTests) ... ok
test_load_replaced (test.test_importlib.test_spec.Frozen_ModuleSpecMethodsTests) ... ok
test_reload (test.test_importlib.test_spec.Frozen_ModuleSpecMethodsTests) ... ok
test_reload_extra_attributes (test.test_importlib.test_spec.Frozen_ModuleSpecMethodsTests) ... ok
test_reload_init_module_attrs (test.test_importlib.test_spec.Frozen_ModuleSpecMethodsTests) ... ok
test_reload_legacy (test.test_importlib.test_spec.Frozen_ModuleSpecMethodsTests) ... ok
test_reload_modified (test.test_importlib.test_spec.Frozen_ModuleSpecMethodsTests) ... ok
test_cached_no_origin (test.test_importlib.test_spec.Frozen_ModuleSpecTests) ... ok
test_cached_set (test.test_importlib.test_spec.Frozen_ModuleSpecTests) ... ok
test_cached_source (test.test_importlib.test_spec.Frozen_ModuleSpecTests) ... ok
test_cached_source_missing_cache_tag (test.test_importlib.test_spec.Frozen_ModuleSpecTests) ... ok
test_cached_source_unknown_suffix (test.test_importlib.test_spec.Frozen_ModuleSpecTests) ... ok
test_cached_sourceless (test.test_importlib.test_spec.Frozen_ModuleSpecTests) ... ok
test_cached_with_origin_not_location (test.test_importlib.test_spec.Frozen_ModuleSpecTests) ... ok
test_default (test.test_importlib.test_spec.Frozen_ModuleSpecTests) ... ok
test_default_is_package_false (test.test_importlib.test_spec.Frozen_ModuleSpecTests) ... ok
test_default_is_package_true (test.test_importlib.test_spec.Frozen_ModuleSpecTests) ... ok
test_default_no_loader (test.test_importlib.test_spec.Frozen_ModuleSpecTests) ... ok
test_equality (test.test_importlib.test_spec.Frozen_ModuleSpecTests) ... ok
test_equality_location (test.test_importlib.test_spec.Frozen_ModuleSpecTests) ... ok
test_has_location_setter (test.test_importlib.test_spec.Frozen_ModuleSpecTests) ... ok
test_inequality (test.test_importlib.test_spec.Frozen_ModuleSpecTests) ... ok
test_inequality_incomplete (test.test_importlib.test_spec.Frozen_ModuleSpecTests) ... ok
test_package (test.test_importlib.test_spec.Frozen_ModuleSpecTests) ... ok
test_package_is_package (test.test_importlib.test_spec.Frozen_ModuleSpecTests) ... ok
test_spec_from_file_location_default (test.test_importlib.test_spec.Source_FactoryTests) ... ok
test_spec_from_file_location_default_bad_suffix (test.test_importlib.test_spec.Source_FactoryTests) ... ok
test_spec_from_file_location_default_without_location (test.test_importlib.test_spec.Source_FactoryTests) ... ok
test_spec_from_file_location_loader_no_location (test.test_importlib.test_spec.Source_FactoryTests) ... ok
test_spec_from_file_location_loader_no_location_bad_get_filename (test.test_importlib.test_spec.Source_FactoryTests) ... ok
test_spec_from_file_location_loader_no_location_no_get_filename (test.test_importlib.test_spec.Source_FactoryTests) ... ok
test_spec_from_file_location_path_like_arg (test.test_importlib.test_spec.Source_FactoryTests) ... ok
test_spec_from_file_location_smsl_default (test.test_importlib.test_spec.Source_FactoryTests) ... ok
test_spec_from_file_location_smsl_default_bad_is_package (test.test_importlib.test_spec.Source_FactoryTests) ... ok
test_spec_from_file_location_smsl_default_no_is_package (test.test_importlib.test_spec.Source_FactoryTests) ... ok
test_spec_from_file_location_smsl_default_not_package (test.test_importlib.test_spec.Source_FactoryTests) ... ok
test_spec_from_file_location_smsl_empty (test.test_importlib.test_spec.Source_FactoryTests) ... ok
test_spec_from_file_location_smsl_none (test.test_importlib.test_spec.Source_FactoryTests) ... ok
test_spec_from_file_location_smsl_not_empty (test.test_importlib.test_spec.Source_FactoryTests) ... ok
test_spec_from_loader_default (test.test_importlib.test_spec.Source_FactoryTests) ... ok
test_spec_from_loader_default_with_bad_is_package (test.test_importlib.test_spec.Source_FactoryTests) ... ok
test_spec_from_loader_default_with_file_loader (test.test_importlib.test_spec.Source_FactoryTests) ... ok
test_spec_from_loader_is_package_false (test.test_importlib.test_spec.Source_FactoryTests) ... ok
test_spec_from_loader_is_package_false_with_fileloader (test.test_importlib.test_spec.Source_FactoryTests) ... ok
test_spec_from_loader_is_package_true (test.test_importlib.test_spec.Source_FactoryTests) ... ok
test_spec_from_loader_is_package_true_with_fileloader (test.test_importlib.test_spec.Source_FactoryTests) ... ok
test_spec_from_loader_is_package_with_loader_false (test.test_importlib.test_spec.Source_FactoryTests) ... ok
test_spec_from_loader_is_package_with_loader_true (test.test_importlib.test_spec.Source_FactoryTests) ... ok
test_spec_from_loader_origin (test.test_importlib.test_spec.Source_FactoryTests) ... ok
test_spec_from_loader_origin_and_is_package (test.test_importlib.test_spec.Source_FactoryTests) ... ok
test_module___loader___module_repr (test.test_importlib.test_spec.Source_ModuleReprTests) ... ok
test_module___loader___module_repr_bad (test.test_importlib.test_spec.Source_ModuleReprTests) ... ok
test_module___spec__ (test.test_importlib.test_spec.Source_ModuleReprTests) ... ok
test_module___spec___location (test.test_importlib.test_spec.Source_ModuleReprTests) ... ok
test_module___spec___no_origin (test.test_importlib.test_spec.Source_ModuleReprTests) ... ok
test_module___spec___no_origin_no_loader (test.test_importlib.test_spec.Source_ModuleReprTests) ... ok
test_module_no_file (test.test_importlib.test_spec.Source_ModuleReprTests) ... ok
test_module_no_file_no_loader (test.test_importlib.test_spec.Source_ModuleReprTests) ... ok
test_module_no_name (test.test_importlib.test_spec.Source_ModuleReprTests) ... ok
test_module_with_file (test.test_importlib.test_spec.Source_ModuleReprTests) ... ok
test_exec (test.test_importlib.test_spec.Source_ModuleSpecMethodsTests) ... ok
test_load (test.test_importlib.test_spec.Source_ModuleSpecMethodsTests) ... ok
test_load_failed (test.test_importlib.test_spec.Source_ModuleSpecMethodsTests) ... ok
test_load_failed_removed (test.test_importlib.test_spec.Source_ModuleSpecMethodsTests) ... ok
test_load_legacy (test.test_importlib.test_spec.Source_ModuleSpecMethodsTests) ... ok
test_load_legacy_attributes (test.test_importlib.test_spec.Source_ModuleSpecMethodsTests) ... ok
test_load_legacy_attributes_immutable (test.test_importlib.test_spec.Source_ModuleSpecMethodsTests) ... ok
test_load_replaced (test.test_importlib.test_spec.Source_ModuleSpecMethodsTests) ... ok
test_reload (test.test_importlib.test_spec.Source_ModuleSpecMethodsTests) ... ok
test_reload_extra_attributes (test.test_importlib.test_spec.Source_ModuleSpecMethodsTests) ... ok
test_reload_init_module_attrs (test.test_importlib.test_spec.Source_ModuleSpecMethodsTests) ... ok
test_reload_legacy (test.test_importlib.test_spec.Source_ModuleSpecMethodsTests) ... ok
test_reload_modified (test.test_importlib.test_spec.Source_ModuleSpecMethodsTests) ... ok
test_cached_no_origin (test.test_importlib.test_spec.Source_ModuleSpecTests) ... ok
test_cached_set (test.test_importlib.test_spec.Source_ModuleSpecTests) ... ok
test_cached_source (test.test_importlib.test_spec.Source_ModuleSpecTests) ... ok
test_cached_source_missing_cache_tag (test.test_importlib.test_spec.Source_ModuleSpecTests) ... ok
test_cached_source_unknown_suffix (test.test_importlib.test_spec.Source_ModuleSpecTests) ... ok
test_cached_sourceless (test.test_importlib.test_spec.Source_ModuleSpecTests) ... ok
test_cached_with_origin_not_location (test.test_importlib.test_spec.Source_ModuleSpecTests) ... ok
test_default (test.test_importlib.test_spec.Source_ModuleSpecTests) ... ok
test_default_is_package_false (test.test_importlib.test_spec.Source_ModuleSpecTests) ... ok
test_default_is_package_true (test.test_importlib.test_spec.Source_ModuleSpecTests) ... ok
test_default_no_loader (test.test_importlib.test_spec.Source_ModuleSpecTests) ... ok
test_equality (test.test_importlib.test_spec.Source_ModuleSpecTests) ... ok
test_equality_location (test.test_importlib.test_spec.Source_ModuleSpecTests) ... ok
test_has_location_setter (test.test_importlib.test_spec.Source_ModuleSpecTests) ... ok
test_inequality (test.test_importlib.test_spec.Source_ModuleSpecTests) ... ok
test_inequality_incomplete (test.test_importlib.test_spec.Source_ModuleSpecTests) ... ok
test_package (test.test_importlib.test_spec.Source_ModuleSpecTests) ... ok
test_package_is_package (test.test_importlib.test_spec.Source_ModuleSpecTests) ... ok
test_circular_imports (test.test_importlib.test_threaded_import.ThreadedImportTests) ... ok
test_import_hangers (test.test_importlib.test_threaded_import.ThreadedImportTests) ... ok
test_parallel_meta_path (test.test_importlib.test_threaded_import.ThreadedImportTests) ... Trying 20 threads ... 29.5 ms OK.
Trying 50 threads ... 29.8 ms OK.
Trying 20 threads ... 29.9 ms OK.
Trying 50 threads ... 39.0 ms OK.
Trying 20 threads ... 32.3 ms OK.
Trying 50 threads ... 33.5 ms OK.
ok
test_parallel_module_init (test.test_importlib.test_threaded_import.ThreadedImportTests) ... Trying 20 threads ... 4.6 ms OK.
Trying 50 threads ... 5.0 ms OK.
Trying 20 threads ... 2.7 ms OK.
Trying 50 threads ... 4.4 ms OK.
Trying 20 threads ... 2.3 ms OK.
Trying 50 threads ... 4.0 ms OK.
ok
test_parallel_path_hooks (test.test_importlib.test_threaded_import.ThreadedImportTests) ... Trying 20 threads ... 40.4 ms OK.
Trying 50 threads ... 6.2 ms OK.
Trying 20 threads ... 2.9 ms OK.
Trying 50 threads ... 4.7 ms OK.
Trying 20 threads ... 2.6 ms OK.
Trying 50 threads ... 4.2 ms OK.
ok
test_side_effect_import (test.test_importlib.test_threaded_import.ThreadedImportTests) ... ok
test_specified_encoding (test.test_importlib.test_util.Frozen_DecodeSourceBytesTests) ... ok
test_universal_newlines (test.test_importlib.test_util.Frozen_DecodeSourceBytesTests) ... ok
test_ut8_default (test.test_importlib.test_util.Frozen_DecodeSourceBytesTests) ... ok
test_find_relative_module (test.test_importlib.test_util.Frozen_FindSpecTests) ... ok
test_find_relative_module_missing_package (test.test_importlib.test_util.Frozen_FindSpecTests) ... ok
test_find_submodule (test.test_importlib.test_util.Frozen_FindSpecTests) ... ok
test_find_submodule_in_module (test.test_importlib.test_util.Frozen_FindSpecTests) ... ok
test_find_submodule_parent_already_imported (test.test_importlib.test_util.Frozen_FindSpecTests) ... ok
test_nothing (test.test_importlib.test_util.Frozen_FindSpecTests) ... ok
test_success (test.test_importlib.test_util.Frozen_FindSpecTests) ... ok
test_sys_modules (test.test_importlib.test_util.Frozen_FindSpecTests) ... ok
test_sys_modules_loader_is_None (test.test_importlib.test_util.Frozen_FindSpecTests) ... ok
test_sys_modules_spec_is_None (test.test_importlib.test_util.Frozen_FindSpecTests) ... ok
test_sys_modules_spec_is_not_set (test.test_importlib.test_util.Frozen_FindSpecTests) ... ok
test_sys_modules_without___loader__ (test.test_importlib.test_util.Frozen_FindSpecTests) ... ok
test_incorporates_rn (test.test_importlib.test_util.Frozen_MagicNumberTests) ... ok
test_length (test.test_importlib.test_util.Frozen_MagicNumberTests) ... ok
test_attributes_set (test.test_importlib.test_util.Frozen_ModuleForLoaderTests) ... ok
test_decorator_attrs (test.test_importlib.test_util.Frozen_ModuleForLoaderTests) ... ok
test_false_module (test.test_importlib.test_util.Frozen_ModuleForLoaderTests) ... ok
test_new_module (test.test_importlib.test_util.Frozen_ModuleForLoaderTests) ... ok
test_new_module_failure (test.test_importlib.test_util.Frozen_ModuleForLoaderTests) ... ok
test_reload (test.test_importlib.test_util.Frozen_ModuleForLoaderTests) ... ok
test_reload_failure (test.test_importlib.test_util.Frozen_ModuleForLoaderTests) ... ok
test_warning (test.test_importlib.test_util.Frozen_ModuleForLoaderTests) ... ok
test___cached__ (test.test_importlib.test_util.Frozen_ModuleFromSpecTests) ... ok
test___file__ (test.test_importlib.test_util.Frozen_ModuleFromSpecTests) ... ok
test___loader__ (test.test_importlib.test_util.Frozen_ModuleFromSpecTests) ... ok
test___name__ (test.test_importlib.test_util.Frozen_ModuleFromSpecTests) ... ok
test___package__ (test.test_importlib.test_util.Frozen_ModuleFromSpecTests) ... ok
test___path__ (test.test_importlib.test_util.Frozen_ModuleFromSpecTests) ... ok
test___spec__ (test.test_importlib.test_util.Frozen_ModuleFromSpecTests) ... ok
test_create_module (test.test_importlib.test_util.Frozen_ModuleFromSpecTests) ... ok
test_create_module_returns_None (test.test_importlib.test_util.Frozen_ModuleFromSpecTests) ... ok
test_no_create_module (test.test_importlib.test_util.Frozen_ModuleFromSpecTests) ... ok
test_cache_from_source (test.test_importlib.test_util.Frozen_PEP3147Tests) ... ok
test_cache_from_source_cwd (test.test_importlib.test_util.Frozen_PEP3147Tests) ... ok
test_cache_from_source_debug_override (test.test_importlib.test_util.Frozen_PEP3147Tests) ... ok
test_cache_from_source_debug_override_optimization_both_set (test.test_importlib.test_util.Frozen_PEP3147Tests) ... ok
test_cache_from_source_no_cache_tag (test.test_importlib.test_util.Frozen_PEP3147Tests) ... ok
test_cache_from_source_no_dot (test.test_importlib.test_util.Frozen_PEP3147Tests) ... ok
test_cache_from_source_optimization_None (test.test_importlib.test_util.Frozen_PEP3147Tests) ... ok
test_cache_from_source_optimization_empty_string (test.test_importlib.test_util.Frozen_PEP3147Tests) ... ok
test_cache_from_source_optimization_set (test.test_importlib.test_util.Frozen_PEP3147Tests) ... ok
test_cache_from_source_override (test.test_importlib.test_util.Frozen_PEP3147Tests) ... ok
test_cache_from_source_path_like_arg (test.test_importlib.test_util.Frozen_PEP3147Tests) ... ok
test_cache_from_source_respects_pycache_prefix (test.test_importlib.test_util.Frozen_PEP3147Tests) ... ok
test_cache_from_source_respects_pycache_prefix_relative (test.test_importlib.test_util.Frozen_PEP3147Tests) ... ok
test_sep_altsep_and_sep_cache_from_source (test.test_importlib.test_util.Frozen_PEP3147Tests) ... skipped 'test meaningful only where os.altsep is defined'
test_source_from_cache (test.test_importlib.test_util.Frozen_PEP3147Tests) ... ok
test_source_from_cache_bad_path (test.test_importlib.test_util.Frozen_PEP3147Tests) ... ok
test_source_from_cache_inside_pycache_prefix (test.test_importlib.test_util.Frozen_PEP3147Tests) ... ok
test_source_from_cache_missing_optimization (test.test_importlib.test_util.Frozen_PEP3147Tests) ... ok
test_source_from_cache_no__pycache__ (test.test_importlib.test_util.Frozen_PEP3147Tests) ... ok
test_source_from_cache_no_cache_tag (test.test_importlib.test_util.Frozen_PEP3147Tests) ... ok
test_source_from_cache_no_slash (test.test_importlib.test_util.Frozen_PEP3147Tests) ... ok
test_source_from_cache_not_opt (test.test_importlib.test_util.Frozen_PEP3147Tests) ... ok
test_source_from_cache_optimized_bytecode (test.test_importlib.test_util.Frozen_PEP3147Tests) ... ok
test_source_from_cache_outside_pycache_prefix (test.test_importlib.test_util.Frozen_PEP3147Tests) ... ok
test_source_from_cache_path_like_arg (test.test_importlib.test_util.Frozen_PEP3147Tests) ... ok
test_source_from_cache_too_few_dots (test.test_importlib.test_util.Frozen_PEP3147Tests) ... ok
test_source_from_cache_too_many_dots (test.test_importlib.test_util.Frozen_PEP3147Tests) ... ok
test_absolute (test.test_importlib.test_util.Frozen_ResolveNameTests) ... ok
test_absolute_within_package (test.test_importlib.test_util.Frozen_ResolveNameTests) ... ok
test_escape (test.test_importlib.test_util.Frozen_ResolveNameTests) ... ok
test_in_package (test.test_importlib.test_util.Frozen_ResolveNameTests) ... ok
test_no_package (test.test_importlib.test_util.Frozen_ResolveNameTests) ... ok
test_other_package (test.test_importlib.test_util.Frozen_ResolveNameTests) ... ok
test_attribute_is_None (test.test_importlib.test_util.Frozen_SetLoaderTests) ... ok
test_no_attribute (test.test_importlib.test_util.Frozen_SetLoaderTests) ... ok
test_not_reset (test.test_importlib.test_util.Frozen_SetLoaderTests) ... ok
test_decorator_attrs (test.test_importlib.test_util.Frozen_SetPackageTests) ... ok
test_leaving_alone (test.test_importlib.test_util.Frozen_SetPackageTests) ... ok
test_package (test.test_importlib.test_util.Frozen_SetPackageTests) ... ok
test_setting_if_missing (test.test_importlib.test_util.Frozen_SetPackageTests) ... ok
test_submodule (test.test_importlib.test_util.Frozen_SetPackageTests) ... ok
test_top_level (test.test_importlib.test_util.Frozen_SetPackageTests) ... ok
test_magic_number (test.test_importlib.test_util.MagicNumberTests)
Each python minor release should generally have a MAGIC_NUMBER ... skipped 'only applies to candidate or final python release levels'
test_specified_encoding (test.test_importlib.test_util.Source_DecodeSourceBytesTests) ... ok
test_universal_newlines (test.test_importlib.test_util.Source_DecodeSourceBytesTests) ... ok
test_ut8_default (test.test_importlib.test_util.Source_DecodeSourceBytesTests) ... ok
test_find_relative_module (test.test_importlib.test_util.Source_FindSpecTests) ... ok
test_find_relative_module_missing_package (test.test_importlib.test_util.Source_FindSpecTests) ... ok
test_find_submodule (test.test_importlib.test_util.Source_FindSpecTests) ... ok
test_find_submodule_in_module (test.test_importlib.test_util.Source_FindSpecTests) ... ok
test_find_submodule_parent_already_imported (test.test_importlib.test_util.Source_FindSpecTests) ... ok
test_nothing (test.test_importlib.test_util.Source_FindSpecTests) ... ok
test_success (test.test_importlib.test_util.Source_FindSpecTests) ... ok
test_sys_modules (test.test_importlib.test_util.Source_FindSpecTests) ... ok
test_sys_modules_loader_is_None (test.test_importlib.test_util.Source_FindSpecTests) ... ok
test_sys_modules_spec_is_None (test.test_importlib.test_util.Source_FindSpecTests) ... ok
test_sys_modules_spec_is_not_set (test.test_importlib.test_util.Source_FindSpecTests) ... ok
test_sys_modules_without___loader__ (test.test_importlib.test_util.Source_FindSpecTests) ... ok
test_incorporates_rn (test.test_importlib.test_util.Source_MagicNumberTests) ... ok
test_length (test.test_importlib.test_util.Source_MagicNumberTests) ... ok
test_attributes_set (test.test_importlib.test_util.Source_ModuleForLoaderTests) ... ok
test_decorator_attrs (test.test_importlib.test_util.Source_ModuleForLoaderTests) ... ok
test_false_module (test.test_importlib.test_util.Source_ModuleForLoaderTests) ... ok
test_new_module (test.test_importlib.test_util.Source_ModuleForLoaderTests) ... ok
test_new_module_failure (test.test_importlib.test_util.Source_ModuleForLoaderTests) ... ok
test_reload (test.test_importlib.test_util.Source_ModuleForLoaderTests) ... ok
test_reload_failure (test.test_importlib.test_util.Source_ModuleForLoaderTests) ... ok
test_warning (test.test_importlib.test_util.Source_ModuleForLoaderTests) ... ok
test___cached__ (test.test_importlib.test_util.Source_ModuleFromSpecTests) ... ok
test___file__ (test.test_importlib.test_util.Source_ModuleFromSpecTests) ... ok
test___loader__ (test.test_importlib.test_util.Source_ModuleFromSpecTests) ... ok
test___name__ (test.test_importlib.test_util.Source_ModuleFromSpecTests) ... ok
test___package__ (test.test_importlib.test_util.Source_ModuleFromSpecTests) ... ok
test___path__ (test.test_importlib.test_util.Source_ModuleFromSpecTests) ... ok
test___spec__ (test.test_importlib.test_util.Source_ModuleFromSpecTests) ... ok
test_create_module (test.test_importlib.test_util.Source_ModuleFromSpecTests) ... ok
test_create_module_returns_None (test.test_importlib.test_util.Source_ModuleFromSpecTests) ... ok
test_no_create_module (test.test_importlib.test_util.Source_ModuleFromSpecTests) ... ok
test_cache_from_source (test.test_importlib.test_util.Source_PEP3147Tests) ... ok
test_cache_from_source_cwd (test.test_importlib.test_util.Source_PEP3147Tests) ... ok
test_cache_from_source_debug_override (test.test_importlib.test_util.Source_PEP3147Tests) ... ok
test_cache_from_source_debug_override_optimization_both_set (test.test_importlib.test_util.Source_PEP3147Tests) ... ok
test_cache_from_source_no_cache_tag (test.test_importlib.test_util.Source_PEP3147Tests) ... ok
test_cache_from_source_no_dot (test.test_importlib.test_util.Source_PEP3147Tests) ... ok
test_cache_from_source_optimization_None (test.test_importlib.test_util.Source_PEP3147Tests) ... ok
test_cache_from_source_optimization_empty_string (test.test_importlib.test_util.Source_PEP3147Tests) ... ok
test_cache_from_source_optimization_set (test.test_importlib.test_util.Source_PEP3147Tests) ... ok
test_cache_from_source_override (test.test_importlib.test_util.Source_PEP3147Tests) ... ok
test_cache_from_source_path_like_arg (test.test_importlib.test_util.Source_PEP3147Tests) ... ok
test_cache_from_source_respects_pycache_prefix (test.test_importlib.test_util.Source_PEP3147Tests) ... ok
test_cache_from_source_respects_pycache_prefix_relative (test.test_importlib.test_util.Source_PEP3147Tests) ... ok
test_sep_altsep_and_sep_cache_from_source (test.test_importlib.test_util.Source_PEP3147Tests) ... skipped 'test meaningful only where os.altsep is defined'
test_source_from_cache (test.test_importlib.test_util.Source_PEP3147Tests) ... ok
test_source_from_cache_bad_path (test.test_importlib.test_util.Source_PEP3147Tests) ... ok
test_source_from_cache_inside_pycache_prefix (test.test_importlib.test_util.Source_PEP3147Tests) ... ok
test_source_from_cache_missing_optimization (test.test_importlib.test_util.Source_PEP3147Tests) ... ok
test_source_from_cache_no__pycache__ (test.test_importlib.test_util.Source_PEP3147Tests) ... ok
test_source_from_cache_no_cache_tag (test.test_importlib.test_util.Source_PEP3147Tests) ... ok
test_source_from_cache_no_slash (test.test_importlib.test_util.Source_PEP3147Tests) ... ok
test_source_from_cache_not_opt (test.test_importlib.test_util.Source_PEP3147Tests) ... ok
test_source_from_cache_optimized_bytecode (test.test_importlib.test_util.Source_PEP3147Tests) ... ok
test_source_from_cache_outside_pycache_prefix (test.test_importlib.test_util.Source_PEP3147Tests) ... ok
test_source_from_cache_path_like_arg (test.test_importlib.test_util.Source_PEP3147Tests) ... ok
test_source_from_cache_too_few_dots (test.test_importlib.test_util.Source_PEP3147Tests) ... ok
test_source_from_cache_too_many_dots (test.test_importlib.test_util.Source_PEP3147Tests) ... ok
test_absolute (test.test_importlib.test_util.Source_ResolveNameTests) ... ok
test_absolute_within_package (test.test_importlib.test_util.Source_ResolveNameTests) ... ok
test_escape (test.test_importlib.test_util.Source_ResolveNameTests) ... ok
test_in_package (test.test_importlib.test_util.Source_ResolveNameTests) ... ok
test_no_package (test.test_importlib.test_util.Source_ResolveNameTests) ... ok
test_other_package (test.test_importlib.test_util.Source_ResolveNameTests) ... ok
test_attribute_is_None (test.test_importlib.test_util.Source_SetLoaderTests) ... ok
test_no_attribute (test.test_importlib.test_util.Source_SetLoaderTests) ... ok
test_not_reset (test.test_importlib.test_util.Source_SetLoaderTests) ... ok
test_decorator_attrs (test.test_importlib.test_util.Source_SetPackageTests) ... ok
test_leaving_alone (test.test_importlib.test_util.Source_SetPackageTests) ... ok
test_package (test.test_importlib.test_util.Source_SetPackageTests) ... ok
test_setting_if_missing (test.test_importlib.test_util.Source_SetPackageTests) ... ok
test_submodule (test.test_importlib.test_util.Source_SetPackageTests) ... ok
test_top_level (test.test_importlib.test_util.Source_SetPackageTests) ... ok
test.test_importlib.test_windows (unittest.loader.ModuleSkipped) ... skipped "No module named 'winreg'"
test_case_insensitive (test.test_importlib.test_zip.TestEgg) ... ok
test_files (test.test_importlib.test_zip.TestEgg) ... ok
test_missing_metadata (test.test_importlib.test_zip.TestEgg) ... ok
test_one_distribution (test.test_importlib.test_zip.TestEgg) ... ok
test_zip_entry_points (test.test_importlib.test_zip.TestEgg) ... ok
test_zip_version (test.test_importlib.test_zip.TestEgg) ... ok
test_zip_version_does_not_match (test.test_importlib.test_zip.TestEgg) ... ok
test_case_insensitive (test.test_importlib.test_zip.TestZip) ... ok
test_files (test.test_importlib.test_zip.TestZip) ... ok
test_missing_metadata (test.test_importlib.test_zip.TestZip) ... ok
test_one_distribution (test.test_importlib.test_zip.TestZip) ... ok
test_zip_entry_points (test.test_importlib.test_zip.TestZip) ... ok
test_zip_version (test.test_importlib.test_zip.TestZip) ... ok
test_zip_version_does_not_match (test.test_importlib.test_zip.TestZip) ... Warning -- sys.path was modified by test.test_importlib
Before: (4382404800, ['/Users/jaraco/code/public/cpython', '/usr/local/lib/python310.zip', '/Users/jaraco/code/public/cpython/Lib', '/Users/jaraco/code/public/cpython/build/lib.macosx-11.1-x86_64-3.10'], ['/Users/jaraco/code/public/cpython', '/usr/local/lib/python310.zip', '/Users/jaraco/code/public/cpython/Lib', '/Users/jaraco/code/public/cpython/build/lib.macosx-11.1-x86_64-3.10'])
After: (4382404800, ['/Users/jaraco/code/public/cpython', '/usr/local/lib/python310.zip', '/Users/jaraco/code/public/cpython/Lib', '/Users/jaraco/code/public/cpython/build/lib.macosx-11.1-x86_64-3.10'], ['/Users/jaraco/code/public/cpython', '/usr/local/lib/python310.zip', '/Users/jaraco/code/public/cpython/Lib', '/Users/jaraco/code/public/cpython/build/lib.macosx-11.1-x86_64-3.10', '/Users/jaraco/code/public/cpython/Lib/test/test_importlib', '/Users/jaraco/code/public/cpython/Lib/test/test_importlib'])
test test.test_importlib failed
ok
======================================================================
ERROR: test_contents (test.test_importlib.test_abc.Frozen_ResourceReaderDefaultsTests)
----------------------------------------------------------------------
Traceback (most recent call last):
File "/Users/jaraco/code/public/cpython/Lib/test/test_importlib/test_abc.py", line 341, in test_contents
self.assertEqual([], list(self.ins.contents()))
File "/Users/jaraco/code/public/cpython/Lib/test/test_importlib/test_abc.py", line 321, in contents
return super().contents(*args, **kwargs)
File "/Users/jaraco/code/public/cpython/Lib/importlib/abc.py", line 339, in contents
raise FileNotFoundError
FileNotFoundError
======================================================================
ERROR: test_contents (test.test_importlib.test_abc.Source_ResourceReaderDefaultsTests)
----------------------------------------------------------------------
Traceback (most recent call last):
File "/Users/jaraco/code/public/cpython/Lib/test/test_importlib/test_abc.py", line 341, in test_contents
self.assertEqual([], list(self.ins.contents()))
File "/Users/jaraco/code/public/cpython/Lib/test/test_importlib/test_abc.py", line 321, in contents
return super().contents(*args, **kwargs)
File "/Users/jaraco/code/public/cpython/Lib/importlib/abc.py", line 339, in contents
raise FileNotFoundError
FileNotFoundError
======================================================================
ERROR: test_package_has_no_reader_fallback (test.test_importlib.test_resource.ResourceCornerCaseTests)
----------------------------------------------------------------------
Traceback (most recent call last):
File "/Users/jaraco/code/public/cpython/Lib/test/test_importlib/test_resource.py", line 98, in test_package_has_no_reader_fallback
self.assertFalse(resources.is_resource(module, 'A'))
File "/Users/jaraco/code/public/cpython/Lib/importlib/resources.py", line 157, in is_resource
package_contents = set(contents(package))
File "/Users/jaraco/code/public/cpython/Lib/importlib/resources.py", line 174, in contents
transversable = _common.from_package(package)
File "/Users/jaraco/code/public/cpython/Lib/importlib/_common.py", line 75, in from_package
reader = spec.loader.get_resource_reader(spec.name)
AttributeError: 'object' object has no attribute 'get_resource_reader'
======================================================================
ERROR: test_is_submodule_resource (test.test_importlib.test_resource.ResourceFromNamespaceTest01)
----------------------------------------------------------------------
Traceback (most recent call last):
File "/Users/jaraco/code/public/cpython/Lib/test/test_importlib/test_resource.py", line 225, in test_is_submodule_resource
resources.is_resource(import_module('namespacedata01'), 'binary.file')
File "/Users/jaraco/code/public/cpython/Lib/importlib/resources.py", line 157, in is_resource
package_contents = set(contents(package))
File "/Users/jaraco/code/public/cpython/Lib/importlib/resources.py", line 174, in contents
transversable = _common.from_package(package)
File "/Users/jaraco/code/public/cpython/Lib/importlib/_common.py", line 75, in from_package
reader = spec.loader.get_resource_reader(spec.name)
AttributeError: '_NamespaceLoader' object has no attribute 'get_resource_reader'
======================================================================
ERROR: test_read_submodule_resource_by_name (test.test_importlib.test_resource.ResourceFromNamespaceTest01)
----------------------------------------------------------------------
Traceback (most recent call last):
File "/Users/jaraco/code/public/cpython/Lib/test/test_importlib/test_resource.py", line 229, in test_read_submodule_resource_by_name
self.assertTrue(resources.is_resource('namespacedata01', 'binary.file'))
File "/Users/jaraco/code/public/cpython/Lib/importlib/resources.py", line 157, in is_resource
package_contents = set(contents(package))
File "/Users/jaraco/code/public/cpython/Lib/importlib/resources.py", line 174, in contents
transversable = _common.from_package(package)
File "/Users/jaraco/code/public/cpython/Lib/importlib/_common.py", line 75, in from_package
reader = spec.loader.get_resource_reader(spec.name)
AttributeError: '_NamespaceLoader' object has no attribute 'get_resource_reader'
======================================================================
ERROR: test_submodule_contents (test.test_importlib.test_resource.ResourceFromNamespaceTest01)
----------------------------------------------------------------------
Traceback (most recent call last):
File "/Users/jaraco/code/public/cpython/Lib/test/test_importlib/test_resource.py", line 232, in test_submodule_contents
contents = set(resources.contents(import_module('namespacedata01')))
File "/Users/jaraco/code/public/cpython/Lib/importlib/resources.py", line 174, in contents
transversable = _common.from_package(package)
File "/Users/jaraco/code/public/cpython/Lib/importlib/_common.py", line 75, in from_package
reader = spec.loader.get_resource_reader(spec.name)
AttributeError: '_NamespaceLoader' object has no attribute 'get_resource_reader'
======================================================================
ERROR: test_submodule_contents_by_name (test.test_importlib.test_resource.ResourceFromNamespaceTest01)
----------------------------------------------------------------------
Traceback (most recent call last):
File "/Users/jaraco/code/public/cpython/Lib/test/test_importlib/test_resource.py", line 240, in test_submodule_contents_by_name
contents = set(resources.contents('namespacedata01'))
File "/Users/jaraco/code/public/cpython/Lib/importlib/resources.py", line 174, in contents
transversable = _common.from_package(package)
File "/Users/jaraco/code/public/cpython/Lib/importlib/_common.py", line 75, in from_package
reader = spec.loader.get_resource_reader(spec.name)
AttributeError: '_NamespaceLoader' object has no attribute 'get_resource_reader'
----------------------------------------------------------------------
Ran 1386 tests in 1.778s
FAILED (errors=7, skipped=18, expected failures=1)
1 test failed again:
test.test_importlib
== Tests result: FAILURE then FAILURE ==
1 test failed:
test.test_importlib
1 re-run test:
test.test_importlib
Total duration: 4.1 sec
Tests result: FAILURE then FAILURE
Sign up for free to join this conversation on GitHub. Already have an account? Sign in to comment
You can’t perform that action at this time.